##TITLE=$$ Begin of the data block
##JCAMP-DX=5.00 $$ ACD/SpecManager v 10.08
##SPECTROMETER/DATA SYSTEM=16PC
##DATE=25 Jun 2013 14:49:04
##DATA TYPE=INFRARED SPECTRUM
##DATA CLASS=XYDATA
##ORIGIN=
##OWNER=
##NPOINTS=3601
##FIRSTX=400.00000000
##LASTX=4000.00000000
##MAXX=4000.00000000
##MINX=400.00000000
##MAXY=38.87558746
##MINY=4.57317924
##XFACTOR=1.0000000000
##YFACTOR=0.000000100000000
##FIRSTY=15.72505569
##DELTAX=1.00000000
##XUNITS=1/CM
##YUNITS=TRANSMITTANCE
##XYDATA=(X++(Y..Y))
400 157250557 195417080 222467098 236419411 239598866 236919727 233310528 231711617 232537365
408 232537365 234519348 236107903 236508923 235908661 235057106 234703503 235278263 236879768 239377575
417 239377575 242451172 245562191 248000050 249102840 248577442 246708126 244280453 242234039 241248016
426 241248016 241495705 242675934 244237957 245624943 246412239 246341591 245333748 243530369 241324005
435 241324005 239286709 237962875 237612667 238070374 238836956 239371433 239403782 239062233 238731098 238739681
445 238739681 239099598 239471626 239382133 238535805 237008076 235186424 233503399 232145424 230936699
454 230936699 229481678 227475357 224981117 222490673 220718250 220244598 221220608 223301811 225844669
463 225844669 228239784 230186329 231760368 233266373 234988594 237004108 239159679 241197948 242932167
472 242932167 244352589 245613155 246925793 248439255 250167027 251986694 253691006 255059528 255928040
481 255928040 256242809 256086292 255656261 255192890 254876537 254746952 254695892 254545460 254170780 253591518
491 253591518 252974167 252543488 252459164 252735157 253244534 253799496 254251537 254558563 254793911 255109501
501 255109501 255679607 256643524 258053551 259833088 261762180 263511658 264733906 265183754 264818039
510 264818039 263821774 262543449 261369095 260594063 260346127 260581093 261133976 261790733 262351322 262672462
520 262672462 262689590 262422638 261963749 261448822 261019325 260789337 260829926 261171532 261812611 262721558
530 262721558 263827152 265009193 266103325 266930027 267337952 267245770 266664047 265693016 264500542 263286533
540 263286533 262238712 261480942 261027184 260759811 260454407 259854813 258772717 257165928 255154324
549 255154324 252963295 250826035 248898773 247230911 245798187 244563217 243520107 242692184 242091465
558 242091465 241674156 241327915 240901833 240261154 239332027 238110943 236638680 234961777 233110638
567 233110638 231109562 229009132 226915512 224988079 223393631 222233829 221478310 220942879 220330715
576 220330715 219329205 217724724 215487900 212793026 209962769 207359428 205266476 203804531 202911568
585 202911568 202391262 202007809 201590652 201108322 200682106 200537090 200911503 201964397 203719749 206066837
595 206066837 208805466 211710758 214587059 217301579 219800529 222116356 224363327 226708336 229309521
604 229309521 232239494 235432358 238695736 241793785 244561920 246983051 249175301 251296177 253425636
613 253425636 255506706 257382698 258901329 260013199 260796318 261397514 261939831 262464581 262943134
622 262943134 263338242 263657131 263952618 264273262 264605293 264855537 264892635 264621201 264043999 263278389
632 263278389 262523499 261999817 261885033 262263145 263092899 264203472 265326557 266166382 266491776 266214199
642 266214199 265414829 264304428 263134918 262104130 261298294 260694370 260213223 259792976 259442959 259247360
652 259247360 259311390 259671135 260218906 260702133 260823460 260410099 259556179 258630371 258101387 258250923
662 258250923 258937550 259580727 259417095 257914429 255108814 251657372 248557930 246686687 246413307
671 246413307 247498856 249302731 251145630 252605972 253603687 254283028 254823170 255317383 255775108
680 255775108 256196938 256630440 257152138 257798939 258516865 259177513 259654217 259899006 259964695 259959221 259971447
691 259971447 260022144 260069027 260053425 259949265 259781818 259611740 259503193 259498940 259613400 259839020 260154839
702 260154839 260532017 260934792 261321411 261646729 261868114 261955585 261905804 261753674 261571198 261443195
712 261443195 261424980 261502304 261583805 261543159 261299706 260896893 260530910 260505486 261126156 262582626 264872875
723 264872875 267798958 271031113 274207859 277032604 279337845 281102200 282424736 283466015 284377975
732 284377975 285247288 286074085 286795788 287342834 287695866 287913113 288112030 288416119 288898354 289550667
742 289550667 290292625 291010742 291605968 292028160 292288456 292451344 292612343 292868977 293289623 293890266
752 293890266 294627705 295416603 296164341 296809063 297340412 297794437 298225918 298676968 299157448 299644737
762 299644737 300093784 300449066 300651035 300643845 300389481 299889889 299203949 298445587 297756176 297264633
772 297264633 297056751 297172089 297626381 298437424 299629688 301208954 303123226 305241547 307372513
781 307372513 309319401 310942860 312196236 313115540 313775806 314241753 314540367 314660549 314567604 314213753
791 314213753 313537903 312466583 310929089 308894863 306416702 303653622 300850868 298274460 296122570
800 296122570 294449120 293132172 291902962 290426102 288404999 285674229 282246265 278296642 274096947
809 274096947 269929276 266021709 262531738 259572906 257254581 255696869 255006847 255231895 256331005
818 256331005 258190994 260681877 263711319 267234993 271211605 275536842 280014210 284400101 288507900
827 288507900 292305222 295935841 299640007 303614216 307893028 312322903 316640568 320603981 324095840
836 324095840 327145500 329868317 332371254 334683151 336742210 338432045 339635353 340271988 340312538
845 340312538 339771690 338694191 337139397 335164108 332807732 330087509 327012329 323616829 319995880
854 319995880 316320305 312814674 309704247 307154388 305232010 303903446 303065071 302586575 302348690
863 302348690 302270088 302324924 302556591 303080978 304069176 305701866 308105717 311295376 315149212 319433231
873 319433231 323862305 328170853 332163582 335732307 338844681 341521454 343818626 345814590 347598915
882 347598915 349256210 350848465 352404938 353928452 355413246 356861839 358288078 359703979 361101799
891 361101799 362449608 363705788 364846191 365880775 366847420 367782364 368691025 369539948 370279579
900 370279579 370882378 371367950 371794853 372223701 372675552 373118019 373488579 373739586 373873634 373943596
910 373943596 374016609 374127579 374252014 374316483 374237518 373965225 373506279 372919388 372289276 371696777 371194382
921 371194382 370793190 370458488 370118179 369685211 369094009 368335724 367474823 366628342 365911980 365378571
931 365378571 364981842 364591751 364056091 363276634 362259140 361108932 359977150 358986626 358178291 357505112
941 357505112 356871681 356196747 355464363 354737511 354130287 353753281 353660164 353819275 354121742 354418869
951 354418869 354569626 354476280 354099312 353452911 352592545 351604919 350599442 349695015 348995628 348559875
961 348559875 348378906 348379555 348454361 348505173 348474426 348348503 348134575 347833176 347427635 346899490 346254730
972 346254730 345536919 344812851 344137840 343523903 342934265 342307777 341596680 340792351 339922943 339028664
982 339028664 338132401 337225304 336273346 335237541 334096375 332858582 331563110 330264893 329009590
991 329009590 327805710 326605873 325311890 323806381 321998520 319855843 317403164 314687538 311737366
1000 311737366 308541965 305059109 301222420 296914330 291903934 285808487 278168621 268689442 257589417
1009 257589417 245883598 235389061 228336811 226674461 231334286 241807652 256245594 272057590
1017 272057590 286742115 298583069 306943951 312112045 314862614 316005077 316114826 315500832 314323235
1026 314323235 312723198 310875092 308954353 307078018 305275650 303511639 301734047 299914303 298055935
1035 298055935 296180992 294314175 292479973 290709381 289043007 287520027 286157360 284931412 283777409
1044 283777409 282608166 281345863 279950333 278432884 276849518 275277615 273785419 272407513 271136379
1053 271136379 269934330 268760700 267600079 266475258 265436478 264530373 263766346 263100586 262449894
1062 262449894 261729774 260897408 259975605 259045124 258207989 257542057 257067566 256740799 256471977 256153927
1072 256153927 255683727 254969578 253924389 252457790 250477219 247899570 244666786 240753212 236157570
1081 236157570 230885124 224933758 218298912 211004677 203152733 194969749 186830940 179244080 172791004
1090 172791004 168038273 165435028 165224247 167386646 171635227 177462730 184231968 191285400 198043518
1099 198043518 204069099 209088955 212981014 215747032 217486362 218376904 218656731 218597546 218464584
1108 218464584 218472290 218747768 219315987 220107613 220985184 221776199 222307568 222437668 222085476 221250839
1118 221250839 220015850 218521309 216919956 215324173 213771381 212226162 210618172 208898506 207082806
1127 207082806 205260410 203564720 202124043 201017647 200260048 199815388 199628849 199655895 199874191
1136 199874191 200278606 200868492 201638699 202580070 203686314 204960155 206413727 208063030 209922237
1145 209922237 212001133 214307556 216851921 219649334 222718086 226074257 229724808 233659210 237841854
1154 237841854 242205849 246653614 251068306 255335960 259372387 263142166 266658401 269959812 273076420
1163 273076420 275999374 278672924 281013031 282943649 284432945 285510826 286261768 286797504 287224178
1172 287224178 287618351 288021431 288450489 288917713 289446583 290075626 290845699 291776962 292843742 293961105
1182 293961105 294989548 295759850 296109009 295917606 295137463 293802605 292022343 289957314 287782402
1191 287782402 285644684 283628616 281742496 279934292 278134117 276305218 274477692 272747936 271241837
1200 271241837 270061874 269247780 268771896 268570786 268593178 268836441 269351807 270216999 271491642 273178673
1210 273178673 275207253 277441177 279705315 281818218 283620625 284994373 285872326 286238346 286121597
1219 286121597 285585690 284714127 283593788 282299137 280879440 279355030 277723827 275978413 274126244
1228 274126244 272204113 270278244 268429947 266733208 265234489 263944073 262839756 261881199 261027775
1237 261027775 260256119 259574108 259027481 258693256 258657894 258983231 259675255 260671730 261859703 263117371
1247 263117371 264360600 265569572 266782398 268058739 269434452 270887966 272333336 273638039 274657898
1256 274657898 275275536 275433140 275149670 274517498 273674355 272758369 271863785 271019268 270200024 269368992
1266 269368992 268519859 267696152 266973534 266417484 266045704 265821095 265679512 265574684 265510483 265542011
1276 265542011 265746422 266182728 266861420 267737103 268720512 269700375 270566730 271231098 271642990 271799564
1286 271799564 271744366 271551743 271300068 271044788 270803032 270556469 270269451 269912472 269480286 268997402
1296 268997402 268510284 268070736 267716484 267456818 267268143 267103939 266914463 266669064 266369324 266046219
1306 266046219 265743217 265495987 265320187 265212593 265161037 265153694 265180054 265225391 265267143 265280132 265250072
1317 265250072 265184879 265111580 265057335 265023212 264969025 264822044 264508419 263989449 263281937 262448902 261565895
1328 261565895 260682106 259798183 258870201 257834282 256634159 255237274 253635960 251841812 249883041
1337 249883041 247807102 245680008 243571568 241526623 239536381 237532024 235411072 233088856 230542431
1346 230542431 227822113 225020370 222220554 219460106 216732082 214019032 211328659 208700638 206177044
1355 206177044 203761559 201402397 199018612 196555824 194034958 191561203 189288750 187365952 185893764
1364 185893764 184915886 184432526 184418068 184830036 185612278 186704826 188064060 189681396 191583099
1373 191583099 193805447 196361389 199225082 202347031 205686779 209232426 212985840 216922607 220962677
1382 220962677 224984913 228888187 232660542 236405125 240293446 244465237 248927917 253511581 257902088
1391 257902088 261732674 264690990 266601944 267466373 267455654 266871758 266083374 265452461 265269623 265715904
1401 265715904 266857643 268663483 271025829 273775787 276701775 279588871 282281532 284741802 287056065
1410 287056065 289360962 291713238 293978291 295819836 296823425 296700745 295463047 293461132 291259480
1419 291259480 289407158 288219357 287672634 287451019 287108955 286271687 284790764 282797623 280635166
1428 280635166 278691845 277203579 276114674 275078983 273619881 271381111 268335743 264829750 261427135
1437 261427135 258642044 256712399 255537949 254794617 254128304 253301086 252224998 250919781 249475613
1446 249475613 248065395 246963158 246481800 246796284 247733765 248696556 248840103 247469807 244445534
1455 244445534 240330467 236152897 232888279 230958462 230048809 229350967 228071537 225888138 223079414
1464 223079414 220273781 218002491 216347523 214892578 212979584 210089741 206112556 201363506 196373425
1473 196373425 191599121 187223816 183136082 179059963 174732780 170024529 164944687 159561872 153905220
1482 153905220 147923164 141536722 134769506 127890167 121484928 116397905 113528280 113538237 116581011
1491 116581011 122166281 129244576 136503525 142774162 147381668 150285673 151944418 152968206 153740015
1500 153740015 154201012 153915720 152375088 149361115 145158424 140486813 136194096 132885828 130699215
1509 130699215 129331198 128273792 127098379 125622740 123894920 122050276 120165071 118203497 116070433
1518 116070433 113706656 111149130 108523321 105989294 103689241 101720896 100131378 98910666 97982054
1527 97982054 97211695 96457272 95644836 94825649 94160337 93821688 93868313 94171734 94454355 94424410
1537 94424410 93929348 93038635 92013168 91189194 90846691 91126213 92014637 93382168 95041256 96809006
1547 96809006 98567581 100306778 102123890 104155941 106458473 108892641 111102018 112626572 113117466
1556 113117466 112541752 111253004 109867630 108998442 108981819 109740486 110851316 111775093 112123508 111829138
1566 111829138 111143923 110482721 110202875 110432701 111030264 111682796 112089109 112123756 111896114 111672087
1576 111672087 111705236 112074261 112620440 113020697 112948160 112226391 110891562 109141150 107217340 105302877
1586 105302877 103483744 101776190 100176525 98690243 97329884 96102858 95013113 94078274 93341351
1595 93341351 92854385 92640791 92665195 92840071 93068533 93291235 93499546 93709393 93925476 94138775
1605 94138775 94368324 94712086 95350704 96476278 98181190 100381260 102839050 105280886 107534304
1614 107534304 109590883 111550636 113488588 115337753 116872892 117802591 117908678 117143059 115634155
1623 115634155 113616772 111344442 109031162 106830626 104825935 103007736 101248798 99313135 96927519
1632 96927519 93902016 90240583 86173534 82081490 78342280 75179090 72587738 70376139 68291268
1641 68291268 66162758 63991675 61943436 60250516 59075565 58401909 58009796 57558231 56738019
1650 56738019 55423703 53741307 52009835 50580230 49655862 49195375 48951941 48626084 48039737
1659 48039737 47230792 46417022 45862064 45731792 46029429 46639152 47435837 48380699 49539537 51020317
1669 51020317 52882419 55087533 57528219 60114131 62852869 65863810 69305553 73255677 77614980
1678 77614980 82100639 86344223 90050058 93134785 95773916 98329239 101192379 104623137 108660030
1687 108660030 113141575 117814665 122462921 126981306 131363850 135625257 139720659 143526125 146900835
1696 146900835 149794760 152327976 154780998 157483730 160660553 164318542 168249683 172153931 175818024
1705 175818024 179249458 182684307 186458206 190803661 195680275 200731087 205395050 209131680 211657715
1714 211657715 213090248 213926373 214860878 216514111 219184608 222740231 226703739 230499802 233743267
1723 233743267 236416740 238833046 241394081 244280930 247265205 249774895 251199226 251265068 250255852
1732 250255852 248927727 248153992 248499584 249972534 252094307 254234447 255997257 257427120 258921528
1741 258921528 260929241 263635120 266826057 270006313 272674351 274588928 275877304 276946564 278271313
1750 278271313 280181026 282747746 285800858 289032688 292126541 294851685 297103119 298895264 300334263
1759 300334263 301590633 302877502 304420376 306401672 308878307 311703587 314509144 316793232 318110867
1768 318110867 318289776 317556057 316481743 315758419 315905018 317064190 318988895 321210098 323271523
1777 323271523 324896049 326019630 326725235 327165680 327535515 328072929 329025726 330543060 332537651
1786 332537651 334632912 336280518 337026749 336784630 335930786 335144539 335063400 335955048 337596817 339426804
1796 339426804 340862045 341593323 341699028 341546936 341571999 342068748 343092880 344488335 345991287
1805 345991287 347347679 348399734 349121971 349605980 350003395 350451584 351018639 351696053 352441978 353238792
1815 353238792 354117661 355129204 356282616 357510605 358694611 359734344 360603523 361339188 361971321
1824 361971321 362457542 362692299 362601013 362247429 361858978 361726189 362036209 362764397 363712730 364675751
1834 364675751 365605469 366638031 367946167 369521141 371057854 372056046 372095985 371115913 369504051
1843 369504051 367933846 367038383 367119026 368049507 369407425 370727921 371722870 372358170 372782593 373187714
1853 373187714 373691139 374296341 374927635 375501518 375990181 376446381 376976776 377672386 378527222 379392815
1863 379392815 380010338 380123978 379623985 378638458 377505112 376627502 376288986 376532822 377174492 377929802
1873 377929802 378570480 379013710 379303589 379525032 379724388 379893494 380010681 380088921 380178604 380323219
1883 380323219 380508156 380652962 380660553 380486794 380174065 379819756 379502907 379226036 378919067 378502083
1893 378502083 377957268 377351799 376792603 376347427 375994873 375643692 375208931 374686813 374170113 373790321
1903 373790321 373630371 373672905 373824806 374000549 374198990 374513130 375059929 375877571 376865959 377818565
1913 377818565 378529320 378908005 379026756 379068947 379216309 379546967 380009499 380481148 380865250 381161232
1923 381161232 381462517 381890793 382511559 383285179 384081001 384740448 385154648 385315399 385317955 385319672 385473557
1934 385473557 385862846 386463852 387149353 387736664 388061562 388047791 387740517 387286682 386870613 386639137
1944 386639137 386648712 386860008 387173309 387480888 387708168 387828369 387853394 387814522 387746773 387680969 387641754
1955 387641754 387644806 387694206 387779274 387875977 387952690 387978668 387933769 387816048 387646141 387465668 387327156
1966 387327156 387276955 387335968 387488022 387683334 387858925 387965698 387991219 387964516 387940483 387970963 388077583
1977 388077583 388238869 388400154 388501358 388509789 388440666 388352013 388315887 388376923 388522568 388681602 388755875
1988 388755875 388669167 388407974 388031540 387646675 387361946 387244835 387302284 387488823 387731476 387956848
1998 387956848 388108330 388153801 388086433 387923393 387701645 387469559 387274399 387150040 387110214 387148628 387242928
2009 387242928 387359047 387455139 387488174 387426872 387268600 387047462 386827621 386675835 386628227 386668968 386737213
2020 386737213 386760406 386695671 386554222 386395149 386290512 386284561 386369591 386491585 386579514 386581650 386487694
2031 386487694 386327896 386153069 386007614 385910034 385848389 385790710 385702705 385564804 385380287 385173073 384976807
2042 384976807 384821701 384724388 384684143 384686508 384709625 384731712 384735413 384709740 384650650 384561501 384453812 384347076
2054 384347076 384265556 384231758 384256859 384332237 384427071 384495354 384493217 384398575 384224319 384016457 383834648
2065 383834648 383724861 383697662 383724213 383753166 383738823 383663254 383542633 383412590 383304939 383228722 383166580
2076 383166580 383086662 382961769 382784081 382569962 382352524 382169571 382050476 382008362 382037468 382116394 382215004
2087 382215004 382303543 382360115 382374763 382348404 382287979 382200966 382092094 381963387 381816521 381656265 381491547
2098 381491547 381336441 381207809 381122780 381092300 381115379 381174812 381238670 381269836 381240654 381144867 381001511
2109 381001511 380845909 380712700 380618820 380556717 380500565 380422249 380307961 380166626 380026207 379920158 379871864
2120 379871864 379884529 379939880 380005264 380044022 380026283 379934807 379767456 379537811 379272614 379007607 378781090
2131 378781090 378624496 378553696 378563232 378627472 378708458 378767433 378775787 378722534 378615227 378477287 378341713
2142 378341713 378241348 378198433 378214302 378265038 378306999 378294144 378199730 378031578 377832642 377662354 377568665
2153 377568665 377565346 377625465 377695885 377722473 377673569 377549934 377379570 377202911 377056465 376962357 376922989
2164 376922989 376921539 376925812 376897850 376808090 376650543 376449928 376255913 376122131 376078911 376116028 376183548
2175 376183548 376215248 376160431 376008453 375792274 375568504 375388451 375274010 375212822 375171661 375118141 375035362
2186 375035362 374924545 374794693 374652977 374501953 374345932 374199295 374085960 374027672 374026985 374057465 374070396
2197 374070396 374017754 373876801 373663712 373425903 373218727 373080750 373021317 373025017 373065872 373120499 373172646
2208 373172646 373209305 373215790 373178215 373089828 372958145 372803345 372648849 372507591 372374992 372233086 372064095
2219 372064095 371864777 371653137 371462555 371325912 371259155 371251755 371269646 371270065 371220284 371112099 370963974
2230 370963974 370810204 370681610 370589561 370522194 370455360 370371819 370275726 370192451 370153427 370174904 370245056
2241 370245056 370327835 370380821 370376511 370312843 370209351 370092773 369983635 369891663 369819794 369770851 369749565
2252 369749565 369757805 369789085 369826660 369850807 369847755 369816551 369766693 369708786 369645958 369571190 369473724 369348183
2264 369348183 369200439 369045105 368896408 368758965 368625717 368482933 368318787 368129463 367920685 367703476
2274 367703476 367492256 367305679 367168770 367111664 367159920 367319717 367566452 367846146 368092041 368250084
2284 368250084 368299904 368259048 368169785 368076897 368008804 367971840 367956886 367950401 367942467 367930222 367918510 367920990
2296 367920990 367961464 368071671 368281860 368607559 369038582 369538727 370054321 370528526 370911713 371167908
2306 371167908 371281281 371266441 371181335 371130142 371243477 371631966 372328033 373243599 374172211 374845543
2316 374845543 375027733 374613304 373683205 372490578 371371155 370607719 370304985 370334435 370387688 370123787
2326 370123787 369345207 368107147 366694489 365470047 364678917 364325638 364196243 364002342 363537102
2335 363537102 362728119 361555214 359919815 357614975 354483376 350706406 347023277 344667854 344957008
2344 344957008 348685684 355646019 364558716 373493919 380585861 384684448 385632210 384081268 381015587
2353 381015587 377276039 373324242 369294662 365207253 361147690 357302475 353862457 350906715 348366394
2362 348366394 346094017 343975334 342001495 340257835 338850708 337834167 337185478 336832466 336704979
2371 336704979 336768684 337028198 337508965 338237991 339235039 340508347 342048340 343814621 345727730
2380 345727730 347674294 349530296 351190300 352589226 353707047 354557724 355174255 355596466 355866394
2389 355866394 356024628 356106300 356135025 356120491 356062202 355960121 355825386 355685768 355581131 355549965 355614090
2400 355614090 355766144 355967560 356158409 356278076 356288490 356191635 356030045 355869789 355770607 355758934 355815239
2411 355815239 355884972 355905685 355837212 355680275 355474014 355277138 355140991 355088959 355108566 355158768 355186310
2422 355186310 355145493 355012970 354794884 354525108 354254837 354037971 353914070 353896561 353966141 354075165
2432 354075165 354160347 354162102 354044685 353808823 353493271 353161392 352878494 352688675 352599716 352582893 352586594
2443 352586594 352557182 352457695 352277641 352031288 351748543 351462402 351199379 350974998 350792618 350645561
2453 350645561 350519295 350393486 350246048 350058479 349823112 349548874 349260712 348992157 348770943 348605080
2463 348605080 348477325 348352928 348196869 347993279 347752647 347504158 347276077 347077255 346892357 346694221
2473 346694221 346465874 346215935 345976601 345783615 345651932 345563202 345475197 345347023 345165367 344953308
2483 344953308 344755898 344612312 344531860 344490013 344445572 344368172 344256401 344136658 344043159 343993835 343977623
2494 343977623 343960991 343909149 343806610 343665771 343518066 343395233 343312454 343262634 343223877 343172874 343096657
2505 343096657 342996330 342882805 342769470 342665558 342573662 342490234 342408829 342323189 342229843 342129364 342025223
2516 342025223 341920853 341817093 341711731 341602592 341492462 341390839 341309891 341255112 341216354 341167526 341077232
2527 341077232 340927467 340728149 340517044 340342522 340237160 340197487 340183258 340136986 340013847 339804573
2537 339804573 339538345 339265556 339032021 338858185 338735657 338638573 338541145 338429718 338302956 338165054
2547 338165054 338016930 337853851 337670631 337467918 337255287 337046165 336848755 336659431 336463852 336245613
2557 336245613 335998802 335734520 335478172 335258102 335092812 334983406 334915848 334869690 334827461 334778595 334717064
2568 334717064 334636497 334527740 334381218 334193115 333969650 333725967 333480072 333245697 333028564 332828064
2578 332828064 332642250 332471581 332318611 332184181 332064514 331951485 331838036 331724281 331619606 331538277
2588 331538277 331490517 331472626 331464119 331433182 331349792 331201134 331001091 330788422 330612717 330512314 330494766
2599 330494766 330529976 330561371 330532417 330415192 330227394 330025406 329876785 329825478 329868965 329959259 330027046
2610 330027046 330014687 329899216 329695854 329443474 329184494 328951454 328765182 328638458 328577194 328575020 328606224
2621 328606224 328626556 328586807 328455276 328235245 327966652 327707977 327508583 327388000 327332268 327308083 327283325
2632 327283325 327240906 327179565 327103271 327011681 326897049 326750717 326571388 326369438 326162033 325964203 325781631
2643 325781631 325610504 325443687 325278511 325120087 324978256 324860001 324762039 324669571 324560089 324412460
2653 324412460 324216309 323977585 323719177 323475609 323283386 323169823 323143425 323189201 323270912 323341904 323359413
2664 323359413 323300438 323169289 322994537 322814560 322658501 322532196 322417793 322287674 322126160 321944237
2674 321944237 321779213 321675835 321659622 321718521 321803436 321848984 321802826 321647987 321406517 321126099 320858307
2685 320858307 320641136 320492058 320409813 320379448 320377235 320374641 320344467 320269699 320150223 320001450 319844265
2696 319844265 319690056 319531727 319347954 319120045 318849392 318564072 318307095 318113785 317991619 317915535
2706 317915535 317842388 317734280 317576199 317378788 317165432 316955338 316753349 316552162 316341743 316118507
2716 316118507 315886497 315652180 315417881 315180855 314939117 314698296 314474297 314286671 314147491 314052200
2726 314052200 313978767 313896694 313779869 313616886 313411503 313176746 312925720 312665958 312400436 312132454
2736 312132454 311870670 311628933 311422768 311262207 311147137 311066341 311001053 310930023 310834789 310703144 310530376
2747 310530376 310319099 310077896 309818535 309553394 309293137 309046021 308817883 308613434 308435555 308283997
2757 308283997 308152809 308030281 307901821 307756805 307595940 307434158 307297554 307212238 307191410 307225456
2767 307225456 307282162 307317047 307290096 307182426 307003632 306787090 306576099 306406212 306293755 306233025 306203079
2778 306203079 306178436 306137867 306068764 305967197 305836754 305688248 305539856 305414677 305334511 305310955 305338459
2789 305338459 305394115 305445385 305463066 305432720 305358963 305261116 305163517 305085793 305037174 305015926 305012169 305011959
2801 305011959 305000420 304965057 304898014 304797192 304665508 304507484 304325981 304121418 303894939 303654556
2811 303654556 303419514 303219032 303084011 303034382 303068295 303158836 303259850 303320580 303302383 303192539 303008995
2822 303008995 302794876 302603016 302476425 302431126 302448940 302484837 302485352 302411919 302256851 302045479 301823330
2833 301823330 301634541 301503658 301428204 301384754 301343803 301284790 301203117 301108322 301013947 300927467 300843925
2844 300843925 300747833 300620575 300449905 300235538 299988384 299722881 299448280 299162693 298855476 298515873
2854 298515873 298143044 297751331 297365990 297012501 296704903 296440430 296202126 295967789 295718365 295442543
2864 295442543 295136089 294799347 294436665 294056835 293673210 293301048 292952404 292631893 292337399 292065315
2874 292065315 291816902 291598644 291416149 291263638 291117916 290942822 290703735 290384369 289997234 289579449
2884 289579449 289177132 288825779 288536530 288294582 288067951 287821255 287528152 287178078 286777554 286346664
2894 286346664 285913582 285508060 285155106 284869175 284651031 284486752 284351044 284213161 284046021 283835678
2904 283835678 283588486 283330898 283101101 282932491 282837200 282795677 282760124 282671700 282483559 282180004 281782360
2915 281782360 281339092 280905819 280523624 280205956 279937630 279685936 279418240 279117680 278792000 278470230
2925 278470230 278189316 277975616 277831573 277732449 277636642 277504864 277317486 277083397 276835365 276616325
2935 276616325 276462002 276387844 276382904 276411247 276421013 276359253 276189556 275907078 275542870 275152531 274791946
2946 274791946 274491673 274243355 274007263 273736210 273400650 272999554 272550545 272068710 271550255 270973988
2956 270973988 270319214 269586964 268807220 268028431 267294312 266627026 266026192 265483513 264998817 264585953
2966 264585953 264262772 264035988 263891621 263801308 263737717 263688469 263658085 263657417 263690548 263750362 263825741 263914413
2978 263914413 264030304 264197235 264434280 264741650 265097828 265469875 265828037 266156063 266449451 266706944
2988 266706944 266922550 267086067 267190952 267243385 267263107 267274876 267295151 267322617 267339935 267324619 267262554
2999 267262554 267155056 267015629 266859932 266695480 266517429 266312714 266068516 265779896 265452957 265102215
3009 265102215 264744530 264392433 264049034 263705788 263343697 262939644 262475109 261945534 261364975 260762444
3019 260762444 260170918 259612980 259091034 258588009 258077793 257539978 256969719 256378803 255787563 255215015
3029 255215015 254673195 254168968 253709297 253303738 252960033 252675800 252431946 252195816 251933765 251625767
3039 251625767 251273537 250895329 250509872 250120373 249709454 249249783 248724442 248144360 247551365 247003860
3049 247003860 246552505 246219349 245991135 245828228 245682182 245512867 245295982 245022888 244695568 244323444
3059 244323444 243922062 243512058 243115883 242750950 242423878 242129612 241856251 241594524 241343651 241111813
3069 241111813 240909271 240739632 240594444 240453873 240291977 240082474 239802723 239434986 238967991 238399773
3079 238399773 237741890 237021427 236277370 235551090 234874668 234261436 233704185 233180408 232662430 232127151
3089 232127151 231562328 230967522 230351086 229724808 229098949 228478508 227862415 227246189 226626453 226006584
3099 226006584 225399227 224825516 224309044 223867626 223506832 223216724 222975597 222757645 222541294 222315254
3109 222315254 222078457 221835556 221589184 221334534 221058350 220742664 220371952 219938660 219445782 218905602
3119 218905602 218337078 217763290 217208595 216694813 216234131 215822182 215434265 215031242 214573708 214038124
3129 214038124 213426228 212761421 212072926 211379814 210684071 209977665 209256935 208532887 207827187 207157459
3139 207157459 206522369 205900116 205262699 204596386 203913269 203242168 202606182 202001324 201395473 200749702
3149 200749702 200049267 199321938 198628788 198031330 197554760 197172642 196821442 196438217 195995350 195513229
3159 195513229 195042801 194631310 194292126 193996849 193690815 193322582 192868004 192337570 191765862 191191044
3169 191191044 190636024 190100422 189564724 189002361 188392658 187729416 187022133 186290722 185556850 184835339
3179 184835339 184129086 183429184 182719479 181984749 181218605 180430069 179643173 178891315 178204117 177592926
3189 177592926 177040348 176500759 175913544 175226326 174418373 173513241 172573643 171679115 170896149 170252972
3199 170252972 169731846 169280224 168836479 168358002 167838020 167305145 166805611 166377926 166032200 165744038
3209 165744038 165465260 165145264 164751701 164280148 163749390 163188248 162622490 162069778 161542702 161054401
3219 161054401 160618057 160239258 159905157 159580412 159215450 158765497 158209915 157560682 156854496 156133633
3229 156133633 155425911 154735699 154048138 153342056 152601357 151820154 150999241 150140839 149245939 148316164
3239 148316164 147356653 146377125 145388203 144395971 143399286 142392454 141370869 140336351 139296408
3248 139296408 138258085 137219124 136164675 135071621 133921194 132712145 131467419 130228233 129037170
3257 129037170 127918682 126867228 125849648 124822769 123755798 122646503 121520939 120417347 119362288
3266 119362288 118353682 117360773 116341467 115267487 114142799 113004627 111906681 110892954 109977713
3275 109977713 109139891 108334475 107512579 106640511 105709982 104737015 103753986 102799435 101907997 101103392
3285 101103392 100392933 99766788 99201555 98668995 98146791 97626123 97112303 96619492 96162825 95753031
3295 95753031 95396414 95097084 94857073 94672604 94528198 94396172 94245453 94057503 93840103 93629789
3305 93629789 93477354 93423233 93476744 93610325 93773127 93915815 94012594 94070787 94124851 94220724 94398603
3316 94398603 94679737 95059128 95503492 95956411 96352262 96638031 96795540 96852732 96874132 96933155 97077456
3327 97077456 97307386 97579241 97832699 98025198 98154011 98253727 98372612 98544149 98770466 99027071
3337 99027071 99282465 99520531 99750690 100002909 100311003 100696583 101161003 101688890 102259092 102855997
3347 102855997 103475542 104124184 104812860 105550013 106337252 107169237 108035126 108921566 109814463 110701265
3357 110701265 111574926 112438412 113307657 114209051 115169420 116203365 117304039 118445778 119597483
3366 119597483 120740032 121875582 123021841 124193993 125386648 126570539 127706623 128770485 129769230
3375 129769230 130738678 131720629 132735186 133766823 134772549 135708094 136553316 137321491 138047314
3384 138047314 138763151 139479752 140183554 140847960 141450253 141981134 142442303 142836323 143159122 143399734
3394 143399734 143549166 143609943 143600760 143552217 143496675 143456936 143439455 143433380 143414764 143353558 143221426 142998466
3406 142998466 142677851 142266836 141784277 141253109 140692282 140108547 139494610 138833094 138107471 137314758
3416 137314758 136474504 135626888 134820957 134094601 133457699 132885876 132329865 131736279 131070795 130331964
3426 130331964 129550819 128777637 128063574 127445107 126936722 126531925 126210642 125948744 125727997 125542755
3436 125542755 125400505 125315704 125297785 125340519 125420208 125505896 125578384 125646000 125746918 125933828 126248741
3447 126248741 126702166 127269249 127904978 128567963 129238520 129921255 130633593 131389666 132191849 133032856
3457 133032856 133905220 134808874 135751381 136742277 137785559 138875704 139997883 141129341 142241049
3466 142241049 143301306 144284325 145184269 146026964 146870623 147788172 148835611 150023251 151306419
3475 151306419 152604141 153837738 154967299 156005754 157003870 158017054 159076090 160179405 161306801
3484 161306801 162443447 163593903 164779377 166023655 167341595 168740234 170230522 171835041 173581944
3493 173581944 175484219 177518158 179620495 181709919 183723946 185648556 187521305 189406853 191360760
3502 191360760 193405018 195529594 197714386 199952488 202256832 204645615 207120266 209654083 212201538
3511 212201538 214722862 217204914 219663258 222123661 224595451 227055969 229454441 231732998 233849487
3520 233849487 235789986 237567768 239215164 240776596 242305908 243861504 245493412 247221527 249016991
3529 249016991 250801640 252475777 253965054 255263805 256445827 257629681 258911686 260300789 261696186
3538 261696186 262928371 263845749 264403114 264697151 264924278 265280285 265857658 266604309 267368298 268002949
3548 268002949 268463326 268833504 269266605 269884243 270706463 271662750 272671814 273720837 274871979
3557 274871979 276176891 277555141 278739815 279355583 279111748 278000031 276368580 274807529 273897419
3566 273897419 273957863 274932423 276462688 278089390 279458809 280429592 281059227 281521130 282022533 282754536
3576 282754536 283853817 285346699 287082901 288715553 289787464 289925156 289051704 287488899 285858860
3585 285858860 284815922 284746609 285607319 286987095 288347168 289288616 289698410 289719276 289603462 289569416
3595 289569416 289746513 290204601 291001625 292177124 293688164 295344868 296822090 297769852 297973804
3604 297973804 297471867 296558800 295672665 295225449 295454712 296347675 297645645 298915291 299674644 299563713
3614 299563713 298529415 296948719 295590858 295362740 296891823 300128555 304200306 307659969 309071579
3623 309071579 307669525 303750725 298577709 293826866 290866966 290236282 291561108 293899860 296271381
3632 296271381 298070469 299197540 299930935 300700855 301910801 303840141 306566448 309859066 313092861
3641 313092861 315314503 315549240 313270798 308787117 303267002 298311081 295252190 294565449 295725460
3650 295725460 297583218 299019604 299485683 299146366 298622608 298570328 299376698 301104336 303604450
3659 303604450 306628189 309840164 312785950 314942455 315905190 315611897 314415245 312895145 311496372
3668 311496372 310237846 308718452 306444530 303267460 299627514 296430492 294634151 294812355 296953487
3677 296953487 300562592 304927864 309338951 313146667 315729599 316521511 315186520 311862049 307279091
3686 307279091 302607269 299050980 297396736 297756519 299629059 302205391 304717007 306644917 307743473
3695 307743473 307967548 307424412 306393757 305350151 304880314 305457001 307158871 309509182 311577702
3704 311577702 312346783 311182747 308171673 304137669 300321751 297878723 297433796 298898335 301598301
3713 301598301 304612751 307135296 308698349 309205399 308825436 307857361 306643276 305541229 304911270
3722 304911270 305063915 306159134 308096027 310456486 312552528 313593540 312941723 310390549 306363468
3731 306363468 301920242 298494434 297389050 299202156 303458691 308690624 313012466 314954243 314126968
3740 314126968 311336193 308057823 305570164 304258976 303516426 302279701 299847717 296435184 293107128
3749 293107128 291146736 291278343 293244343 295983791 298265743 299356937 299326687 298856754 298741016
3758 298741016 299413052 300760250 302265377 303321075 303513603 302752571 301250648 299424896 297780628
3767 297780628 296790638 296764336 297727203 299369240 301120129 302353477 302640171 301927128 300545502
3776 300545502 299040890 297914181 297408924 297449169 297747841 298009605 298107910 298136978 298321171 298849735
3786 298849735 299750233 300881615 302043133 303109932 304085197 305023556 305882721 306432323 306319046
3795 306319046 305271702 303311481 300805817 298302689 296245365 294765244 293709450 292885723 292337589
3804 292337589 292422237 293599281 296057816 299446945 302922897 305512886 306574402 306058693 304425144
3813 304425144 302293015 300086384 297910175 295704651 293519955 291672096 290648384 290826607 292215767
3822 292215767 294408932 296786690 298833618 300361595 301504574 302508068 303465252 304176807 304218998
3831 304218998 303178024 300908546 297670345 294066734 290819340 288499985 287364235 287372742 288377151
3840 288377151 290334892 293382301 297667580 303007164 308584595 312949486 314442101 311915989 305409336
3849 305409336 296373959 287264824 280629368 278115063 279874191 284638367 290386600 295241585 298154774
3858 298154774 299101086 298783722 298085899 297582016 297328091 296973095 296073494 294417248 292195015 289947205
3868 289947205 288329659 287821789 288521233 290121613 292072773 293827209 295040398 295628490 295685940
3877 295685940 295349350 294712276 293837509 292824764 291846104 291093063 290665474 290494576 290383091 290157166
3887 290157166 289832649 289667282 290041142 291221733 293154068 295407867 297319317 298250122 297829685
3896 297829685 296069088 293320370 290131073 287075367 284624519 283078346 282548809 282979641 284187965
3905 284187965 285916786 287883091 289810410 291445122 292571507 293041801 292822285 292029552 290919666
3914 290919666 289813995 288982925 288546371 288447132 288515987 288588619 288602047 288610001 288710766 288939266 289202099
3925 289202099 289306087 289070816 288455734 287619896 286869030 286513233 286713142 287401047 288316460 289132309
3935 289132309 289598446 289628773 289300518 288784409 288257103 287838211 287570171 287429028 287350998 287264290
3945 287264290 287121887 286927471 286739941 286645184 286705284 286914730 287197094 287447128 287590694 287617397
3955 287617397 287563648 287464943 287323170 287118721 286854534 286584492 286390228 286318493 286333847 286335716 286234512
3966 286234512 286025085 285791798 285635605 285586548 285579491 285518036 285367241 285184231 285053406 284985104 284884205
3977 284884205 284634609 284231701 283827915 283620338 283659515 283755112 283599491 283033657 282221184 281531048
3987 281531048 281178017 280925770 280184956 278531761 276254959 274351673 273696518 273752575 271733398
3996 271733398 263074608 243347301 210748405 167737274
4000 167737274
##END=$$ End of the data block
