##TITLE=$$ Begin of the data block
##JCAMP-DX=5.00 $$ ACD/SpecManager v 10.08
##SPECTROMETER/DATA SYSTEM=16PC
##DATE=25 Jun 2013 15:00:50
##DATA TYPE=INFRARED SPECTRUM
##DATA CLASS=XYDATA
##ORIGIN=
##OWNER=
##NPOINTS=3601
##FIRSTX=400.00000000
##LASTX=4000.00000000
##MAXX=4000.00000000
##MINX=400.00000000
##MAXY=39.71397018
##MINY=15.40229988
##XFACTOR=1.0000000000
##YFACTOR=0.000000100000000
##FIRSTY=22.70728493
##DELTAX=1.00000000
##XUNITS=1/CM
##YUNITS=TRANSMITTANCE
##XYDATA=(X++(Y..Y))
400B27072849N6293602M2449284K5616302J0787545R82132l386956l711929j819344
$$ 227072849 283366451 325815735 351432037 362219582 363201714 359814758 356102829 354283485
408C54283485R72901L945923O539878Q033791P729454N467796J961213j440812l462104
$$ 354283485 355256386 359202309 365742187 373775978 381505432 386973228 388934441 387493629 384031525
417C84031525l605767k368126q37173J0796j61324r99260j819343k078858j646881
$$ 384031525 380425758 378057632 377220459 377231255 377069931 376070671 374251328 372172470 370525589
426C70525589p76100J18484O88134P72247M02717k50968r53942j478309j672745j510430
$$ 370525589 369749489 369867973 370556107 371328354 371731071 371480103 370526161 369047852 367375107 365864677
436C65864677j091995n99708k26593j10665k93541o99920j148148j406479j307373
$$ 365864677 364772682 364172974 363946381 363835716 363542175 362842255 361694107 360287628 358980255
445C58980255q75091l76130k12059o72111j693955k818679l423920l114166k005654
$$ 358980255 358105164 357729034 357516975 356844864 355150909 352332230 348908310 345794144 343788490
454C43788490o81076J81351K59209k06185n98831l74908N55572J788521K731399L011437
$$ 343788490 343107414 343288765 343547974 343341789 342742958 342368050 342923622 344712143 347443542 350454979
464C50454979K683639K113266J665917J468353J406593J321030J193085J158981J354943
$$ 350454979 353138618 355251884 356917801 358386154 359792747 361113777 362306862 363465843 364820786
473C64820786J750907K138024K283783K118606J784859J503983J375160J279793R71832
$$ 364820786 366571693 368709717 370993500 373112106 374896965 376400948 377776108 379055901 380027733
482C80027733K74315p85713k010689l191376m239998n172233n958023o383591o077385
$$ 380027733 380302048 379516335 377505646 374314270 370074272 364902039 358944016 352560425 346483040
491C46483040m720650k310638P22961L649483N754700O653289O414490N451431M266777
$$ 346483040 341762390 339451752 340174713 343824196 349578896 356232185 362646675 368098106 372364883
500C72364883L220978K440567J873512J411782R86137N88532K42538l0136k16942k98424
$$ 372364883 375585861 378026428 379899940 381311722 382297859 382886391 383128929 383098793 382881851 382583427
510C82583427k38723j717M12827R37385J437760J751785J749992J387634P21055j14480
$$ 382583427 382344704 382342987 382755814 383693199 385130959 386882744 388632736 390020370 390741425 390626945
520C90626945r55314j656876k119522k288666k145271j704216j030960k54478M44641
$$ 390626945 389671631 388014755 385895233 383606567 381461296 379757080 378726120 378471642 378916283
529C78916283Q91800R98497Q20579N46036M02603N29709Q88557J275215J433602J205826
$$ 378916283 379808083 380806580 381627159 382173195 382575798 383105507 383994064 385269279 386702881 387908707
539C87908707O28624q5526o68869r44481r08508p03049n08270m29764m53148m87137
$$ 387908707 388537331 388451805 387782936 386838455 385929947 385226898 384718628 384288864 383835716 383348579
549C83348579m51507l44200k38076k20108l18832m78592n95665n91850m68979l09410
$$ 383348579 382897072 382552872 382314796 382094688 381775856 381297264 380701599 380109749 379640770 379331360
559C79331360k25487k94418n20935q45795j186256j473236j668244j757545j742058
$$ 379331360 379105873 378811455 378290520 377444725 376258469 374785233 373116989 371359444 369617386
568C69617386j639557j491737j363030j315307j369858j478882j535454j421699j071282
$$ 369617386 367977829 366486092 365123062 363807755 362437897 360959015 359423561 358001862 356930580
577C56930580n07126J66207Q11462J314430J613617J695671J569214J251373P75452
$$ 356930580 356423454 356589661 357401123 358715553 360329170 362024841 363594055 364845428 365620880
586C65620880K16103l02391o34766o75659m22554K823L95088N50919L57933j63613
$$ 365620880 365836983 365534592 364899826 364224167 363801613 363804436 364199524 364750443 365108376 364944763
596C64944763q84704j637574k287597k763558l036384l071709k802773k150955j090240
$$ 364944763 364060059 362422485 360134888 357371330 354334946 351263237 348460464 346309509 345219269
605C45219269K88238J761208L030891L835831M057579L764420L168296K519608K000084
$$ 345219269 345507507 347268715 350299606 354135437 358193016 361957436 365125732 367645340 369645424
614C69645424J668854J483574J368255J273956J191292J115036R96819P43103K71606
$$ 369645424 371314278 372797852 374166107 375440063 376631355 377746391 378743210 379486313 379757919
623C79757919l99131j099396j550484j500854q83294J05553J071587J612816J526146
$$ 379757919 379358788 378259392 376708908 375208054 374324760 374430313 375501900 377114716 378640862
632C78640862R08546Q6441n78308q84552q67996p20864o29043o46248o88858o39229
$$ 378640862 379549408 379635849 379057541 378172989 377304993 376584129 375955086 375308838 374619980 373980751
642C73980751m63638k50283j41868k23656m58603p16095q65364q55369p26662n61066
$$ 373980751 373517113 373266830 373124962 372901306 372442703 371726608 370861244 370005875 369279213 368718147
652C68718147m26597l62435l98063n59159q30574j103821j180305q79555k01492N76096
$$ 368718147 368291550 367929115 367531052 366971893 366141319 365037498 363857193 362977638 362776146 363352242
662C63352242R82856O21414n37719k039490l128433l154183j962623j8425J829834
$$ 363352242 364335098 364956512 364418793 362379303 359250870 356096687 354134064 354115639 355945473
671C55945473K802543K587853J450538J6594j104011j614685j590271j314011j042824
$$ 355945473 358748016 361335869 362786407 362803001 361698990 360084305 358494034 357180023 356137199
680C56137199q64372p10983m77181j26838K82516O59867R54475J185913J409569J655998
$$ 356137199 355272827 354561844 354084663 353957825 354240341 354900208 355854683 357040596 358450165 360106163
690C60106163J892548K034034J989861J715927J239204O50254P0915l85399o46019
$$ 360106163 361998711 364032745 366022606 367738533 368977737 369627991 369698906 369313507 368667488
699C68667488o96182n80177l81661j94817r1094r7504j91765l14827l94440l72429
$$ 368667488 367971306 367391129 367009468 366814651 366723557 366626053 366434288 366119461 365725021 365352592
709C65352592k27279J5945K89574N07240N95780N27191L29895P4539j58730l13758
$$ 365352592 365125313 365141258 365430832 365938072 366533852 367061043 367390938 367465477 367306747 366992989
719C66992989l75100l60832l03535k32277j67923j27983j30272j89209l06664m66652
$$ 366992989 366617889 366257057 365953522 365721245 365553322 365425339 365295067 365105858 364799194 364332542
729C64332542o41250q05016r46235j067772j174317j256637j287041j229134j061287
$$ 364332542 363691292 362886276 361940041 360872269 359697952 358441315 357154274 355925140 354863853
738C54863853p98645n04188k78397k29072m29459q80508j495095k118377k581177k766533
$$ 354863853 354065208 353561020 353282623 353053551 352624092 351743584 350248489 348130112 345548935 342782402
748C42782402k657585k338410j947288j606865j372490j225815j113510r98993q93898
$$ 342782402 340124817 337786407 335839119 334232254 332859764 331633949 330520439 329521446 328627548
757C28627548q45337q97789j058426j291198j543160j777611j989765k191944k384281
$$ 328627548 327782211 326884422 325825996 324534798 322991638 321214027 319224262 317032318 314648037
766C14648037k536774k601604k550202k410469k276077k275162k510585l000908l653374
$$ 314648037 312111263 309509659 306959457 304548988 302272911 299997749 297487164 294486256 290832882
775B90832882m283466m673138m643211m108544l095493j724034j67083J386471K756328
$$ 290832882 286549416 281876278 277233067 273124523 270029030 268304996 268137913 269524384 272280712
784B72280712L783894M348221M395751L972302L235569K422142J771584J434974J420460
$$ 272280712 276064606 280412827 284808578 288780880 292016449 294438591 296210175 297645149 299065609
793B99065609J605873J814404J909847J853332J694527J512432J354675J218548J081124
$$ 299065609 300671482 302485886 304395733 306249065 307943592 309456024 310810699 312029247 313110371
802C13110371R46235Q64144R02786J093407J394538J705838J927108K016144K005921
$$ 313110371 314056606 314920750 315823536 316916943 318311481 320017319 321944427 323960571 325966492
811C25966492J965484J938362J906319J809082J604996J324081J069908R63593J063843
$$ 325966492 327931976 329870338 331776657 333585739 335190735 336514816 337584724 338548317 339612160
820C39612160J321449J598930J745377J678619J424981J095581Q18023O69213O43959
$$ 339612160 340933609 342532539 344277916 345956535 347381516 348477097 349295120 349964333 350608292
829C50608292O71234O59866N42870L03878k3918l72467o58645q02803p46041m66614
$$ 350608292 351279526 351939392 352482262 352786140 352762222 352389755 351731110 350928307 350182266 349715652
839C49715652P248N97001J187744J659698J926918J966782J828804J612854J424408
$$ 349715652 349722900 350319901 351507645 353167343 355094261 357061043 358889847 360502701 361927109
848C61927109J325569J306724J298028J214294J007614O96411L46680J9684k76184
$$ 361927109 363252678 364559402 365857430 367071724 368079338 368775749 369122429 369142113 368865929
857C68865929n89371r73969j414642j785812j887169j547928p40242L71628J488456
$$ 368865929 368276558 367302589 365887947 364102135 362214966 360667038 359926796 360298424 361786880
866C61786880K311020K674790K607384K278251J882401J536560J248474R65233O52237
$$ 361786880 364097900 366772690 369380074 371658325 373540726 375077286 376325760 377290993 377943230
875C77943230L41949J17149N5886J77002M33388P45468J048088J309585J517601J650238
$$ 377943230 378285179 378402328 378458214 378635216 379068604 379814072 380862160 382171745 383689346 385339584
885C85339584J666794J530609J248436Q93173N82123M20800M44984N97801P58362Q06236
$$ 385339584 387006378 388536987 389785423 390678596 391260719 391681519 392126503 392724304 393482666 394288902
895C94288902O82106M13323R4452j63803k86332k61383j35383J6060J24893J56479
$$ 394288902 394971008 395384331 395478783 395314980 395028648 394767265 394631882 394647942 394772835 394929314
905C94929314J18332M8332n608q964M8446J50795K66266L60565M05426L84713K94952
$$ 394929314 395047646 395095978 395090370 395081406 395129852 395280647 395546913 395907478 396312904 396697617 396992569
916C96992569J47133l2005k01645l15781l38974k63329j18331L9825J49498J70975
$$ 396992569 397139702 397107697 396906052 396590271 396251297 395987968 395869637 395909462 396058960 396229935
926C96229935J04828j1177j21995j84822j89437j62201j51024j99242l22342m98695
$$ 396229935 396334763 396323586 396201591 396016769 395827332 395665131 395514107 395314865 394992523 394493828
936C94493828o77223q00591q31451p69883o54792n45159m93850n23339o19926p45659
$$ 394493828 393816605 393016014 392184563 391414680 390759888 390214729 389720879 389197540 388577614 387831955
946C87831955q61816r48220j004982j035690j027298r40743p26242l56903J39580O75011
$$ 387831955 386970139 386021919 385016937 383981247 382953949 382013206 381286964 380930061 381069641 381744652
956C81744652J126594J389084J420517J259842J005364P67517O19392N74074N91392
$$ 381744652 382871246 384260330 385680847 386940689 387946053 388713570 389332962 389907036 390498428
965C90498428O08940N75867M72450L11585J24473n6266k10343l32908m29459n06096
$$ 390498428 391107368 391683235 392155685 392467270 392591743 392535477 392325134 391992226 391562767 391056671
975C91056671n60303n77850n41496m46358l13339j92452j44615k12478l94631o39114
$$ 391056671 390496368 389918518 389377022 388930664 388617325 388424873 388280258 388067780 387673149 387034035
985C87034035q65326j001663j019364r43794q37784p68661p79190q75016j031570j210251
$$ 387034035 386168709 385167046 384147682 383203888 382366104 381597443 380818253 379943237 378911667 377701416
995C77701416j373329j494789j565781j599808j633796j723328j926002k278862k777100
$$ 377701416 376328087 374833298 373267517 371667709 370033913 368310585 366384583 364105721 361328621
1004C61328621l365898l944206m380684m532357m267273l494529k200013m82559J432419
$$ 361328621 357962723 354018517 349637833 345105476 340838203 337343674 335143661 334661102 336093521
1013C36093521L223534M548912N150566M944267M053192K768593J447601L97454k12708
$$ 336093521 339317055 343865967 349016533 353960800 358013992 360782585 362230186 362627640 362414932
1022C62414932l75404k07634J21002M58832P11441Q44650Q63648P87735O38008M37698
$$ 362414932 362039528 361831894 361952896 362411728 363123169 363967819 364831467 365619202 366257210 366694908
1032C66694908K18277J7128j35155k32086k98347l76320n00374o69975q42591r54208
$$ 366694908 366913185 366930313 366795158 366563072 366264725 365888405 365388031 364718056 363875465 362921257
1042C62921257r55200q40302o55250m73938l61519l47099m17710n37185o71311q02917
$$ 362921257 361966057 361125755 360470505 359996567 359635048 359287949 358870239 358333054 357661743 356858826
1052C56858826r33113j067658j206245j339493j453743j539612j597938j639824j686745
$$ 356858826 355925713 354858055 353651810 352312317 350858574 349318962 347721024 346081200 344394455
1061C44394455j767769j915665k158241k505035k939835l421058l897400m329224m706039
$$ 344394455 342626686 340711021 338552780 336047745 333107910 329686852 325789452 321460228 316754189
1070C16754189n048867n397911n791855o250038o761856p288856p772236q146458q355370
$$ 316754189 311705322 306307411 300515556 294265518 287503662 280214806 272442570 264296112 255940742
1079B55940742q366622q176804p803288p263221o555043n657234m552631l266621j890812
$$ 255940742 247574120 239397316 231594028 224330807 217775764 212118530 207565899 204299278 202408466
1088B02408466n69019N55763J404953J998596K435017K828941L250523L705273M168930
$$ 202408466 201839447 202395210 203800163 205798759 208233776 211062717 214313240 218018513 222187443
1097B22187443M640865N170727N825939O619301P451801Q123894Q422089Q237686P637348
$$ 222187443 226828308 231999035 237824974 244444275 251896076 260019970 268442059 276679745 284317093
1106B84317093O841259O114330N634327N416966N335598N215320M941063M513054M029465
$$ 284317093 291158352 297272682 302907009 308323975 313659573 318874893 323815956 328329010 332358475
1115C32358475L618469L367653L290520L337516L431816L503724L509101L430710L271866
$$ 332358475 335976944 339344597 342635117 345972633 349404449 352908173 356417274 359847984 363119850
1124C63119850L049240K783966K492638K180328J842385J474723J088601P15103L93257
$$ 363119850 366169090 368953056 371445694 373626022 375468407 376943130 378031731 378746834 379140091
1133C79140091J47552l0975j82648l55682n76553q32177j078643j268158j373558j396637
$$ 379140091 379287643 379256668 379074020 378718338 378141785 377309608 376230965 374962807 373589249 372192612
1143C72192612j353150j252556j089248q53501n53321k28844N4932K34489K76909J92871
$$ 372192612 370839462 369586906 368497658 367644157 367090836 366861992 366916924 367151413 367428322 367621193
1153C67621193K7046j68533l58658n38635p28455r60541j266479j666718k162056k723503
$$ 367621193 367648239 367479706 367121048 366582413 365853958 364893417 363626938 361960220 359798164 357074661
1163C57074661l282013l728943l930282l762741l155518k129249q11234N79872J778717
$$ 357074661 353792648 350063705 346133423 342370682 339215164 337085915 336274681 336854553 338633270
1172C38633270K538986K704163K262001J363106K89383o26564j110001j037979m82559
$$ 338633270 341172256 343876419 346138420 347501526 347790909 347164345 346054344 345016365 344533806
1181C44533806L23067J080856J545868J610794J323128Q34083L12386j29929m66003
$$ 344533806 344856873 345937729 347483597 349094391 350417519 351251602 351563988 351434059 350968056
1190C50968056p36389j004639j317215j687660k101746k532501k952309l336677l667755
$$ 350968056 350231667 349227028 347909813 346222153 344120407 341587906 338635597 335298920 331631165
1199C31631165l938446m157792m351883m555187m795208n082893n412350n774364o170597
$$ 331631165 327692719 323534927 319183044 314627857 309832649 304749756 299337406 293563042 287392445
1208B87392445o618557p143040p756348q438282r125232r708081j0041408r962864
$$ 287392445 280773888 273630848 265874500 257436218 248310986 238602905 228561497 218598633
1216B18598633r326439q049927o165581l849773j408272P97997K464218L447628L819790
$$ 218598633 209272194 201222267 195056686 191206913 189798641 190596638 193060856 196508484 200328274
1225B00328274L832321L812771M033565M614773N498810O500606P398262Q020745Q293857
$$ 200328274 204160595 207973366 212006931 216621704 222120514 228621120 236019382 244040127 252333984
1234B52333984Q238602P935944P483558O967240O451206N980739N587750N289383N083446
$$ 252333984 260572586 268508530 275992088 282959328 289410534 295391273 300979023 306268406 311351852
1243C11351852M944935M829579M685554M470024M159889L755417L273049K735138K160034
$$ 311351852 316296787 321126366 325811920 330281944 334441833 338197250 341470299 344205437 346365471
1252C46365471J558761R37500L02430l36609r64279j558342k087517k505913k755699
$$ 346365471 347924232 348861732 349164162 348827553 347863274 346304932 344217415 341711502 338955803
1261C38955803k775917k526398k015266j318054n72548N3558M14658M35028J31187
$$ 338955803 336179886 333653488 331638222 330320168 329747620 329801178 330215836 330650864 330782051
1270C30782051m04320j046257j688270k274285k800216l289585l762722m215870m620324
$$ 330782051 330377731 329331474 327643204 325368919 322568703 319279118 315516396 311300526 306680202
1279C06680202m933605n113697n127754m956074m597606m075509l440303k759800k095528
$$ 306680202 301746597 296632900 291505146 286549072 281951466 277875957 274435654 271675854 269580326
1288B69580326j471558q57906j79500O46953J663647K837009M053288N147400N954208
$$ 269580326 268108768 267250862 267071362 267718315 269381962 272218971 276272259 281419659 287373867
1297B87373867O356697O320324N900345N223846M451962L730373L144608K696953K317695
$$ 287373867 293730564 300050888 305951233 311175079 315627041 319357414 322502022 325198975 327516670
1306C27516670J907540J393280P65800P9880n81818j159324j645470k078095k499656
$$ 327516670 329424210 330817490 331583290 331663170 331081352 329922028 328276558 326198463 323698807
1315C23698807k911492l251361l408680l267155k750473j852379o41346P55100K178593
$$ 323698807 320787315 317535954 314127274 310860119 308109646 306257267 305615921 306371021 308549614
1324C08549614L470383M503765N210170N590058N701408N626679N431709N140228M738884
$$ 308549614 312019997 316523762 321733932 327323990 333025398 338652077 344083786 349224014 353962898
1333C53962898M208794L568039K889862K286987J861801J654206J615638J627617J558152
$$ 353962898 358171692 361739731 364629593 366916580 368778381 370432587 372048225 373675842 375233994
1342C75233994J325416R34486M69628M7264k43301l77083l93601l63083l45230l65448
$$ 375233994 376559410 377493896 377963524 378010788 377767487 377390404 376996803 376633720 376288490 375923042
1352C75923042m19044m98352o18477q29239j204758j816749k699700l813934n014610
$$ 375923042 375503998 375005646 374387169 373557930 372353172 370536423 367836723 364022789 359008179
1361C59008179o045723o579743o314125n104637l074341o30912J646194L214798L777542
$$ 359008179 352962456 346382713 340068588 334963951 331889610 331258698 332904892 336119690 339897232
1370C39897232L380356K348251J100388m1809r46999j630020k130432k420311k410317
$$ 339897232 343277588 345625839 346726227 346684418 345737419 344107399 341976967 339556656 337146339
1379C37146339k040863j378173o23665k2164K74620K91405J99890J97754L79257O78826
$$ 337146339 335105476 333727303 333103638 333081474 333356094 333647499 333847389 334045143 334424400 335103226
1389C35103226R21287R34792O53953J54839l87650p86514r25522q03909n28946k67487
$$ 335103226 336024513 336959305 337613258 337768097 337380447 336593933 335668411 334864502 334335556 334068069
1399C34068069j72424l14293o50291j048622j362534j512070j521492j486091j489449
$$ 334068069 333895645 333581352 332931061 331882439 330519905 329007835 327486343 326000252 324510803
1408C24510803j532974j536179j413231j169662r40914r28097j265240j904087k601413
$$ 324510803 322977829 321441650 320028419 318858757 317917843 316989746 315724506 313820419 311219006
1417C11219006l026600k929154k266407j224193j23310P26718J152688J171360R60140
$$ 311219006 308192406 305263252 302996845 301772652 301649342 302376060 303528748 304700108 305660248
1426C05660248P68413Q01735J119957J594048J950741J905956J329422L48148o86893
$$ 305660248 306428661 307230396 308350353 309944401 311895142 313801098 315130520 315478668 314791775
1435C14791775j369400j453934r85661k61249L48568N99594M65221Q1005l85608q26702
$$ 314791775 313422375 311968441 310982780 310721531 311070099 311669693 312134914 312215919 311830311 311003609
1445C11003609j181660j369858j270790q16288j38855L70178K04373r49459k922879
$$ 311003609 309821949 308452091 307181301 306365013 306226158 306596336 306800709 305851250 302928371
1454C02928371n027370o346436o220417m629917k223892M1981J437473J833401J693039
$$ 302928371 297901001 291554565 285334148 280704231 278480339 278522320 279959793 281793194 283486233
1463B83486233J708603K328701L479175M632397N154781M695607L382911J730805L46298
$$ 283486233 285194836 287523537 291002712 295635109 300789890 305485497 308868408 310599213 310945511
1472C10945511l79429m24881q1482K50454K83546l2539n33714r78527j210690j258812
$$ 310945511 310566082 310141201 310059719 310310173 310593719 310561180 310027466 309048939 307838249 306579437
1482C06579437j314697j601772k205849k961140l469886l260956k023335J98612K954388
$$ 306579437 305264740 303662968 301457119 298495979 295026093 291765137 289741802 289940414 292894802
1491B92894802N528126P224960P685356P071762O016045N321312N536308O621514P905693
$$ 292894802 298422928 305647888 313333244 320405006 326421051 331742363 337278671 343900185 351805878
1500C51805878Q402252P351150M696618J209831j848870l364334k936706j055870J217804
$$ 351805878 360208130 367559280 372255898 373465729 371616859 368252525 365315819 364259949 365477753
1509C65477753K857322L379555K970696K202110J577873J237030R80416N35469j76812
$$ 365477753 368335075 371714630 374685326 376887436 378465309 379702339 380682755 381218224 381041412
1518C81041412r77745j580581j798973j640130j234359p03469j07765M94385R63554
$$ 381041412 380063667 378483086 376684113 375043983 373809624 373106155 372998390 373492775 374456329
1527C74456329J105233Q25615K90870q5144J14670R76791K087937K702789K182846
$$ 374456329 375561562 376387177 376678047 376592903 376707573 377684364 379772301 382475090 384657936
1536C84657936M30603j982345m091225n048828m552841k943230r55315O78673J539612
$$ 384657936 385088539 383106194 379014969 373966141 369413300 366470070 365514755 366193428 367733040
1545C67733040J610832J180534O69632M68254Q03986J628075K565002K998772K336426
$$ 367733040 369343872 370524406 371194038 371662292 372466278 374094353 376659355 379658127 381994553
1554C81994553L63693k509003n308380o902389o561852m365082j198883J661110L159523
$$ 381994553 382358246 379849243 374540863 367638474 361076622 356711540 355512657 357173767 360333290
1563C60333290K930184J387786n67779k043419k570114k252159j610871j239204j454048
$$ 360333290 363263474 364651260 364083481 362040062 359469948 357217789 355606918 354367714 352913666
1572C52913666k126198k759781k784157j894226k55813J549568K820053L100281K405548
$$ 352913666 350787468 348027687 345243530 343349304 343093491 344643059 347463112 350563393 352968941
1581C52968941J174431j0109p44362r69239r00726q08601q22678q90312q83179p35817
$$ 352968941 354143372 354133263 353388901 352419662 351518936 350710335 349887657 348997345 348114166 347378349
1591C47378349m97665k77863j50680j18447j50222k44561m34989p33719j073304j326103
$$ 347378349 346880684 346602821 346452141 346333694 346183472 345938911 345503922 344770203 343696899 342370796
1601C42370796j402511j346016j319733j471825j780281k021560j924744j411743p33414
$$ 342370796 340968285 339622269 338302536 336830711 335050430 333028870 331104126 329692383 328958969
1610C28958969l64571o97746j747780l086052m076690m263039l643894k657795j895676
$$ 328958969 328594398 327896652 326148872 323062820 318986130 314723091 311079197 308421402 306525726
1619C06525726j748600k220192k995796l679027m011116l942738l565807l012734k420006
$$ 306525726 304777126 302556934 299561138 295882111 291870995 287928257 284362450 281349716 278929710
1628B78929710j962432j877594k399159l611412n319557p056294q258247q532906p862072
$$ 278929710 276967278 275089684 272690525 269079113 263759556 256703262 248445015 239912109 232050037
1637B32050037o621570n399609m709930m746475n298024n853557n844441m913273l086357
$$ 232050037 225428467 220028858 215318928 210572453 205274429 199420872 193576431 188663158 185576801
1646A85576801p73678J419087K984638L776570M091072M505252N533047P288914R359913
$$ 185576801 184803123 186222210 189206848 192983418 197074490 201579742 207112789 214401703 223761616
1655B23761616J0988121J1480140J0607644Q755683O713906N230160M598426M533196
$$ 223761616 234749737 246229877 256837521 265593204 272307110 277537270 282135696 286668892
1663B86668892M404564L675251K250976N21660r20219j680393j803074j690827j770782
$$ 286668892 291073456 294748707 296999683 297521343 296601124 294920731 293117657 291426830 289656048
1672B89656048k155209k547626k471924j667481l70445P34616Q83579l00751k544918
$$ 289656048 287500839 284953213 282481289 280813808 280443363 281177979 282061558 281760807 279215889
1681B79215889n032749o824169p332230o586761n153676l796043l093567l229656m022522
$$ 279215889 274183140 267358971 260026741 253439980 248286304 244490261 241396694 238167038 234144516
1690B34144516n124283o234112p204074q008595q641739r031238r028111q473396p295685
$$ 234144516 229020233 222786121 215582047 207573452 198931713 189900475 180872364 172398968 165103283
1699A65103283n583878l595705j690654k10047O50778R22804Q52108P92255J042156
$$ 165103283 159519405 155923700 154233046 154022999 154673777 155596581 156448689 157240944 158283100
1708A58283100J701536K620077L462697L863945L594245K661591J305943j01605j206474
$$ 158283100 159984636 162604713 166067410 169931355 173525600 176187191 177493134 177391529 176185055
1717A76185055j794415j842575j477966q65860r1229Q99544K249947M053039O201077
$$ 176185055 174390640 172548065 171070099 170204239 170113010 171012554 173262501 177315540 183516617
1726A83516617Q330860R932671J0586967J0202389R100590P871189P064037O896534
$$ 183516617 191847477 201780148 212367115 222569504 231670094 239541283 246605320 253501854
1734B53501854P157383P369308P109547O280232N161800M220810L806496L937797M306240
$$ 253501854 260659237 268028545 275138092 281418324 286580124 290800934 294607430 298545227 302851467
1743C02851467M480705M168339L369332K348575J466160R86309R73759J308822J781578
$$ 302851467 307332172 311500511 314869843 317218418 318684578 319670887 320644646 321953468 323735046
1752C23735046K194863K423248K424164K220230J874809J475868J123581R16939R37424
$$ 323735046 325929909 328353157 330777321 332997551 334872360 336348228 337471809 338388748 339326172
1761C39326172J222801J737404K347031K827301K925529K472420J495018K59476q10280
$$ 339326172 340548973 342286377 344633408 347460709 350386238 352858658 354353676 354613152 353802872
1770C53802872j317635j089020k68516P58743J566238J892586J732826J277771P66526
$$ 353802872 352485237 351396217 351127701 351886444 353452682 355345268 357078094 358355865 359122391
1779C59122391L67050J50490J43280L70254Q29850J420021J901855J977882J468544
$$ 359122391 359489441 359639931 359783211 360153465 360983315 362403336 364305191 366283073 367751617
1788C67751617M73023o17256j298409j233482m58260O26793J477928J707802J279602
$$ 367751617 368224640 367607384 366308975 365075493 364617233 365244026 366721954 368429756 369709358
1797C69709358M90570k24724n35125l60527J36299O73179J000061R97925P02057K60887
$$ 369709358 370199928 369975204 369440079 369079552 369215851 369889030 370889091 371887016 372589073 372849960
1807C72849960j38054l45268l09906r5329J60828L25241L47252K80494K34528K89230
$$ 372849960 372711906 372366638 372056732 371961403 372122231 372447472 372794724 373075218 373309746 373598976
1817C73598976M36592N94483O78253O66389O04019N41192M67224L09143O180l99743
$$ 373598976 374035568 374630051 375308304 375974693 376578712 377119904 377587128 377896271 377902451 377502708
1827C77502708p46765q43200o07644j46827L04413N48935N72204N49240O91300J046257
$$ 377502708 376755943 375912743 375305099 375158272 375462685 376011620 376583824 377133064 377824364 378870621
1837C78870621J412468J447372R12514j23062j270600k025451k057076j396332m01115
$$ 378870621 380283089 381730461 382642975 382519913 381249313 379223862 377166786 375770454 375369339
1846C75369339M62456Q77151Q10776M68788J26000m0322j8120Q7014J54838J34278
$$ 375369339 375831795 376708946 377519722 377988510 378114510 378074188 378056068 378143082 378297920 378432198
1856C78432198O5460M1504J44081L88489O98432R24683R03931N43060j11046q60901
$$ 378432198 378497658 378539162 378683243 379071732 379770164 380694847 381598778 382141838 382030792 381169891
1866C81169891j428260j583024j264038o15806Q3771N68351P12014N68084L04261Q6631
$$ 381169891 379741631 378158607 376894569 376278763 376362534 376930885 377642899 378210983 378515244 378601875
1876C78601875q278k555L8299O7330Q0032Q6212P2937j373j70479m13132o40907p42760
$$ 378601875 378593597 378591042 378629341 378696671 378776703 378862915 378935852 378934479 378764000 378350868 377709961 376967201
1888C76967201o56624m17938j43204M0703P3891p935j11503j56861j31034q3733p5722
$$ 376967201 376310577 375892639 375749435 375790138 375864029 375856094 375744591 375587730 375456696 375372963 375297241
1899C75297241j25656j97182k34604k16293j74942j69868k26937l02696l02467j50223
$$ 375297241 375171585 374974403 374739799 374523506 374348564 374178696 373951759 373649063 373346596 373196373
1909C73196373J43318M64630O55327O08368L39088j9035k91557l64189k42424l3608
$$ 373196373 373339691 373804321 374459648 375068016 375407104 375388069 375096512 374732323 374489899 374456291
1919C74456291J26953J59951P7514l9787j04103p3204L3188J55105K32735K33879J65787
$$ 374456291 374583244 374743195 374820709 374780922 374676819 374603615 374636803 374791908 375024643 375258522 375424309
1930C75424309O4621k0600m7912l8J02882K05154K37771J54380l4866k59361m19083
$$ 375424309 375488930 375468330 375420418 375420380 375523262 375728416 375966187 376120567 376085701 375826340 375407257
1941C75407257m38347l10669j04217P6980J52016J04790j4267j26610j74027j47628
$$ 375407257 374968910 374658241 374554024 374631004 374783020 374887810 374873543 374746933 374572906 374425278
1951C74425278q2932k7084p363j7356k7733j0529M1809J10169J60331J61553J02425
$$ 374425278 374342346 374315262 374307899 374290543 374262810 374252281 374294090 374404259 374564590 374726143 374828568
1962C74828568j488j12267j86577j94168j34277l7956M5967P5188L7345m1771j13258
$$ 374828568 374827080 374714813 374528236 374334068 374199791 374161835 374207802 374282990 374320335 374278564 374165306
1973C74165306j31607q2550Q202Q9683J15585P1831j3199q5983r9525m3869M3487R6474
$$ 374165306 374033699 373951149 373959351 374049034 374164619 374236450 374223251 374137268 374037743 373993874 374037361 374133835
1985C74133835N7411q7204k92053m72107n43861m68712k73896l7918J47782K23007
$$ 374133835 374191246 374104042 373811989 373339882 372796021 372327309 372053413 372015495 372163277 372386284
1995C72386284J82419P0114m9400j24741j38550j07155o5574m5662o1837j05400j51214
$$ 372386284 372568703 372638817 372589417 372464676 372326126 372218971 372153397 372107735 372045898 371940498 371789284
2006C71789284j69602j42631p3738Q850O4354N9051j3771j27258k32048k81143k53868
$$ 371789284 371619682 371477051 371403313 371412163 371476517 371535568 371521797 371394539 371162491 370881348 370627480
2017C70627480j64490n1499M3869R7580J07193Q3771L8948k2087r6550j76048k42157
$$ 370627480 370462990 370411491 370455360 370552940 370660133 370743904 370782852 370760765 370664215 370488167 370246010
2028C70246010k73400k56042j95274j14785m5280j1215j8807n5961j00746j31722j37482
$$ 370246010 369972610 369716568 369521294 369406509 369361229 369350014 369331207 369275246 369174500 369042778 368905296
2039C68905296j18484q3618m4480q621K0714M4365O2332P0229O0005K4795l5934j11580
$$ 368905296 368786812 368703194 368658714 368650093 368670807 368715172 368777504 368847733 368907738 368932533 368896599 368785019
2051C68785019j82839k28652k35711k03819j46484q4648l9330k4071m1237q2092j29547
$$ 368785019 368602180 368373528 368137817 367933998 367787514 367702866 367663536 367639465 367598228 367516136 367386589
2062C67386589j65100j76888j64337j39427j19476j16005j26915j36719j27602r2811
$$ 367386589 367221489 367044601 366880264 366740837 366621361 366505356 366378441 366241722 366114120 366021309
2072C66021309m3602m540L090k3918o6299r2354p7858k1172N5199J16501J34506J01700
$$ 366021309 365977707 365973167 365976257 365952339 365886040 365793686 365715828 365694656 365749855 365866356 366000862 366102562
2084C66102562L1891m7302j09215j36566j25656q5335l1472J7205M4708M3068J4725
$$ 366102562 366134453 366087151 365977936 365841370 365715714 365630379 365598907 365616112 365660820 365703888 365718613
2095C65718613k7504o5956q7128q6708p1373n3864m4098m3296m3717l4523j0528K1743
$$ 365718613 365691109 365625153 365538025 365451317 365379944 365326080 365281982 365238686 365194969 365160446 365149918 365171661
2107C65171661M5700M2344K822o4010j33019j73950j67122j15699m5281Q965K1057
$$ 365171661 365217361 365259705 365262527 365198517 365065498 364891548 364724426 364608727 364563446 364572411 364593468
2118C64593468j2093o9885j21613j45378j39198j19476j06469j08528j16005j08757
$$ 364593468 364581375 364511490 364389877 364244499 364105301 363985825 363879356 363770828 363654823 363546066
2128C63546066p1411p706N9968J00898R4452M0589m0055j19056j72730j92490j82228
$$ 363546066 363474655 363466949 363526917 363627815 363722267 363762856 363722801 363603745 363431015 363238525 363056297
2139C63056297j51252j07079n3215O027O0921R6092R6436N6457j4801r5711j62506
$$ 363056297 362905045 362797966 362744751 362750778 362811699 362907791 363004227 363060684 363045883 362950172 362787666
2150C62787666k00157k07634j94397j71470j43357j07269o0501o790M0397O5041N8594
$$ 362787666 362587509 362379875 362185478 362014008 361870651 361763382 361702881 361696091 361736488 361801529 361860123
2161C61860123K8038p363k6550k0714J450J7357N531m1580j11809j78452k12936j98021
$$ 361860123 361888161 361880798 361854248 361833534 361834984 361852341 361857872 361816292 361704483 361526031 361313095 361115074
2173C61115074j35841m7150L6011Q2283P3433J1406q0338j65863k11105k00195j42785
$$ 361115074 360979233 360932083 360968094 361050377 361123810 361135216 361054878 360889015 360677910 360477715 360334930
2184C60334930o9274j5984n646l6888q6327j22795j25503r4261m7074r002M386o866
$$ 360334930 360265656 360249672 360244026 360207138 360120811 359998016 359872513 359778252 359731178 359722176 359726562 359719696
2196C59719696k8725m2801l8948j9798K060J2550N112j5488l6773m7074m3335l4256
$$ 359719696 359690971 359648170 359609222 359589424 359591484 359604034 359609146 359593658 359556885 359509811 359466476 359432220
2208C59432220l4561n6534j00669j54534j97525k12402j94016j51939j04713o9771
$$ 359432220 359397659 359341125 359240456 359085922 358888397 358675995 358481979 358330040 358225327 358155556
2218C58155556n4703n5733o2790o7787p0419p7591r6741j28937j64566j87263j82991
$$ 358155556 358100853 358045120 357982330 357914543 357844124 357766533 357669792 357540855 357376289 357189026 357006035
2229C57006035j47324r0484l1166J2016K9831K5787J0834m158j5335k5597l9673n6534
$$ 357006035 356858711 356768227 356737061 356749077 356778908 356804695 356815529 356811371 356796036 356770439 356730766 356674232
2241C56674232o8702o5270m1046j106M0436O7825P1297N0926J3199l4065q4496j31722
$$ 356674232 356605530 356540260 356499214 356498108 356538544 356606369 356677666 356728592 356741791 356707726 356623230 356491508
2253C56491508j65672j72653j41411p3089J3084Q4343J08185O8741k3766j37444k33497
$$ 356491508 356325836 356153183 356011772 355938683 355951767 356036110 356144295 356213036 356189270 356051826 355818329
2264C55818329k82593k75955k23007j43204n7030J9341P4157R8114Q6976M3182k0065
$$ 355818329 355535736 355259781 355036774 354893570 354836540 354855881 354930038 355028152 355115128 355158310 355138245
2275C55138245q2589j22871j27602r5787l7231L4141J06545J71318K19955K40479K19879
$$ 355138245 355055656 354932785 354805183 354709396 354672165 354706306 354812851 354984169 355204124 355444603 355664482
2286C55664482J51825M6578o7788j53236j81236j46523p0267J5297Q6136J41106J96686
$$ 355664482 355816307 355862885 355795097 355641861 355460625 355314102 355243835 355259132 355345268 355486374 355683060
2297C55683060K69050L54767M28352M56772M24042L43666K50702J76277J27373Q6212
$$ 355683060 355952110 356306877 356735229 357192001 357616043 357959709 358210411 358386688 358514061 358600273
2307C58600273L3188k4261m2458L7308K43911N41306Q23708R55963Q37402M57573q6632
$$ 358600273 358633461 358609200 358566742 358604050 358847961 359389267 360212975 361168938 362006340 362463913 362377281
2318C62377281o24389r82094j059418q78677n76897l43208l24021n44052q87260j158638
$$ 362377281 361752892 360770798 359711380 358832703 358255806 357912598 357588577 357044525 356157265 354998627
2328C54998627j195488r67522n98297k88467j90011l18031n67474q29392j111526j554871
$$ 354998627 353803139 352835617 352237320 351948853 351758842 351440811 350873337 350043945 348932419 347377548
2338C47377548k300262l279839m093513m104767k760315L1853L702774P163315R253044
$$ 347377548 345077286 341797447 337703934 333599167 330838852 330870705 334573479 341736794 350989838
2347C50989838R268875P282753M077034P41882j826591l256684l713646l647422l472748
$$ 350989838 360258713 367541466 371618500 372360382 370533791 367277107 363563461 359916039 356443291
2356C56443291l373261l310661l170509k907944k591705k338868k215271k185440k143783
$$ 356443291 353070030 349759369 346588860 343680916 341089211 338750343 336535072 334349632 332205849
2365C32205849j991577j699448j312828r09538n49164k48337R041K47650M85268P31811
$$ 332205849 330214272 328514824 327201996 326292458 325743294 325494957 325503998 325751648 326236916 326968727
2375C26968727R95712J280938J575584J842003K022705K063026J939545J675186J332398
$$ 326968727 327964439 329245377 330820961 332662964 334685669 336748695 338688240 340363426 341695824
2384C41695824R88388P07550N23300M34494M13628M20074M13246L65029K68173J38321
$$ 341695824 342684212 343391762 343915062 344349556 344763184 345183258 345596504 345961533 346229706 346368027
2394C46368027P019r2545j40610j38359j04484o2981l0136r842M006J8119L3455M3068
$$ 346368027 346375046 346282501 346141891 346003532 345899048 345836067 345805931 345796089 345800095 345818214 345851669 345894737
2406C45894737L7422J0109l6735r3002j43128j71471j68228j31645p0496j220N7564
$$ 345894737 345932159 345942268 345905533 345812531 345669403 345497932 345329704 345198059 345127563 345126343 345183907
2417C45183907Q9950Q7967N2376q660q2893j56364k15721k49939k51809k21405j67312
$$ 345183907 345273857 345361824 345414200 345405540 345322647 345166283 344950562 344700623 344448814 344227409 344060097
2428C44060097j04523n1117k0447j8501m0855p6447j12228j37825j47972j41983j23139
$$ 344060097 343955574 343904457 343884010 343865509 343824654 343748207 343635979 343498154 343350182 343208199 343085060
2439C43085060r7351p2861n9051o4736r3574j40648j91841k27928k32239j99165j38016
$$ 343085060 342987709 342914848 342855797 342791061 342697487 342556839 342364998 342137070 341904831 341705666 341567650
2450C41567650o9657j6632O256p62k5788n2490o7978o7444n3901l3722j4115k212m196
$$ 341567650 341497993 341481361 341487617 341486855 341461067 341408577 341340599 341273155 341219254 341185532 341171417 341169205 341165009
2463C41165009k5254o4621j13525j55907j75133j62658j23329p5226m0169l3989o0654
$$ 341165009 341139755 341075134 340961609 340805702 340630569 340467911 340344582 340269356 340229187 340195198 340134544
2474C40134544j11580j70440k20871k48833k46696k13471j56402r0943l6316q926j4114
$$ 340134544 340022964 339852524 339631653 339382820 339136124 338922653 338766251 338675308 338638992 338630066 338615952
2485C38615952m4823q5182j19973j42135j53198j58463j59721j53389j34545j04026
$$ 338615952 338571129 338485947 338365974 338223839 338070641 337912178 337752457 337599068 337464523 337360497
2495C37360497p1373n0774n1498p0382r2773j00975q4801m8256o447K3995L3226K2392
$$ 337360497 337289124 337238350 337186852 337116470 337023697 336922722 336837921 336789665 336783218 336807213 336840439 336862831
2507C36862831m58k6664n0888p1946r0561j06735j20964j35116j52321j75209k01226
$$ 336862831 336862373 336835709 336784821 336712875 336622314 336515579 336394615 336259499 336107178 335931969 335730743
2518C35730743k21824k24915k00157j47133p7133q965L7537N0964L2273o752m9477
$$ 335730743 335508919 335284004 335083847 334936714 334859581 334850616 334888153 334939117 334971390 334964638 334915161
2529C34915161q1291r5215r2468p9918o5003n2528m2801l2615j9150k594J2779J9188
$$ 334915161 334833870 334738655 334646187 334566269 334501266 334448738 334405937 334373322 334354172 334351578 334364357 334383545
2541C34383545R613j8539o0883j05362j38130j47591j29585q9874m0818K861K9717
$$ 334383545 334393158 334374619 334313736 334208374 334070244 333922653 333793068 333703194 333662376 333665237 333694954
2552C33694954L4103J5602k2316p3623j30692j83334k20490k32849k17857j81999j39275
$$ 333694954 333729057 333744659 333722343 333648720 333518028 333334694 333114204 332881355 332663498 332481499 332342224
2563C32342224j05133q9378r1362j01509j07003r8571p5570m4174j3885O523J2665
$$ 332342224 332237091 332147713 332056351 331954842 331847839 331749268 331673698 331629524 331615639 331622162 331634827
2574C31634827K365k3918o4316j14098j64146k02522k17133k00844j55372r2354l0442
$$ 331634827 331637192 331613274 331548958 331434860 331270714 331068192 330851059 330650215 330494843 330402489 330372047
2585C30372047J1254J9722o409n5809j08643j45301j55373j42517j21918j11503j19782
$$ 330372047 330383301 330403023 330396614 330340805 330232162 330086861 329931488 329788971 329667053 329555550 329435768
2596C29435768j41640j58615j52740j16768o1188r308J5526L166l9024r0218j28898
$$ 329435768 329294128 329135513 328982773 328866005 328804817 328795509 328811035 328814201 328775177 328684959 328556061
2607C28556061j43662j37100j22223j12076j13906j24817j36643j41029j34125j18523
$$ 328556061 328412399 328275299 328153076 328041000 327927094 327802277 327665634 327524605 327390480 327271957
2617C27271957r9563q3122p0153n8365m2648k0256N569K5750L0441J4610j5869m5357
$$ 327271957 327172394 327089272 327019119 326960754 326918106 326897850 326903419 326929169 326959610 326974220 326958351 326912994
2629C26912994n6610m1275o256K8801M1733K1515k4300p4806j06278j06658q0185m2839
$$ 326912994 326856384 326815109 326808853 326837654 326879387 326900902 326876602 326801796 326695518 326588860 326508675 326465836
2641C26465836j1979K823K251p820k2049l9711o1150q4495j02768j07079r1820n9738
$$ 326465836 326453857 326456680 326458931 326451111 326429062 326389351 326328201 326243706 326140938 326033859 325942039 325882301
2653C25882301k2239N912J1635j0376n6419j14822j69564k04201k07176j76849j23863
$$ 325882301 325860062 325865974 325877609 325867233 325810814 325695992 325526428 325322227 325115051 324938202 324814339
2664C24814339o8817l3951l2311o0005r7542j18980j07346o4697j2321K1286J4953
$$ 324814339 324745522 324711571 324679260 324619255 324521713 324402733 324295387 324230690 324218369 324239655 324254608
2675C24254608l0937r5444j47362j61361j32103p6790k6398r956m0360j08070j86310
$$ 324254608 324223671 324128227 323980865 323819504 323687401 323610611 323584213 323574257 323533897 323425827 323239517
2686C23239517k43988k59781k29606j66321r0027j9798L2921O3324O9313M8599J869
$$ 323239517 322995529 322735748 322506142 322339821 322249794 322229996 322262917 322326241 322395554 322444153 322446022
2697C22446022o3362j29204j71623j72005j28479o1683n723P897l2044j09596j90201
$$ 322446022 322382660 322253456 322081833 321909828 321781349 321719666 321713943 321721840 321689796 321580200 321389999
2708C21389999k39029k38723j96228j36414q6479o1684o0882p1564q0528q1940p9613
$$ 321389999 321150970 320912247 320716019 320579605 320493126 320431442 320370560 320298996 320218468 320136528 320056915
2719C20056915q2836r8610j26896j59950j85184j91021j72100j32695q5754m8561l5172
$$ 320056915 319974079 319875469 319748573 319588623 319403439 319212418 319040318 318907623 318821869 318773308 318738136
2730C18738136n1136r0484j40858j88427k25258k48184k56157k45304k09980j48068
$$ 318738136 318687000 318596516 318455658 318267231 318041973 317793789 317537632 317292328 317082348 316934280
2740C16934280o9885J259L6507J6784n4397j49384k30408k67753k56233k12612j63823
$$ 316934280 316864395 316865654 316902161 316918945 316864548 316715164 316484756 316217003 315960770 315748158 315584335
2751C15584335j28479j08528r4166p6866n9719n6610q1119j33305j95904k42081k51197
$$ 315584335 315455856 315347328 315253162 315176296 315116577 315059967 314978848 314845543 314649639 314407558 314156361
2762C14156361k20070j63269j05305o6757n7373p5817j13755j60732k05612k36530
$$ 314156361 313936291 313773022 313667717 313600960 313543587 313467770 313354015 313193283 312987671 312751141
2772C12751141k43550k22149j77612j24893q2741o5823p8887j15529j64203k12364
$$ 312751141 312507591 312285442 312107830 311982937 311900196 311834373 311755486 311639957 311475754 311263390
2782C11263390k49558k68097k62489k32067j83964j34373j03054j03626j35632j83200
$$ 311263390 311013832 310745735 310483246 310251179 310067215 309932842 309829788 309726162 309590530 309407330
2792C09407330k22512k34737k14615j70288j18294p2536m1504k8343l3932n8079r6836
$$ 309407330 309184818 308950081 308735466 308565178 308446884 308374348 308332844 308304501 308270569 308212490 308115654
2803C08115654j39790j72519j81828j63841j26133q3218m8542k8019k1209k7123m8256
$$ 308115654 307975864 307803345 307621517 307457676 307331543 307248325 307199783 307171764 307150555 307123432 307075176
2814C07075176q8749j46141k05440k40841k28996j65196p0724J3637M7436J1215q3179
$$ 307075176 306986427 306840286 306634846 306394005 306165009 305999813 305929089 305942726 305990162 306001377 305918198
2825C05918198j99490k95315l40786l29685k77100k09350j52512j23138j25904j54000
$$ 305918198 305718708 305423393 305082607 304752922 304475822 304266472 304113960 303990822 303864918 303710918
2835C03710918j93634k30407k55127k68002k77519k93713l20568l51944l75137l79486
$$ 303710918 303517284 303286877 303031750 302763748 302486229 302192516 301871948 301520004 301144867 300765381
2845C00765381l64800l42788l30201l37677l63044l93257m13762m18148m10976m03080
$$ 300765381 300400581 300057793 299727592 299389915 299026871 298633614 298219852 297801704 297390728 296987648
2855B96987648m02317m07219m10824m07409l99876m00200m21238m66938n26714n79090
$$ 296987648 296585331 296178112 295767288 295359879 294960003 294559803 294138565 293671627 293144913 292565823
2865B92565823o02990n88111n41001m81148m31327m07544m13608m41570m77181n06401
$$ 292565823 291962833 291374722 290833721 290352573 289921246 289513702 289100094 288658524 288181343 287674942
2875B87674942n19066n12256m88625m56715m28772m17156m30965m71649n31579n96046
$$ 287674942 287155876 286643620 286154995 285698280 285269508 284852352 284421387 283949738 283418159 282822113
2885B82822113o48537o76975o77738o54488o15482n69077n22251m82502m59194m62189
$$ 282822113 282173576 281496601 280818863 280164375 279548893 278979816 278457565 277975063 277515869 277053680
2895B77053680m96654n56622o23397o70472o75659o32419n53341m63314l87154l37276
$$ 277053680 276557026 276000404 275377007 274706535 274030876 273398457 272845116 272381802 271994648 271657372
2905B71657372l10917k96765k84519k71931k63786k65789k78702k97565l16601l34740
$$ 271657372 271346455 271049690 270765171 270493240 270229454 269963665 269684963 269387398 269070797 268736057
2915B68736057l57628l93219m45022n08099n69057o12087o26030o07605n61924n00679
$$ 268736057 268378429 267985210 267540188 267032089 266463032 265850945 265224915 264617310 264055386 263554707
2925B63554707m37127l84330l50380l36457l33595l25394k92663k22092j12781K1248
$$ 263554707 263117580 262733250 262382870 262046413 261712818 261387424 261094761 260872669 260759888 260781136
2935B60781136J54781K60925L18718L19653K68535J80760P7190k0962r7713j45912
$$ 260781136 260935917 261196842 261515560 261835213 262103748 262284508 262361698 262340736 262243023 262097111
2945B62097111j68972j79386j94512k29149k87246l58067m16737m32834l83339k64492
$$ 262097111 261928139 261748753 261554241 261325092 261037846 260679779 260263042 259830208 259446869 259182377
2955B59182377r7675P5531K09541K72369K58160J87836R4394O676o3877j22509j78852
$$ 259182377 259084702 259160233 259369774 259642143 259900303 260088139 260182533 260189209 260125332 260002823 259823971
2966B59823971k35596k82879l06186k99988k77138k63386k82211l36685m01383m32415
$$ 259823971 259588375 259305496 258999310 258699322 258422184 258158798 257876587 257539902 257138519 256706104
2976B56706104l87573k48375k9087K28691M74358O66408P83882Q27828Q14876P68738
$$ 256706104 256318531 256070156 256041069 256269760 256744118 257410526 258194408 259022236 259837112 260605850
2986B60605850P12643O65798O39248O35471O48232O66447O79492O83327O83842O94103
$$ 260605850 261318493 261984291 262623539 263259010 263907242 264573689 265253181 265936508 266620350 267314453
2996B67314453P28245P92656Q79631R67541J027469J034432R78203Q68530P31373N99136
$$ 267314453 268042698 268835354 269714985 270682526 271709995 272744427 273722630 274591160 275322533 275921669
3006B75921669M96426M30946L91712L57571L08246K35386J45226N4626j9455o8283
$$ 275921669 276418095 276849041 277240753 277598324 277906570 278141956 278287182 278341808 278322353 278254070
3016B78254070r3460j04656j10950j16768j21003j22070j22967j32503j60561k09789
$$ 278254070 278160610 278055954 277945004 277828236 277707233 277585163 277462196 277329693 277169132 276959343
3026B76959343k71282l26901l59611l64590l53107l46680l62263m00677m44774m70295
$$ 276959343 276688061 276361160 276001549 275636959 275283852 274937172 274574909 274174232 273729458 273259163
3036B73259163m62246m26369l86657l72429m00944m69380n57632o40354o97956p21779
$$ 273259163 272796917 272370548 271983891 271611462 271210518 270741138 270183506 269543152 268845196 268123417
3046B68123417p12795o77281o26507n77182n50099n62629o18744p01657p78618q15334
$$ 268123417 267410622 266733341 266106834 265529652 264979553 264416924 263798180 263096523 262317905 261502571
3056B61502571p93610p20996o25134n38578m82807m61311m66195m87899n22538n70373
$$ 261502571 260708961 259987965 259362831 258824253 258341446 257880135 257413940 256926041 256403503 255833130
3066B55833130o27976o85348p27329p44133p37915p23553p18918p34558p67231q04386
$$ 255833130 255205154 254519806 253792477 253048344 252310429 251586876 250867958 250133400 249366169 248561783
3076B48561783q32653q47035q52489q58593q71220q88252r00154q95577q67920q17050
$$ 248561783 247729130 246882095 246029606 245171013 244299793 243411541 242511387 241615810 240747890 239930840
3086B39930840p49703o75335o03428n41572m94995m67186m59519m70409m94251n21241
$$ 239930840 239181137 238505802 237902374 237360802 236865807 236398621 235939102 235468693 234974442 234453201
3096B34453201n38711n36709n12123m72641m33846m11396m11224m25224m34170m20380
$$ 234453201 233914490 233377781 232865658 232393017 231959171 231547775 231136551 230711327 230277157 229856777
3106B29856777l79123l22934k73018k43568k30484k11945j63536p8468K3212J03302
$$ 229856777 229477654 229154720 228881702 228638134 228407650 228195705 228032169 227953701 227976913 228080215
3116B28080215J27411Q9093J7261l6449k4815O9466K26459L99838N41744O24065O46382
$$ 228080215 228207626 228296719 228313980 228277531 228252716 228322182 228548641 228948479 229490223 230114288 230760670
3127B30760670O29844O02379N85709N89886O15272O55613P02572P45582P73468P76825
$$ 230760670 231390514 231992893 232578602 233168488 233783760 234439373 235141945 235887527 236660995 237437820
3137B37437820P51858P02725O40697N79682N29918M94957M71592M54521M39816M28009
$$ 237437820 238189678 238892403 239533100 240112782 240642700 241137657 241609249 242063770 242503586 242931595
3147B42931595M22973M27933M42066M59137M68331M59270M25949L70427L02352K34681
$$ 242931595 243354568 243782501 244224567 244683704 245152035 245611305 246037254 246407681 246710033 246944714
3157B46944714J78451J37577J07079P6618L6411j6956p7343j31207j64833j70726j54267
$$ 246944714 247123165 247260742 247367821 247444439 247480850 247463894 247386551 247255344 247090511 246919785 246765518
3168B46765518j32522j29147j64795k48546l71476n08651o27079o96888p02362o47030
$$ 246765518 246632996 246503849 246339054 246090508 245719032 245210381 244583302 243886414 243184052 242537022
3178B42537022n50595m40254l40614k67506k27337k21424k49176l08838l94230m92172
$$ 242537022 241986427 241546173 241205559 240938053 240710716 240489292 240240116 239931278 239537048 239044876
3188B39044876n84183o52771o89239o97689o91166o82526o75773o64807o40754o01693
$$ 239044876 238460693 237807922 237118683 236420994 235729828 235047302 234371529 233706722 233065968 232464275
3198B32464275n58662n31273n35545n72834o27060o73847o95820o92768o81019o81782
$$ 232464275 231905613 231374340 230838795 230265961 229638901 228965054 228269234 227576466 226895447 226213665
3208B26213665p06902p51667p99598q33550q46996q45661q41141q40740q43392q42151
$$ 226213665 225506763 224755096 223955498 223121948 222274952 221429291 220588150 219747410 218904018 218061867
3218B18061867q30841q10070p85809p63779p45086p26280p04155o80562o61945o52752
$$ 218061867 217231026 216420956 215635147 214871368 214126282 213400002 212695847 212015285 211353340 210700588
3228B10700588o48918o36883o01196n35717m50592l68347l11318k87761k86808k85130
$$ 210700588 210051670 209414787 208813591 208277874 207827282 207458935 207147617 206859856 206573048 206287918
3238B06287918k61307k07519j31207m8065K9259R6989J57680K14710K67391L13263
$$ 206287918 206026611 205819092 205687885 205639820 205669079 205766068 205923748 206138458 206405849 206719112
3248B06719112L53756L98064M60777N53322O75697Q14515R48753J059895J140003J192035
$$ 206719112 207072868 207470932 207931709 208485031 209160728 209975243 210923996 211983891 213123894 214315929
3258B14315929J224671J246280J261750J274490J289005J311398J345596J388321J427479
$$ 214315929 215540600 216786880 218048630 219323120 220612125 221923523 223269119 224657440 226084919
3267B26084919J445122J425895J364880J271687J167621J078797J026229J019078J051502
$$ 226084919 227530041 228955936 230320816 231592503 232760124 233838921 234865150 235884228 236935730
3276B36935730J104755J154690J180840J174583J142216J099586J062394J035766J010552
$$ 236935730 238040485 239195175 240376015 241550598 242692814 243792400 244854794 245890560 246901112
3285B46901112R69410Q99658Q04291P05680O34461O14223O46801P09133P64428P80677
$$ 246901112 247870522 248770180 249574471 250280151 250914612 251528835 252175636 252884769 253649197 254429874
3295B54429874P46251O74915N96294N39666N17120N18608N17807M87328M14390L08704
$$ 254429874 255176125 255851040 256447334 256987000 257504120 258022728 258540535 259027863 259442253 259750957
3305B59750957J97926J14880Q1310R6817J41525J85795K07634K02236J82266J66893
$$ 259750957 259948883 260063763 260145073 260241890 260383415 260569210 260776844 260979080 261161346 261328239
3315B61328239J67351J78642J82763J61075J07708L5324l0746o7291o5632l5897J15
$$ 261328239 261495590 261674232 261856995 262018070 262125778 262161102 262130356 262063065 261997433 261961536 261961651
3326B61961651K1229J7318q583m4250p6084r4643r5081p7572m5986r518J9569K9202
$$ 261961651 261982880 262000198 261991615 261947365 261871281 261776638 261681557 261603985 261557999 261548481 261568050 261597252
3338B61597252J4915j5792m6483o0253n1918l1872j9950l2807p1506j21212j62201
$$ 261597252 261612167 261596375 261549892 261489639 261437721 261405849 261385899 261353092 261281586 261160374 260998173
3349B60998173j84498j95351k13661k53143l09029l58257l72811l40080k73056k03666
$$ 260998173 260813675 260618324 260404663 260151520 259842491 259484234 259111423 258771343 258498287 258294621
3359B58294621j63765j65291j94550k23331k28501k05974j70288j41354j28364j22834
$$ 258294621 258130856 257965565 257771015 257547684 257319183 257113209 256942921 256801567 256673203 256550369
3369B56550369j05972o2275Q774R0141J56193J84746J65748J04084J5126q0281j62353
$$ 256550369 256444397 256382122 256390896 256481037 256637230 256821976 256987724 257091808 257106934 257026653 256864300
3380B56864300k15798k34413k21729j91097j59684j42021j43318j58081j73836j77059
$$ 256864300 256648502 256414089 256192360 256001263 255841579 255699558 255556240 255398159 255224323 255047264
3390B55047264j59454j20812o8493j4743K5272L8071J6365l6526j05000j65271j94722
$$ 255047264 254887810 254766998 254698505 254683762 254709034 254747105 254763470 254726944 254621944 254456673 254261951
3401B54261951j82418j33877o8112p362L3989N4245O1531O6090P2078P6771P2823N4474
$$ 254261951 254079533 253945656 253877544 253870182 253904171 253958416 254019947 254086037 254158115 254234886 254307709 254362183
3413B54362183K0294k6417p9517j30577j69487j84212j64623j08090k3784O7615J40686
$$ 254362183 254382477 254356060 254276543 254145966 253976479 253792267 253627644 253519554 253495770 253563385 253704071
3424B53704071J76792J71757J37348R3708N8842M0150L3702L0995K6970K4414L1452
$$ 253704071 253880863 254052620 254189968 254283676 254342518 254382668 254416370 254447365 254474335 254498749 254530201
3435B54530201N3329Q3771J04809R3403L6602n7602j57204k18620k07520j18198J9646
$$ 254530201 254583530 254667301 254772110 254865513 254902115 254844513 254687309 254468689 254261169 254142971 254162617
3446B54162617J53675K34070K39048J85604J18236Q3447J03378J64967K30713K60429
$$ 254162617 254316292 254550362 254789410 254975014 255093250 255176697 255280075 255445042 255675755 255936184
3456B55936184K35043J63459P4177k384m6997n4817k9698K2354R4052J71680K33231
$$ 255936184 256171227 256334686 256408863 256406479 256359482 256304665 256274967 256297321 256391373 256563053 256796284
3467B56796284K54039K20376J42211N3101m692m253M9572J22528J71775J72234J31779
$$ 256796284 257050323 257270699 257412910 257466011 257461319 257457066 257506638 257629166 257800941 257973175 258104954
3478B58104954Q4266O7063R8133J66550K41890K94075L07827K84996K36492J72672
$$ 258104954 258189220 258256283 258354416 258520966 258762856 259056931 259364758 259649754 259886246 260058918
3488B60058918J03474M3564J6288M6444J42975K83394M13532M69799M12636K51312
$$ 260058918 260162392 260205956 260222244 260268688 260411663 260695057 261108589 261578388 261991024 262242336
3498B62242336M4384j28860k08531j82056q6117J9913Q8520J07307R9049J01013J40572
$$ 262242336 262286720 262157860 261949329 261767273 261681156 261701069 261789589 261896896 261995945 262096958 262237530
3509B62237530K20337L20320M11320M70085M86908M64058M10556L36399K50779J61895
$$ 262237530 262457867 262778187 263189507 263659592 264146500 264610558 265021114 265357513 265608292 265770187
3519B65770187P7439M215n2128q6632r4566p1526j6880O2256J47839K15645K44121
$$ 265770187 265847626 265851841 265799713 265713081 265618515 265546989 265530109 265592365 265740204 265955849 266199970
3530B66199970K28634J89839J69582K13146L41377N29709P06997P81765O87275M23298
$$ 266199970 266428604 266618443 266788025 267001171 267342548 267872257 268579254 269361019 270048294 270471592
3540B70471592O8436k49005m11892l74260j83143M9591K14805K67945K46067K31628
$$ 270471592 270540028 270291023 269879131 269504871 269321728 269371319 269586124 269854069 270100136 270331764
3550B70331764K87419M12845N52654O49415O97670P47814Q52489R92394J045932Q45166
$$ 270331764 270619183 271032028 271584682 272234097 272931767 273679581 274532070 275524464 276570396 277415562
3560B77415562K93178n31158j363793j865978j801014j167164k08187P13635J297054
$$ 277415562 277708740 277177582 275813789 273947811 272146797 270979633 270771446 271485081 272782135
3569B72782135J432076J211128Q36887N02510L22323L31593N22079Q56552J247902
$$ 272782135 274214211 275425339 276262226 276764736 277087059 277418652 277940731 278797283 280045185
3578B80045185J538220J529445J083222K33726p69310j548576j783638j388798n67360
$$ 280045185 281583405 283112850 284196072 284429798 283660488 282111912 280328274 278939476 278372116
3587B78372116K97279Q49457R39636O66905K76871l815q1158M921J67427L58658N91641
$$ 278372116 278669395 279518852 280458488 281125393 281402264 281398449 281317291 281322212 281489639 281848297 282439938
3598B82439938Q83121J185017J368847J289768Q87489K50454m05159q32405q67310
$$ 282439938 283323059 284508076 285876923 287166691 288054180 288304634 287899475 287067070 286199760
3607B86199760m98886J33000P93190J228618J242943P64847r8019j042556j637288
$$ 286199760 285700874 285833874 286627064 287855682 289098625 289863472 289765453 288722897 287085609
3616B87085609j485328m40254J236324K897339L751793L243885J371212j245747l615627
$$ 287085609 285600281 285160027 286396351 289293690 293045483 296289368 297660580 296414833 292799206
3625B92799206m835911m515686k932129q42533R27410J872425J969490J561051J086597
$$ 292799206 287963295 283447609 280515480 279672947 280600357 282472782 284442272 286003323 287089920
3634B87089920Q51631R54170J351185J943817K590046L053551K995186K098656K99873
$$ 287089920 287941551 288895721 290246906 292190723 294780769 297834320 300829506 302928162 303228035
3643C03228035k034206m153786n241776m845638l156032r36261Q77018J661129J387654
$$ 303228035 301193829 297040043 291798267 286952629 283796597 282860336 283737354 285398483 286786137
3652B86786137N42373k27890m84638j58577N47638J374588K148991K769298L109856
$$ 286786137 287328510 287100620 286615982 286457405 287005043 288379631 290528622 293297920 296407776
3661B96407776K991257K284584J073074k93198j346626j781406j665249j403542j458931
$$ 296407776 299399033 301683617 302756691 302463493 301116867 299335461 297670212 296266670 294807739
3670B94807739k012806k811889l315716l040619j863022q2817J768494L211727L996410
$$ 294807739 292794933 289983044 286667328 283626709 281763687 281680870 283449364 286661091 290657501
3679B90657501M082546L511010K316646N75829j468868l352318m506970m521007l373661
$$ 290657501 294740047 298251057 300567703 301143532 299674664 296322346 291815376 287294369 283920708
3688B83920708j479473M99763J963272K611008K488212J853276R93671J24455n96409
$$ 283920708 282441235 282940998 284904270 287515278 290003490 291856766 292850437 292974892 292378483
3697B92378483j004620r25674k70367Q31013J978512K619609K305184R50584j057529
$$ 292378483 291373863 290448189 290177822 291008835 292987347 295606956 297912140 298862724 297805195
3706B97805195k991848m099693l943921k594204n75389J387519K687645L056183K596951
$$ 297805195 294813347 290713654 286769733 284175529 283600140 284987659 287675304 290731487 293328438
3715B93328438J652851O09703k51637p97557r97448q61645m16641K72064J064262J738644
$$ 293328438 294981289 295590992 295339355 294541798 293544350 292682705 292266064 292538128 293602390 295341034
3725B95341034K038708J753978Q11940o55079k290955l571205l952179l094940j082859
$$ 295341034 297379742 299133720 299945660 299290581 296999626 293428421 289476242 286381302 285298443
3734B85298443J493587L694287M617462L852959J741027p53460k531871k956314k189522
$$ 285298443 286792030 290486317 295103779 298956738 300697765 299944305 297412434 294456120 292266598
3743B92266598j057072n03273r82952k177620l219185l268127k061882q0662J760139
$$ 292266598 291209526 290706253 289723301 287545681 284326496 281058369 278996487 278915825 280675964
3752B80675964K668572K418213J410961L63655j43566L6354O21261J145459J250210
$$ 280675964 283344536 285762749 287173710 287537365 287393799 287430153 288051414 289196873 290447083
3761B90447083Q44345Q4419p53956j407204j693210j530609r45225p9022Q20046J459465
$$ 290447083 291291428 291375847 290621891 289214687 287521477 285990868 285045643 284966621 285786667 287246132
3771B87246132J612358J224937M56067l85762r81540j146126r00154m35925j430K31628
$$ 287246132 288858490 290083427 290539494 290153732 289172192 288026066 287125912 286689987 286688557 286920185
3781B86920185K45228J60026J42956K96726N97687R22413J139908J201820J163349
$$ 286920185 287165413 287325439 287468395 287765121 288362808 289285221 290425129 291626949 292790298
3790B92790298J113816J072101R36261N44605j82324j124057j976033k411708k293511
$$ 292790298 293904114 294976215 295912476 296457081 296274757 295150700 293174667 290762959 288469448
3799B88469448j772919j191558q36430p23438n80159n9108R62524K218666L162594
$$ 288469448 286696529 285504971 284668541 283945103 283364944 283305836 284268360 286487026 289649620
3808B89649620L292732K474366J035079m36592j445922j857510j894989j900005k040062
$$ 289649620 292942352 295416718 296451797 296015205 294569283 292711773 290816784 288916779 286876717
3817B86876717k182007k014485j313591j51939J107368K019082K321834K075615J591301
$$ 286876717 284694710 282680225 281366634 281214695 282322063 284341145 286662979 288738594 290329895
3826B90329895J208229J076393J077824R27849L78894o00585j778183k761345l193779
$$ 290329895 291538124 292614517 293692341 294620190 294999084 294398499 292620316 289858971 286665192
3835B86665192k932167k108307j037770k6836Q07724J584167K519207L676320M767856
$$ 286665192 283733025 281624718 280586948 280560112 281367836 282952003 285471210 289147530 293915386
3844B93915386N175457M239903J690597k038307n836048q335457q539143o316757k497787
$$ 293915386 299090843 303330746 305021343 302983036 297146988 288811531 280272388 273955631 271457844
3853B71457844J506881M346581N302849M506512K734260R41963j94187n10750k97661
$$ 271457844 272964725 277311306 282614155 287120667 289854927 290796890 290602703 290091953 289794292
3862B89794292l8776j18942o38809j398411k027226k180347j709118p33643M13609
$$ 289794292 289755516 289636574 288997765 287599354 285572128 283391781 281682663 280949020 281362629
3871B81362629J343956J789055J706848J261768P02534K18601j32751l93448o11553
$$ 281362629 282706585 284495640 286202488 287464256 288166790 288385391 288252640 287859192 287247639
3880B87247639p72324q11977o95706m83322l12309k95906m14868m93545l01666K79598
$$ 287247639 286475315 285663338 284967632 284484310 284172001 283876095 283461227 282967682 282666016 282945614
3890B82945614J140041J957722K351704K077236J148586j73454j507988k510205k977752
$$ 282945614 284085655 286043377 288395081 290472317 291620903 291447449 289939461 287429256 284451504
3899B84451504k875424k299308j419049m29249M89006J199456J631813J782894J693458
$$ 284451504 281576080 279276772 277857723 277428474 277917480 279116936 280748749 282531643 284225101
3908B84225101J413250R81598M37889j50394o72512j000195j047020q23402m44717
$$ 284225101 285638351 286619949 287057838 286907444 286234932 285234737 284187717 283364315 282919598
3917B82919598p5398J58863K33937K23751K29892K96498L70083L34873J03130l01285
$$ 282919598 282844200 283003063 283237000 283460751 283690643 283987141 284357224 284692097 284795227 284493942
3927B84493942p29599r75170q90255m74892J14003O39877R06525Q46710N35774J32370
$$ 284493942 283764343 282789173 281898918 281424026 281538029 282177906 283084431 283931141 284466915 284599285
3937B84599285k11067m10309m59900m02260k90298j67828o8531j7471k3270o5422r7828
$$ 284599285 284388218 283977909 283518009 283115749 282825451 282657623 282589092 282571621 282548351 282482929 282385101
3948B82385101p5569J2131J26133K00310J84993Q0872o7082k05936l10898l87726m44736
$$ 282385101 282309532 282321663 282447796 282648106 282833099 282913971 282846889 282640953 282330055 281942329 281497593
3959B81497593m65317m13570k71759p5131R6970J71909J36509M3335l9310q5087j23902
$$ 281497593 281032276 280618706 280346947 280271816 280368786 280540695 280677204 280720539 280681229 280596142 280472240
3970B80472240j92451k75154k98672j99833q297J45016J22204r2812l54404m61502
$$ 280472240 280279789 280004635 279705963 279506130 279497833 279642849 279765053 279672241 279317837 278856335
3980B78856335l37830j21689o4125k96078o70795q56361o38752j83354K2297m23164
$$ 278856335 278518505 278396816 278332691 278036613 277365818 276509457 275870705 275687351 275709648 275286484
3990B75286484j386147k146015j940842q18233j27850k099418q537655j9364433l2014447
$$ 275286484 273900337 271754322 269813480 268995247 268867397 266767979 258230324 238865891 206851444
3999B06851444m2272682
$$ 206851444 164578762
4000A64578762
$$ 164578762
##END=$$ End of the data block
