##TITLE=$$ Begin of the data block
##JCAMP-DX=5.00 $$ ACD/SpecManager v 10.08
##SPECTROMETER/DATA SYSTEM=16PC
##DATE=25 Jun 2013 13:52:34
##DATA TYPE=INFRARED SPECTRUM
##DATA CLASS=XYDATA
##ORIGIN=
##OWNER=
##NPOINTS=3601
##FIRSTX=400.00000000
##LASTX=4000.00000000
##MAXX=4000.00000000
##MINX=400.00000000
##MAXY=75.71084595
##MINY=34.86067963
##XFACTOR=1.0000000000
##YFACTOR=0.000000100000000
##FIRSTY=71.15578461
##DELTAX=1.00000000
##XUNITS=1/CM
##YUNITS=TRANSMITTANCE
##XYDATA=(X++(Y..Y))
400G11557846m93545L088531M391174N650788O843261N827713J187821P27615M030915
409G42812119M958877O337662K999801p847595r867401m963150j861114L662338L437271
418G39668808l268433n357513m850617m763412m079056l850021m795532k985459K357941
427G08076706M192810L360519L534089M186172L751297J949310J464310L048935J005859
436G34570007n740890p189255m959106k573243K212983L942947L839493K467193j290588
445G25279541l533783n415268o226959o412277m909058r54361J337738L494492L520050
454G06180115O98318j12991L55682J67389k47268o73981r40094j954346m505157m531861
464F94435806k362976p46918J256943K630463L685913M190674M340668L582763J272888
$$ plain form
400 711557846 711064301 714152832 718544006 724194794 731038055 736865768 738053589 738781204 742812119
409 742812119 747770996 754108658 757108459 749260864 739393463 734430313 732569199 736231537 739668808
418 739668808 736400375 731042862 726192245 721428833 717349777 713499756 708704224 705718765 708076706
427 708076706 712269516 715630035 719164124 723350296 727101593 729050903 730515213 733564148 734570007
436 734570007 728829117 721639862 716680756 714107513 716320496 720263443 724102936 726570129 725279541
445 725279541 721745758 716330490 710103531 703691254 698782196 697827835 699165573 702660065 706180115
454 706180115 706878433 706765442 707121124 707288513 707041245 706367264 705427170 703472824 698967667 694435806
464 694435806 692072830 691325912 692582855 695213318 698899231 703089905 707430573 711013336 712286224
473G12286224N37873Q80737J159439K123795J913528N31693j73798q87146p22427Q72879
483G18522797Q01544r60617j219254l72619k4338L39050K65808m87060m97361K58942
493G16626892K63901l63541n83954n79834o62536q28247p83921n01403l88413m81567
503G11717377k27967N42145N96771K137k77024n30929n64804k76795k68936m79965
513G10232010n55725n83878n70068m06494n20478j014709j053619p19071n22079k00348
523G04085541k93961j053085r37958K15073K08664r05762j139221o80847p63474j367111
533F97367859j339645p57447m67529l15476p1945L55912L66210j31607j76391K65579
543F95095520R7733p74155q80203m26026o1264N33524P29141P19528L54004p07321
$$ plain form
473 712286224 712824097 713704834 714864273 716988068 718901596 719433289 719259491 718372345 717649918 718522797
483 718522797 719324341 718363724 717144470 716771851 716747513 717086563 717352371 716865311 716367950 716626892
493 716626892 716890793 716527252 715943298 715363464 714700928 713872681 713088760 712587357 712198944 711717377
503 711717377 711489410 712031555 712628326 712630463 712353439 711822510 711257706 710980911 710711975 710232010
513 710232010 709676285 709092407 708522339 708115845 707595367 706580658 705527039 704807968 704285889 704085541
523 704085541 703791580 702738495 701800537 702015610 702224274 701318512 700179291 699498444 698734970 697367859
533 697367859 696028214 695270767 694803238 694487762 694415817 694771729 695137939 695006332 694829941 695095520
543 695095520 695193253 694419098 693538895 693112869 693051605 693585129 694314270 695033798 695387802 694680481
553F94680481r53674m55933m43649p34787q31146r78699o92139K84882M39148j36338
563F90178146l00140k72064l16849l79562m16031l75290n05676r22471r18121o06766
573F85165176k40860O33011M50897q71429j436233j844178j593094l51181M9820J55869
583F80117798l88107k157212k497406j667022j289368q59528p76520r65118j329880
592F68187637j991501k564239l202438l676148l910065m436492n225907n866546o846886
601F30467415o625672n148887m175873l136406k555122k487679k190361j811485j503716
610F00832214j194954j020660j068382q53768m58717m3640M73289R24111J465797J638146
620F00693436J444587J330376J253853R35097K41966k0256J07994j9302j66169o32515
$$ plain form
553 694680481 693726807 693270874 692827225 692092438 691261292 690282593 689590454 689875336 690314484 690178146
563 690178146 689878006 689605942 689289093 688909531 688493500 688118210 687612534 686690063 685771942 685165176
573 685165176 684924316 685557327 686008224 685136795 683700562 681856384 680263290 679912109 679961929 680117798
583 680117798 679729691 677572479 675075073 673408051 672118683 671259155 670482635 669517517 668187637
592 668187637 666196136 663631897 660429459 656753311 652843246 648406754 643180847 637314301 630467415
601 630467415 623841743 618692856 614516983 611380577 608825455 606337776 604147415 602335930 600832214
610 600832214 599637260 598616600 597548218 596694450 596235733 596192093 596665382 597589493 599055290 600693436
620 600693436 602138023 603468399 604722252 605657349 605899315 605879059 605987053 605967751 605801582 605169067
630F05169067j792221j852035p62940n17578j056442o25610O51817J513977K425652
639F03153687K787857K487182K573700K809296L093262L757209L574639K557983J883240
648F28678055Q39233J091995K906533L553886L622513L485184K944717K414932J733780
657F51270828J133499N70069j6251p30286j095275j325608j040954J278381q27789
666F49216614r354553r861718l438720j69983L288994L643493O9885q44497j00861
675F32448654k84653j069564j177063p29790n16434k20070l20892j007538j046219
684F26076431n60264k91596J58806o5575j000633j648445k504578k587318j683960
693F15892868j628876k337188k314835j956940j176338Q3428J507759L730545M527549
$$ plain form
630 605169067 603376846 601524811 600761871 600244293 599187851 598562241 599214058 600728035 603153687
639 603153687 605941544 608428726 611002426 613811722 616904984 620662193 624236832 626794815 628678055
648 628678055 629517288 630609283 633515816 637069702 640692215 644177399 647122116 649537048 651270828
657 651270828 652404327 652974396 652958145 652227859 651132584 649806976 648766022 650044403 649216614
666 649216614 639862061 630000343 626561623 626391640 629680634 633324127 633394012 632549515 632448654
675 632448654 632164001 631094437 629917374 629187584 628671150 628451080 628130188 627122650 626076431
684 626076431 625516167 625224571 625383377 625317802 624317169 622668724 620164146 617576828 615892868
693 615892868 614263992 611926804 609611969 607655029 606478691 606562119 608069878 611800423 616327972
702F16327972L937493M028091M756928M224281K428551J272430J95999m63257j798858
711F34909630K23388O682396R225159R964447Q799820M234009K353973K115479J604538
720F80112839J515350R83963J25198o60171j297455k488632m438858n628891o901932
729F61321411o404419m357834j730194K678375N035401O429443O338577M067002K918472
738F76296234K122879J454315J034012O02036J06353J4801L12806N90515J005935J336823
748F84876709J809311J740188R69239Q20389J048278J310349J798401K086868K427826
757F98887558K238541J407165R63669N18570N98907J408310J604081J433105J250076
766G10309982Q37097P10221Q07800Q59680R99985R62906P39593O29654N79834N01404
$$ plain form
702 616327972 620265465 624293556 629050484 633274765 635703316 636975746 637171745 636708488 634909630
711 634909630 635133018 641815414 651040573 661005020 669804840 674038849 676392822 678508301 680112839
720 680112839 681628189 682612152 682737350 682077179 680779724 678291092 673852234 668223343 661321411
729 661321411 654916992 650559158 648828964 651507339 656542740 662972183 669310760 673377762 676296234
738 676296234 678419113 679873428 680907440 681509476 681615829 681630630 681943436 682533951 683539886 684876709
748 684876709 686686020 688426208 689395447 690215836 691264114 692574463 694372864 696459732 698887558
757 698887558 701126099 702533264 703496933 704015503 704614410 706022720 707626801 709059906 710309982
766 710309982 711147079 711857300 712665100 713524780 714524765 715487671 716227264 716856918 717436752 717938156
776G17938156M49677K88925p3166j31607J15204J53503Q1024K1057l6544j75705m89426
787G18141098n24063k44598k44446l90015o23703j155624j203995q92639n08805K77253
797G12630463M30832j85929J1673J177521J110306k64359m50363M17709L80021n20707
807G14737167m98047L80478N95398M01917K94723Q2016L3341J54724J52130K73514
817G16607361j80283j953354j370697K641220K110978k969284m600068m331359l966294
826G01988220k792816j859207r08585P6981J626205J603852m09546o03943O22253J050721
836G00394135J442947R70840q58612j245193m16031k64664l54767n38406j080704j070785
846F96978760o64215j50452R48181J008530O7520l99857q25653r57260o90460o97632
$$ plain form
776 717938156 718387833 718676758 718603592 718471985 718587189 718740692 718821716 718842773 718806229 718630524 718141098
787 718141098 717617035 717372437 717127991 716737976 716114273 714958649 713754654 712862015 712353210 712630463
797 712630463 713061295 712875366 712887039 714064560 715174866 714910507 714460144 714877853 715257874 714737167
807 714737167 714239120 714619598 715214996 715616913 715911636 715993652 716026993 716181717 716333847 716607361
817 716607361 716427078 714473724 713103027 715744247 717855225 714885941 710285873 705954514 701988220
826 701988220 699195404 697336197 696427612 696504593 698130798 699734650 699325104 698721161 699343414 700394135
836 700394135 701837082 702807922 701949310 700704117 700288086 700023422 699668655 699130249 698049545 696978760
846 696978760 696314545 696164093 697112274 698120804 698188324 697788467 696962814 696005554 695315094 694617462
856F94617462p73849j066971j729965k003861j772919k260894l329544m312287n145035
865F72222137o750564q157044j2332458k0434113k4866600l1190147k4762154l517151
873E40211906R639512K2208442K7092438K3609657K1584740J8162460J4937210J0955582
881F88401947Q434067P198791N725632M526367L074417J224976Q3465n78155r53445
890G17138062q18253q76923j021118r79919o85196o83136r16901j070556j323166j273423
900G07489471p59124q29926j396179j768570k236633k334137k058258j888733j690598
909F92527313j527099j474839j164474n02091k33688k46506k48413l45917m06799m44412
919F85933075n39551p82699p33567l52401k41547k32468l98407r04541j018295p84607
$$ plain form
856 694617462 693843613 692776642 691046677 689042816 687269897 685009003 681679459 677367172 672222137
865 672222137 665471573 657314529 644982071 624547958 599681358 568491211 543729057 540211906
873 540211906 549851418 572059860 599152298 622761955 644346695 662509155 677446365 688401947
881 688401947 696836014 704034805 709760437 714286804 717361221 718586197 718669662 718091507 717138062
890 717138062 716319809 715442886 714421768 713441849 712756653 712073517 711156616 710086060 708762894 707489471
900 707489471 706730347 705900421 704504242 702735672 700499039 698164902 696106644 694217911 692527313
909 692527313 691000214 689525375 688360901 687858810 687625122 687378616 687130203 686784286 686377487 685933075
919 685933075 685393524 684610825 683877258 683524857 683283310 683050842 682652435 681747894 680729599 679944992
929F79944992p58438p99179r13620j147461j312027j484146j546860j496811j465072
938F69021378j377106j400528j532059j617203j673202j785507j965790k085190k096405
947F53488388k321472k827683l026428k932586l079415l472786l557930l457527l235130
956F25577431k799988k453804k041817j882553k054939j926155j696358j201630l82652
965F09137535L59306J183014J853218K440682K894668L231278L434677L517609L444214
974F31496201L113708K963562K920837K838364K839356K574691J970520J670609J603851
983F53991699J410446J154251R36738P81021M91638k2202k04773j23291o7444R2011
993F58440094J27335J00860j2665k74429m16260m61578n88379p58667r49173j137695
$$ plain form
929 679944992 679186554 678387375 677473755 676326294 675014267 673530121 671983261 670486450 669021378
938 669021378 667644272 666243744 664711685 663094482 661421280 659635773 657669983 655584793 653488388
947 653488388 651166916 648339233 645312805 642380219 639300804 635828018 632270088 628812561 625577431
956 625577431 622777443 620323639 618281822 616399269 614344330 612418175 610721817 609520187 609137535
965 609137535 609496841 610679855 612533073 614973755 617868423 621099701 624534378 628051987 631496201
974 631496201 634609909 637573471 640494308 643332672 646172028 648746719 650717239 652387848 653991699
983 653991699 655402145 656556396 657493134 658274155 658765793 658743591 658538818 658415527 658348083 658440094
993 658440094 658567429 658668289 658655624 658381195 657964935 657503357 656914978 656156311 655207138 654069443
1003F54069443j438141j771927k341766l195801l938675m677734n382309o050339o723633
1012F18549118p313766q132935r679794r648285q965264o232261m36554K971878N503921
1021E76616058O566010N651741N377998N098114M781952M305611M192085M560471M408149
1030F21558189L855210L423233L066063K443313J456490Q38051L79066J81923K58217
1039F37459755M58221R52950J206207J361618J380387J181106J125870J202545J094132
1048F47422791Q24661O11572L67355K21787K16446N4626k76565m30146l84292n75104
1058F48053131r35058j297455j814576k047348j951675k143173k636643k759475k607117
1067F29860611k472382k366066j953353j231690n47867L17078Q30879J144180J184693
$$ plain form
1003 654069443 652631302 650859375 648517609 645321808 641383133 636705399 631323090 625272751 618549118
1012 618549118 611235352 603102417 593422623 583774338 574809074 568576813 568140259 571112137 576616058
1021 576616058 583182068 588833809 594211807 599309921 604091873 608397484 612589569 617150040 621558189
1030 621558189 625413399 628836632 631902695 634346008 635802498 636640549 637019615 637201538 637459755
1039 637459755 637917976 638870926 640077133 641438751 642819138 644000244 645126114 646328659 647422791
1048 647422791 648247452 648859024 649226379 649448166 649664612 649719238 649442673 649012527 648628235 648053131
1058 648053131 647118073 645820618 644006042 641958694 640007019 637863846 635227203 632467728 629860611
1067 629860611 627388229 625022163 623068810 621837120 621289253 621606331 622437210 623581390 624766083
1076F24766083P45086P25480J098899J071206P65800M83284J18027k09580n91507p83004
1086F28189774q14667q08945o41594o89010q07534j197357k012939k436180k543908
1095F16237640k848892l308983l581047l839035l731003l508796k518654n85098R34829
1104E93250961K806435L324051K684097J806030J42098j039734k113838k850762l272781
1113E94736557l521194l629227l323784k652168j700859k50588R07173J964836K941132
1122E85471878L978462M487763M501838M476281M257202M001617L720284L211975K370376
1131F20477676J821518J449356J091004O97098O24923R90372R68933O08215N40734
1140F29269829P12395P04040O10580M68750K38648M0283k75841k33650K34146L82653
$$ plain form
1076 624766083 625511169 626236649 627335548 628406754 629172554 629655838 629773865 629564285 628972778 628189774
1086 628189774 627375107 626566162 625924568 625235558 624428024 623230667 621217728 618781548 616237640
1095 616237640 613388748 610079765 606498718 602659683 598928680 595419884 592901230 592316132 593250961
1104 593250961 596057396 599381447 602065544 603871574 604013672 602973938 600860100 598009338 594736557
1113 594736557 591215363 587586136 584262352 581610184 579909325 579658737 580565910 582530746 585471878
1122 585471878 589450340 593938103 598439941 602916222 607173424 611175041 614895325 618107300 620477676
1131 620477676 622299194 623748550 624839554 625536652 626161575 627151947 628120880 628729095 629269829
1140 629269829 629982224 630686264 631296844 631765594 632004242 632044525 631768684 631535034 631769180 632151833
1150F32151833L08990L66707N39513N36232L76434K68936K23160r041m66843p45277
1160F33550644r77783j039238r09577p97043o45637m74205k05269j33285k82059k62261
1170F27824287j57814k2888K65351K69165j3581j38283k37236k28157K3613j03225
1180F27481232o02265q79745j023064j277199j692810j822929j622200j722794k163200
1189F14675026k158623j801758j508712j170121q10890l59993p7743J4801K59399O76384
1199F07737770Q42323P32193Q67615J267891J332283J163979R50813N54085L39737
1208F15788689K22931J77116L09257K16256r0638k55813l18985m79241n69114j059265
1218F13941193k006531k713471l267974m017373m916420n800705o974258p387390p225494
$$ plain form
1150 632151833 632460823 632827530 633367043 633903275 634279709 634548645 634771805 634762764 634295921 633550644
1160 633550644 632572861 631533623 630624046 629827003 629181366 628707161 628501892 628368607 628086548 627824287
1170 627824287 627666473 627643585 627908936 628178101 628164520 628026237 627789001 627560844 627584457 627481232
1180 627481232 626878967 625999222 624976158 623698959 622006149 620183220 618561020 616838226 614675026
1189 614675026 612516403 610714645 609205933 608035812 607224922 606864929 606787186 606801987 607061386 607737770
1199 607737770 608580093 609312286 610179901 611447792 612780075 613944054 614894867 615448952 615788689
1208 615788689 616011620 616188736 616497993 616714249 616623611 616367798 616048813 615569572 615000458 613941193
1218 613941193 611934662 609221191 605953217 601935844 597019424 591218719 584244461 576857071 569631577
1227E69631577o797333n777130n159836m680863m405517m357071m378815m595985m666825
1236E24812202m685401m620553m478683m266014l895302l711929l712883l566284l317337
1245D88557816l119469k945213k752762k408028k490997l177643l185501k968102j995315
1254D63514786J64757J251945J914749J818886O25114K3842l66935p10717j075248
1263D67161179j028557n53856j53504K51503Q45910J693267K351036K928734L430863
1272D76926575L830414M228591M725686M816055M434585M347115M432182M406929M391671
1281E16539803M184722L769150L411064K939225K772102K827644L015519L404121L808250
1290E46671600M450341M624595M391442M214744M091034L568192K438049J981735K113114
$$ plain form
1227 569631577 562834244 557057114 551897278 547216415 542810898 538453827 534075012 529479027 524812202
1236 524812202 520126801 515506248 511027565 506761551 502866249 499154320 495441437 491875153 488557816
1245 488557816 485438347 482493134 479740372 477332344 474841347 471663704 468478203 465510101 463514786
1254 463514786 463679543 464931488 466846237 468665123 469290237 469314079 468947144 468236427 467161179
1263 467161179 466132622 465578766 465425262 465676765 466522675 468215942 470566978 473495712 476926575
1272 476926575 480756989 484985580 489711266 494527321 498961906 503309021 507741203 512148132 516539803
1281 516539803 520724525 524493675 527904739 530843964 533616066 536443710 539459229 542863350 546671600
1290 546671600 551121941 555746536 560137978 564352722 568443756 572011948 574449997 576431732 578544846
1299E78544846J895446J450272J227150J179237J044236Q49990P44324P61528O17256
1308E88314285L01590J37825J56861q9379o38275q93326q77151j099129j515388j794587
1318E82003326k028427k183685k264252k290268k297401k122879j720200j441230j190415
1327E64464569j001358r16748p31926n33829j79748K62718R18884J803398K728691
1336E66814651M042855M540214M307022M203339M110794L641358K751846K002945J300125
1345E97715149M57497p13578j272926j328697j388321j376381j089096l24707r6092
1354E90582848m52538j85013P04766J011619J036148P80106Q3923m17938j162758j035919
1364E90945244L50685L27835r38187j445999j688461j699219j063347j408348k866249
$$ plain form
1299 578544846 580440292 581890564 583117714 584296951 585341187 586191177 586935501 587697029 588314285
1308 588314285 588615875 588753700 588910561 588821182 588182907 587289581 586412430 585313301 583797913 582003326
1318 582003326 579974899 577791214 575526962 573236694 570939293 568816414 567096214 565654984 564464569
1327 564464569 563463211 562546463 561814537 561280708 561100960 561363678 562282562 564085960 566814651
1336 566814651 570857506 575397720 579704742 583908081 588018875 591660233 594412079 596415024 597715149
1345 597715149 598172646 597459068 596186142 594857445 593469124 592092743 591003647 590678940 590582848
1354 590582848 590130310 589945297 590650063 591661682 592697830 593477936 593561859 593143921 591981163 590945244
1364 590945244 591295929 591623764 590685577 589239578 587551117 585851898 584788551 583380203 580513954
1373E80513954l282814l097534k708664j768799j270790j029014p93229p72247l83606
1382E65407257O17294O66123m7455p17621k004623k076149q66432m71573m2191q80737
1392E59583893l656616m392395l471375l340225l322144l681411m972687m713059k443580
1401E25590401k483368m496575n510788o347885o693382o308098o466369p061959p248153
1410D72973824p173806p091522p009735o642799n552063n779992p274131q204689r531746
1419D08713341r245644o569366o621857r925385r274711n284996k703209L85284J065979
1428C60539436q11348j734733k939949k995949j876373j118164m56124N82238K274971
1437C51464005L036994L169289L051987K478142J894722J071929M81110r54l54499
$$ plain form
1373 580513954 577231140 574133606 571424942 569656143 568385353 567356339 566563110 565790863 565407257
1382 565407257 566024551 566690674 566643219 565925598 563920975 561844826 560978394 560506821 560464630 559583893
1392 559583893 555927277 551534882 548063507 544723282 541401138 537719727 532747040 528033981 525590401
1401 525590401 523107033 518610458 513099670 506751785 500058403 493750305 487283936 480221977 472973824
1410 472973824 465800018 458708496 451698761 445055962 439503899 433723907 426449776 418245087 408713341
1419 408713341 399467697 392898331 386276474 376351089 367076378 361791382 359088173 359473457 360539436
1428 360539436 359728088 357993355 355053406 352057457 350181084 349062920 348606796 349189034 351464005
1437 351464005 354500999 357670288 360722275 363200417 365095139 366167068 366648178 366647224 366292725
1446C66292725o51131o26793j04675n9357o44226k73933J440773J357307p55577q30612
1456C65144501Q44230J350861J106033J360436K074203K156029J465569J653900K561569
1465C79717331L175278L669510M357566N604515N633316M204522M050483M957695N046616
1474D20416832M515648M449844M741669M732819M495391M396668M234810M447441N219230
1483D61650352N370865N026093M868278M800568M523735L694801L985367N480080O168823
1492E05568962O700058O488533N162964M790573N072556N136985M975777N489121O774902
1501E56160431P539291Q983841P596016K300034R10530K209396L254166N713234N855102
1510F00522041L299446L299256N887260N676766K673874K239456L817787M270782N133629
$$ plain form
1446 366292725 365641594 365014801 364910126 364850769 364206543 363932610 365373383 366730690 365975113 365144501
1456 365144501 365988731 367339592 368445625 369806061 371880264 374036293 375501862 377155762 379717331
1465 379717331 382892609 386562119 390919685 396524200 402157516 406362038 410412521 415370216 420416832
1474 420416832 424932480 429382324 434123993 438856812 443352203 447748871 451983681 456431122 461650352
1483 461650352 467021217 472047310 476915588 481716156 486239891 489934692 493920059 499400139 505568962
1492 505568962 512269020 518757553 523920517 528711090 533783646 538920631 543896408 549385529 556160431
1501 556160431 563699722 572683563 580279579 582579613 583490143 585699539 588953705 594666939 600522041
1510 600522041 603821487 607120743 613008003 618684769 621358643 623598099 627415886 631686668 636820297
1519F36820297L401795l024826k743493N028954N754700M24194l88184J726609K558746
1528F49558792L274155L416595L509751J913299l446350k634277N122909O796341M993210
1537F72504425K311249m498978n037536P24258K269287J281052J542053K348709K732468
1546F76176987L126678K764893J050720J134415L371734L186951j31683Q34961P527160
1555F99042816O760559o71386m758378j0291061q118133M843902P106323M12674p25937
1564F93601379J214753J626205K274551P03812m915695m811096R60846K851944L895263
1573F97401962J507340p274628q016586j501618R67026K159653K297592L60031K09580
1582F88110352J575012J677017P72934O09665J076660Q65707k0980k84424q0338q6288
$$ plain form
1519 636820297 640222092 637197266 634453773 639482727 645237427 645661621 645273437 647000046 649558792
1528 649558792 652832947 656249542 659759293 661672592 658226242 655591965 660714874 667511215 672504425
1537 672504425 674815674 670316696 665279160 666003418 668272705 669553757 671095810 673444519 676176987
1546 676176987 679303665 682068558 683119278 684253693 687625427 690812378 690680695 691515656 699042816
1555 699042816 705803375 705131989 700373611 690082550 681964417 686808319 693914642 694327316 693601379
1564 693601379 694816132 696442337 698716888 699420700 694505005 689693909 690654755 693506699 697401962
1573 697401962 698909302 691634674 683618088 682116470 683083496 685243149 687540741 687900772 688110352
1582 688110352 689685364 691362381 692135315 692744980 693821640 694687347 694666367 694381943 694301605 694215317
1592F94215317q8959k66037p03888q79974r74884p93000k18353Q8196K41013M43725
1602F91063156O48728Q39462J196136J011124J31378j25580N9357R1019l62168O21338
1612F95173950M616547L399124l979492n501251l215332r44367M087906M596481Q13294
1621F99046860r06449k758560k316971J635132J802445j645813k090683o97403N72433
1630F92640991L058701L361206K646942l54080q896790q693924P94144L121643N91736
1639F88270569M36554R68933J703033M163208K734681l797760m961701l004837N90363
1648F87103043J0403137R598465j778336p075577j2441864r936065L984451P204285
1656F87061539K129287J249543K606659J544036k054977l068924k780456j180878L602524
$$ plain form
1592 694215317 694126358 693860321 693156433 692276459 691301575 690508575 690290222 690378418 690619431 691063156
1602 691063156 691711884 692551346 693747482 694758606 694889984 694764404 694823761 694914780 694552612 695173950
1612 695173950 699790497 703189621 699210129 693708878 690493546 689549179 693637085 698233566 699046860
1621 699046860 698140411 695381851 693064880 694700012 696502457 694856644 692765961 692068558 692640991
1630 692640991 695699692 699060898 701707840 701353760 692456970 683763046 684557190 687678833 688270569
1639 688270569 688707123 689676056 691379089 695542297 698276978 694479218 689517517 686512680 687103043
1648 687103043 697506180 707104645 705326309 698250732 685808868 675872803 679857254 687061539
1656 687061539 689190826 690440369 693047028 694591064 692536087 689467163 686686707 685505829 689108353
1665F89108353M067917R49630j190719n119553m334869K439727L595124R22928j136551
1674F89301987n687943m755096L025818M222641q67157m273Q634796N515061j2067032
1683F87318802j3764115j600341K172546K455902J893540j999588j927643K027969
1691F76577072K894898K761840K43149q035660p193527N592346M147034j2277832j4516373
1700F50192947n479354k689591j333466l145217j0602951j2059899q290520p844696
1708E98747253r538192r558678q416405p883301p337799p497100q313179r261132j1951217
1717E18990250j0470848m100075j631508j529465j143684j748314q97904J652489K477188
1726E01598129J715393K235909L669967M621735O471901N090942j699218j059761P018776
$$ plain form
1665 689108353 693176270 694125900 692935181 687815628 683480759 685920486 689515610 690438538 689301987
1674 689301987 683614044 678858948 681884766 686107407 685240250 685235977 693870773 699385834 687318802
1683 687318802 673554687 671954346 674126892 676582794 678476334 676476746 674549103 676577072
1691 676577072 679471970 682233810 682476959 674441299 667247772 672840118 676987152 664709320 650192947
1700 650192947 644713593 642024002 640690536 637545319 626942368 614882469 606591949 598747253
1708 598747253 589209061 579650383 571233978 563350677 556012878 548515778 540202599 530941467 518990250
1717 518990250 508519402 504419327 502787819 501258354 500114670 498366356 497468452 499120941 501598129
1726 501598129 503313522 505549431 509219398 513841133 520313034 525403976 523704758 522644997 529663773
1735E29663773R657402R377708Q969803O462555O948471J0850449J1382827Q956642
1743F02269630Q712769J0274162J0006447Q381386P144699N802841M582901K716522
1751F59891357L047486O699753O332168J897354R25522K500534K755203L073197J785049
1760F88907623k528457k522202J971436K936401J652985J014175k42691M0283L073731
1769F94303284J854400m660110n299835q17261O24847O15845R59168J583328R68704
1778F90132370j544495j798629J45187L71704n61218r70383j553955j204987M35563
1787F83451157Q22067Q84552n54123n080185n172043j154175P46994K325287K628556
1796F78898087J210937Q06809R49096P69654K18353L61252J344223J513900J109162
$$ plain form
1735 529663773 539321175 548698883 557668686 564131241 571079712 581930161 593312988 602269630
1743 602269630 610982399 621256561 631263008 639644394 646789093 652591934 657174835 659891357
1751 659891357 662938843 669638596 675970764 677868118 678793640 681294174 684049377 687122574 688907623
1760 688907623 686379166 683856964 685828400 688764801 690417786 691431961 691189270 691229553 694303284
1769 694303284 696157684 691497574 686197739 685380478 686005325 686621170 687580338 689163666 690132370
1778 690132370 688587875 686789246 686934433 687306137 686744919 685774536 684220581 683015594 683451157
1787 683451157 684273224 685157776 684603653 679523468 674351425 673197250 673944244 676269531 678898087
1796 678898087 680109024 680915833 681864929 682634583 682852936 683214188 684558411 686072311 687181473
1805F87181473Q28247N77011L1433j152039j276016m42505N8213P87735P86056n2032
1815F87327576l45917l72162m07486o21796n9127K027053J693497j467209j882782
1824F85891647j49002N43061J492004O95038k966156l019333M67071J294556M34418
1833F84683304J99814J8081j34201m40826j47095Q28018J405259K728652J300583m447174
1843F85994415m747696K50397J374207K2888k29340k22702j70669P9879J28479K137
1853F82481995p172J13754J8387l67203m01992j13450l5781j42594o637L12347O25610
1864F82477264J482697Q71887j639099k312469j869431j164627O69937J015625l8605
1873F79493179k30560N9586R0408J0452l7155j15662j18713j7166l6469k67257j23978
$$ plain form
1805 687181473 688009720 688586731 688618164 687466125 686190109 685747604 685805817 686593552 687379608 687327576
1815 687327576 686981659 686609497 686202011 685580215 685521088 687548141 689241638 687774429 685891647
1824 685891647 685742645 686285706 687777710 688472748 685506592 682487259 682954330 684248886 684683304
1833 684683304 684883118 684901199 684766998 684326172 684179077 685007095 686412354 689141006 690441589 685994415
1843 685994415 681246719 681497116 682871323 682894211 682664871 682442169 682271500 682351379 682479858 682481995
1853 682481995 682474823 682588577 682606964 682239761 681837769 681724319 681688538 681545944 681539307 681851654 682477264
1864 682477264 683959961 684831848 683192749 680880280 679010849 677846222 678516159 679531784 679493179
1873 679493179 679262619 679322205 679412613 679423065 679385910 679270248 679151535 679134369 679097900 678830643 678706665
1884F78706665N32837N58166J45874l34930j519928j239319R28879J124878m38919
1893F78464203p52945k73209j86462k92816k06681R7275J30158j11847j26572O5842
1903F76806946M0512k16751k27204M7455k6474n12848n24292k00958J26877P67441
1913F76080704Q16803N03082j84326k024613j891174M73251R12476l9597l65982o46820
1923F73633804n81741J221J13220j52130j80207p0343m2724n8365n5313J1215r9716
1934F72518921n29022m72565L2196L28827Q42285N28565r65348j185150l14712p5608
1944F70708389j07040j33286k81067l20205l43094k11258J99814K52228l1434j05896
1954F69627151p5302p1258n2948n3177j04446m7455J35193K12707L02277J65252k81143
$$ plain form
1884 678706665 679239502 679797668 679943542 679608612 678088684 676849365 677778244 678903122 678464203
1893 678464203 677711258 677438049 677251587 676958771 676752090 676849365 676979523 676867676 676741104 676806946
1903 676806946 676847458 676630707 676403503 676450958 676424484 675911636 675387344 675186386 675313263 676080704
1913 676080704 676897507 677400589 677216263 675191650 673300476 673773727 674686203 674646606 674280624 673633804
1923 673633804 673052063 673053284 673166504 673014374 672834167 672763824 672721100 672662735 672607422 672618637 672518921
1934 672518921 671989899 671517334 671549530 671878357 672720642 673249207 672283859 671098709 670783997 670708389
1944 670708389 670601349 670468063 670186996 669866791 669523697 669312439 669512253 669764481 669733047 669627151
1954 669627151 669551849 669480591 669427643 669374466 669270020 669222565 669357758 669570465 669872742 670037994 669756851
1965F69756851m68979n83877m54407Q3923K00730k8076p7973n2261o3172r0789j05896
1976F68116074j36643j00784N0506L8376j63040j73340j3809J9074k9374m4097o0349
1987F67502594n6229M3412q4916n53588n89600k35367r4375l1205J2131K2659p171
1998F65928345j18485j41830j09482o2180N0049O3858J6709p9651l18985l40424j55258
2009F64732666q2932o8664j5488J05591P9193r6359k00729l46680l05634M58L0060
2020F63831482k10037k07901O86M4556j373o8894k48718k47955n9357p629k0752o4087
2032F62740021j91040k25754k03629j62353o9580j8616K7924J4496p3166j24436j78375
2043F61535492j90964j62353j39237j15661o8894M8142K3117k02179j83563J31378
$$ plain form
1965 669756851 669287872 668703995 668249588 668333511 668534241 668506165 668428192 668375931 668312759 668221970 668116074
1976 668116074 667979431 667878647 667929153 667967529 667804489 667631149 667617340 667636414 667607040 667562943 667502594
1987 667502594 667446365 667489777 667404861 666851273 666261673 666026306 665931931 665900726 665912857 665935516 665928345
1998 665928345 665809860 665668030 665558548 665496368 665546417 665610275 665626984 665547333 665228348 664887924 664732666
2009 664732666 664649734 664581070 664565582 664671173 664750366 664654007 664453278 664106598 663800964 663801422 663831482
2020 663831482 663621445 663413544 663414230 663458786 663457413 663388519 663139801 662891846 662832489 662824860 662804108 662740021
2032 662740021 662548981 662323227 662119598 661957245 661887665 661869049 661896973 661911469 661838303 661713867 661535492
2043 661535492 661344528 661182175 661042938 660927277 660858383 660906525 660929642 660727463 660543900 660675278
2053F60675278Q6746l36380m06494k18888j24893k5787L1738P6294L6698j14213j96685
2064F59483414k94419k53906m6768N7449J75019J08947k13852l05633k42005k08358
2074F58259888j21155j32523k68478k76566k20794r9869J89514K29874L9291m0512
2084F57558670q7051j32752j77383j90735j87912j41602j2893J1673m6692q8196j61438
2095F56343689j72348j58310o5613K29340J78375k77786l56674j25351r8725k17895
2105F55278702k05307q6060l8910l3798j4801M2419j7623k30332l01361l21884k25067
2116F53845978P6599J65710J44959J9073l42178m24881l00140k00272j4038M6005K0447
2127F53037262m1428k20794k46048j22986j02081j66626j34964M043K2431n3635j01395
$$ plain form
2053 660675278 660762024 660425644 660019150 659800262 659675369 659649582 659681320 659757614 659794312 659680099 659483414
2064 659483414 659188995 658935089 658888321 658945770 659120789 659229736 659015884 658710251 658468246 658259888
2074 658259888 658138733 658006210 657737732 657461166 657240372 657140503 657330017 657559891 657599182 657558670
2084 657558670 657471619 657338867 657161484 656970749 656782837 656641235 656628342 656640015 656593323 656505127 656343689
2095 656343689 656171341 656013031 655947418 656176758 656355133 656077347 655720673 655595322 655496597 655278702
2105 655278702 655073395 654987335 654948425 654914627 654899826 654942245 654924622 654694290 654392929 654071045 653845978
2116 653845978 653922577 654088287 654233246 654252319 653910141 653485260 653185120 652984848 652970810 653016815 653037262
2127 653037262 652995834 652775040 652528992 652406006 652303925 652137299 652002335 652006378 652028809 651975174 651873779
2138F51873779j81122j76925p7057m5014o9427l3798R3689O6757j27335j92184j98364
2149F50932999j59989j5716J220r8495j25656r6512j35422k71377k63901j30158m5776
2160F49591217R0561M9591k30789k75116j34735q1482n5084k8840j0299P63J373r15
2172F48916245j221k9068j04904j20850o8436r1095j93100k15988j84555j59302j16348
2183F47631378r2926q1558p7744q7509r3918r5138j18485j90048j80206r9182l9139
2194F46475525O7978M2419j42288k00806j77154j82114k02179j84555j15127j05668
2204F45276031j95465j18255J99280J94854j06582k44370l76282l35235m6692K1439
2214F44268723n0049j18485k94494k78931p0572K3880R8419Q0872n0583j37329k61307
$$ plain form
2138 651873779 651692657 651515732 651438675 651393661 651324234 651290436 651384125 651450882 651323547 651131363 650932999
2149 650932999 650773010 650757294 650758514 650660019 650534363 650437851 650302429 650031052 649767151 649636993 649591217
2160 649591217 649681778 649731369 649500580 649225464 649090729 649009247 648954163 648925323 648915024 648915787 648917160 648916245
2172 648916245 648915024 648885956 648781052 648660202 648591766 648500671 648307571 648091583 647907028 647747726 647631378
2183 647631378 647538452 647456894 647379150 647291641 647197723 647102585 646984100 646794052 646613846 646514664 646475525
2194 646475525 646543503 646585922 646443634 646242828 646065674 645883560 645681381 645496826 645381699 645276031
2204 645276031 645080566 644962311 645161591 645356445 645249863 645005493 644629211 644293976 644247284 644268723
2214 644268723 644218674 644100189 643805695 643526764 643456192 643480072 643578491 643659363 643608780 643471451 643210144
2225F43210144k56958j01624n2185n1498p4615j61667j78376j55181j07270J6709K5940
2236F42113419p4158j15814j39771j53961j48773j55716j76697j73569j47323j32752
2246F40694885j19934j15433j24664j19705r9869r5596r3498j18981j95961k05040
2256F39406204j51405j34697j61896j08261P0572P0114j03226j70974k12632j91955
2266F38311844p1259l9596n2452j01815k59857k45819j182m3412m16984m29611j17073
2277F36532784l1472j00631o1264N5084J09672J40419J33972J02768Q583j98364k83241
2288F36408310l01361k66075j22528p7973r2735j17798k06680j94092o7215m5776j19706
2299F34796371j10397j7853k1248j00593j59035k51541k56538j34697j65711l35922
$$ plain form
2225 643210144 642953186 642851562 642799377 642747879 642673264 642511597 642333221 642178040 642070770 642087479 642113419
2236 642113419 642039261 641923447 641783676 641629715 641480942 641325226 641148529 640974960 640827637 640694885
2246 640694885 640574951 640459518 640334854 640215149 640115280 640019684 639926186 639807205 639611244 639406204
2256 639406204 639254799 639120102 638958206 638849945 638920517 638990631 638887405 638716431 638503799 638311844
2266 638311844 638240585 638200989 638148537 638046722 637786865 637541046 637539864 637496452 637079468 636649857 636532784
2277 636532784 636501312 636400681 636339417 636394501 636504173 636644592 636778564 636881332 636889915 636691551 636408310
2288 636408310 636106949 635840874 635718346 635640373 635547638 635429840 635223160 635029068 634961853 634916077 634796371
2299 634796371 634685974 634668121 634646873 634546280 634387245 634135704 633879166 633744469 633578758 633242836
2309F33242836m21295n04265m79660l93410j68075M19616L95546j75972n80063j049041
2319F30286217j371651j808624j529694l13263J22528J16349L1242j74751o98586k053985
2329F22605782j988869m63257J07536K99912K22702l76702n99861n73158o92863q62580
2339F17678642j072883j010895j938820m998703m362831q63037K999992J0389595J1150818
2348F27971878N930405K296714k895126m636040l008613k692452k493858k510071k993355
2357F14969482k840995k085228j700631j552581j206856o79245l41911j02501M1465
2366F04500999p400J37596M49143O48269P84645R36280J164207J145325P68203Q01316
2376F11328583J153488J420746J787872J919746J887551J739273J409302J111526P41463
$$ plain form
2309 633242836 632821541 632317276 631837616 631444206 631276131 631695747 632091293 631915321 631335258 630286217
2319 630286217 628914566 627105942 625576248 625262985 625385513 625501862 625533104 625358353 624659767 622605782
2329 622605782 620616913 620153656 620261192 620561104 620783806 620407104 619807243 619234085 618541222 617678642
2339 617678642 616605759 615594864 613656044 608657341 604294510 603431473 606431465 616821060 627971878
2348 627971878 633902283 636198997 633303871 628667831 625659218 622966766 620472908 617962837 614969482
2357 614969482 612128487 610043259 608342628 606790047 605583191 604903946 604562035 604459534 604500999
2366 604500999 604493599 604631195 605080338 605728607 606513252 607449532 608613739 609759064 610527267 611328583
2376 611328583 612482071 613902817 615690689 617610435 619497986 621237259 622646561 623758087 624499550
2385F24499550N02815L68347K40326J59531N8899o2027j37558k08359j78833j411L5743
2396F25277023r53q9875l19481l60488k46048j73798p1526l2920n1499o1989r1552
2407F23776894r9640j01357p8888k1476Q811L3646K8610n493m7912j32103j48278q9874
2419F23122940r4681j57089j64299j33972j09902n7945p3662j81465j89781j11809
2429F21848335q8920r8954r2277p9384o8207m0283o3629j50948j84059k08359j62620
2440F20610695l0251O0311K13623J37062k37694l46184k82287k35062j20659q5335
2450F19684219j23748j13717q5372m3145N8403L9101j20850j64528j15394j36147k10991
2461F18667831k43682k77482k36282j05400k2621Q8653N8899j41372k26975k82516
$$ plain form
2385 624499550 625002365 625370712 625611038 625770569 625829468 625767441 625629883 625421524 625242691 625241280 625277023
2396 625277023 625276070 625186195 624866714 624506226 624260178 624086380 624014854 623981934 623930435 623868446 623776894
2407 623776894 623677254 623575897 623497009 623475533 623484344 623517990 623546600 623541107 623493195 623361092 623212814 623122940
2419 623122940 623028259 622871170 622706871 622572899 622462997 622405052 622331390 622149925 621960144 621848335
2429 621848335 621759415 621660461 621568184 621488800 621420593 621380310 621316681 621165733 620981674 620773315 620610695
2440 620610695 620580444 620640755 620854378 620991440 620753746 620407562 620125275 619890213 619769554 619684219
2450 619684219 619560471 619446754 619361382 619318237 619376640 619415741 619294891 619130363 619014969 618878822 618667831
2461 618667831 618424149 618146667 617910385 617804985 617782364 617871017 617929916 617788544 617561569 617279053
2471F17279053k55814p1297q3198k88735l48587l47862k86789j03225m5777p7514r7733
2482F15272522j40915j70708k01950k14805j96228k20528k96593l17573k95639k89917
2492F12927666k78244k90871l27835l59764l96233m29649n16167m40597j49231p4654
2502F09664421j63307j96457k25067k65350l79792l02353Q622J17263J02311Q4152
2512F08444443m998j5258L8147O3667R6550Q4381K7428k3346j32828r4147P6523K34604
2524F08795166N24025N13802J76925N0507L357K0523J53770K07405K67525J82839j23253
2535F10772591j96190p7019n8899q1291r6321j23520j34468j44730j22757n9852k2889
2546F09654655K4567L815j18256j30653k7199m3602j75972k06947j67847j54037j58043
$$ plain form
2471 617279053 617023239 616951942 616868744 616580009 616231422 615883560 615596771 615493546 615447769 615370255 615272522
2482 615272522 615131607 614960899 614758949 614544144 614347916 614127388 613830795 613513222 613217583 612927666
2492 612927666 612649422 612358551 612030716 611670952 611274719 610845070 610328903 609888306 609739075 609664421
2502 609664421 609501114 609304657 609079590 608814240 608434448 608132095 608140717 608257980 608360291 608444443
2512 608444443 608439445 608424187 608462334 608526001 608622551 608706932 608734360 608711014 608578186 608484039 608560562 608795166
2524 608795166 609319191 609832993 610009918 610060425 610063782 610084305 610238075 610445480 610713005 610895844 610772591
2535 610772591 610576401 610499382 610440483 610359192 610262871 610139351 610004883 609860153 609737396 609677544 609654655
2546 609654655 609679222 609683037 609564781 609434128 609406929 609363327 609187355 608980408 608812561 608658524 608500481
2557F08500481j16845j678R079p6065j16348j55907j61400j50947q6785R3956J00594
2568F07838135n1270j35879k53220k32696n4322L1205J13029Q5564j08223j35651l1013
2579F07065659J0261M2687M1961P630l6469j28517j42593p0801p3433j55945j38245
2590F06422195m081j412j30195j43509p1526m2686m2916k136J19209R2278j10169j52816
2602F05932236o2485o7711j61171j46370r804n455j36871j38512l1242K174j220p134
2614F05166435j1711o8169k45552k15072M8141J14708N5313J4077p2251r6321m9591
2625F04640007p4654j93100j76658l1471L5285Q5106P8659j640m9362r6550j24207
2636F04091415j38321j35421q8921j10855k31285k18124q9188o905J23482Q2741j71394
$$ plain form
2557 608500481 608383636 608381958 608391037 608314972 608198624 608042717 607881317 607730370 607643585 607737541 607838135
2568 607838135 607786865 607650986 607397766 607165070 607110748 607141953 607254982 607340546 607232323 607096672 607065659
2579 607065659 607075920 607118607 607160568 607168198 607131729 607003212 606860619 606789818 606716385 606560440 606422195
2590 606422195 606418114 606416702 606286507 606142998 606071472 606028786 605985870 605983734 606102943 606195221 606085052 605932236
2602 605932236 605869751 605802040 605640869 605494499 605484695 605479240 605342369 605203857 605172615 605174789 605173569 605166435
2614 605166435 605154724 605086555 604841003 604625931 604674072 604788780 604844093 604858170 604785919 604689598 604640007
2625 604640007 604565353 604372253 604195595 604164124 604199409 604284515 604363174 604361534 604312172 604215622 604091415
2636 604091415 603953094 603817673 603728752 603617897 603386612 603168488 603079300 603072395 603195877 603278618 603107224
2647F03107224k51542k35557k02179j20430l9063J17264R4185j38054k07405j70708
2657F01953735j74293k00272j77383j15624m7912R2735O7940j46866k15988k31514
2667F00804558j61896P8697J14670k2659q4152j39466j59263j38283j27564j27792
2677F00036850q7967K3842K7656q6059j01814n8403j5984J04637M4861k38419l17611
2688E99331589k65351k20298j50185m7684J60904J73836l090r2049j71432k06451j96953
2699E98312836j81198j63536r1095R1323J07994m5051p8926k5978m6730p8202k12173
2710E97589264n79376n68619j99089q583K14081J60217k77977l63808j87645j25427
2720E95653038r6321m9095N0316J1673j91231k64855k86598k40555p9879j0491L3150
$$ plain form
2647 603107224 602855682 602620125 602417946 602297516 602258453 602375717 602469902 602331848 602124443 601953735
2657 601953735 601779442 601579170 601401787 601286163 601238251 601330986 601398926 601252060 601036072 600804558
2667 600804558 600642662 600721359 600836029 600813370 600729218 600589752 600430489 600292206 600164642 600036850
2677 600036850 599948883 599972725 600000381 599914322 599812508 599754105 599738121 599842758 599887619 599649200 599331589
2688 599331589 599066238 598845940 598695755 598648071 598808975 598982811 598979721 598887672 598716240 598509789 598312836
2699 598312836 598131638 597968102 597877007 597968330 598076324 598031273 597952347 597926369 597879639 597801437 597589264
2710 597589264 597009888 596441269 596242180 596233597 596447678 596607895 596329918 595966110 595778465 595653038
2720 595653038 595556717 595507622 595557938 595569611 595378380 595113525 594826927 594586372 594506493 594496002 594529152
2731E94529152q583j80512k46048k44827k55585k79922k35558j14174l1509N7716Q8692
2742E93078842O5804L5515l3608o5575r0332o6757L5019N2719N722k4338o3171r2049
2754E92837791j24931j26839q5334q6060j28059j31836r7504j04179j74790j40648
2764E91637611L4333L6239j17302j84326k13623k54364l27835l00903j59226r5138
2774E90055466o3668n4817p1564j13220k12936k42462k24343j98135j15623j30158
2784E88628540k47955k92549l06626k98729k38647k39639k94915l17802l32832l29018
2794E85729828k99683k82783k59133k68936l21655l39279l15399l55988m61807n24521
2804E82300644n81513n93414n39551n44777n38330o79016j094360j117439p83692o21567
$$ plain form
2731 594529152 594520569 594340057 594094009 593849182 593593597 593313675 593078117 592963943 592932434 592990150 593078842
2742 593078842 593144646 593180161 593146553 593080978 592990646 592923889 592958908 593011627 593017349 592993011 592929840 592837791
2754 592837791 592712860 592586021 592500687 592414627 592286568 592154732 592057228 591953049 591778259 591637611
2764 591637611 591671944 591708183 591590881 591406555 591192932 590938568 590610733 590309830 590150604 590055466
2774 590055466 589991798 589936981 589865417 589752197 589539261 589296799 589072456 588874321 588758698 588628540
2784 588628540 588380585 588088036 587781410 587482681 587244034 587004395 586709480 586391678 586058846 585729828
2794 585729828 585430145 585147362 584888229 584619293 584297638 583958359 583642960 583286972 582825165 582300644
2804 582300644 581719131 581125717 580586166 580041389 579503059 578824043 577729683 576612244 575828552 575206985
2814E75206985n57899l59306O6986J13525k44636l02086j14212j67351l88603n86548
2824E72666855q80928r84917r12437q97637p74841r73969j560211j845817j971970
2833E61864128k063751j991272k149582k522240k781601l015289l203888l303032l511200
2842E37322273l812294m075088m521599m394531l849488l023147j631737o76155J44958
2851E11483192O24886P07626Q23975Q22525Q77647R00269J069527J447219J603852
2860E20360718J700134J520386R82284O28243L37601N0315k53448m37470o03218m81376
2870E23804169l0976L14713O85425R94224J289597J460800J581917J466980J083145
2879E32649994P46002L65486j7166m49181p85598j043320j300316j514931j776428
$$ plain form
2814 575206985 574649086 574289780 574356766 574470291 574225655 573923569 573809357 573642006 573253403 572666855
2824 572666855 571785927 570801010 569888573 568990936 568216095 567242126 565681915 563836098 561864128
2833 561864128 559800377 557809105 555659523 553137283 550355682 547340393 544136505 540833473 537322273
2842 537322273 533509979 529434891 524913292 520518761 516669273 513646126 512014389 511338234 511483192
2851 511483192 512108078 512815704 513639679 514462204 515339851 516240120 517309647 518756866 520360718
2860 520360718 522060852 523581238 524563522 525191765 525529366 525579681 525326233 524888763 524285545 523804169
2870 523804169 523773193 524087906 524773331 525767555 527057152 528517952 530099869 531566849 532649994
2879 532649994 533395996 533761482 533744316 533295135 532509537 531466217 530165901 528650970 526874542
2888E26874542k088775k347947k560157k804757l083724l311615l499260l691216l817291
2897D99669800m114647m692574m876365m750023m653664m467010m332314m214287m112472
2906D59456444m017372l971100m071961l888092l474502l045540k523422k007256j468429
2915D30988770r22204k54631R0867R4642K77748N96543P04040O02226O28243O86645
2925D33492889Q20618R88998J310578J849899K229920K498130K841492L303757L521919
2934D52858200L557663L526230L315697L255348L393402L204842K769966K290954J639099
2943D79811401J125603P26929K25067l63121q89282j486321j773338j791001j760978
2952D73824959j594773j425285j281967r14307k71339J89552N60990R29336J229057
$$ plain form
2888 526874542 524785767 522437820 519877663 517072906 513989182 510677567 507178307 503487091 499669800
2897 499669800 495555153 490862579 485986214 481236191 476582527 472115517 467783203 463568916 459456444
2906 459456444 455439072 451467972 447396011 443507919 440033417 436987877 434464455 432457199 430988770
2915 430988770 430066566 429811935 429902802 429997444 430275192 430871735 431575775 432178001 432806244 433492889
2925 433492889 434313507 435302505 436613083 438462982 440692902 443191032 446032524 449336281 452858200
2934 452858200 456415863 459942093 463257790 466513138 469906540 473111382 475881348 478172302 479811401
2943 479811401 480937004 481663933 481889000 481525879 480636597 479150276 477376938 475585937 473824959
2952 473824959 472230186 470804901 469522934 468608627 468337288 468526840 469087830 470017166 471246223
2961D71246223J633873K194443K531967K661248K899894L196946L435859L705483L765106
2970D97271042L585815L520279L486138L459930L461113L433952L397942L327866L185005
2979E28129082L149299L265114L170967K911835K668838K326737K163162K199898K069206
2988E52054138J825104J616974J401405J201897R92508Q51898P85332O92367N79338
2997E62000961N20974N23796M85191M09813L79333L66440L96042M98505N24521M83779
3007E66589355M86145N49050M89731L08265J83564K7694J3352J51596K23656L50952
3017E69373360K63710p6294k46773l58582l91731l49502k38915O905J26610J71432
3027E68280220J97182J55182J81923K63443L15208K99683M49409Q81691Q92410N12810
$$ plain form
2961 471246223 472880096 475074539 477606506 480267754 483167648 486364594 489800453 493505936 497271042
2970 497271042 500856857 504377136 507863274 511323204 514784317 518218269 521616211 524944077 528129082
2979 528129082 531278381 534543495 537714462 540626297 543295135 545621872 547785034 549984932 552054138
2988 552054138 553879242 555496216 556897621 558099518 559092026 559943924 560729256 561421623 562000961
2997 562000961 562521935 563045731 563530922 563940735 564320068 564686508 565082550 565581055 566105576 566589355
3007 566589355 567075500 567624550 568114281 568422546 568606110 568633804 568647156 568798752 569022408 569373360
3017 569373360 569637070 569560776 569314003 568955421 568563690 568214188 567975273 567982178 568108788 568280220
3027 568280220 568477402 568632584 568814507 569077950 569393158 569692841 570142250 571023941 571916351 572429161
3037E72429161L21884J35880J09901K95906L29476K99949K11716K3842j07308k72979
3047E73777428k65847m9095J9799R269k29k5024q2970k24609k32201j02997o8435o1760
3059E72693329j19209l03994l30658k49633j45188Q4152J12992n5542j10131j34468
3069E71441650j08490m272M5509N8403R3956J78337J46866k6245p4615m9591j3581
3080E71687927P2022J12762J53771J08223r7008q4191J53084K10305J53503J22337
3090E72592735N9357N4131J03683J29700J94092J26113j18713j93596j65710j13030
3100E72668762M5319O1493n8403r1286j02768n4855J22795J10130r4147j66435j66893
3111E72273712j78795k11982j44692L7880J54266L03994K67257m768r9640r6817r4147
$$ plain form
3037 572429161 572751045 572886925 572996826 573292732 573622208 573922157 574133873 574157715 574050407 573777428
3047 573777428 573511581 573462486 573482285 573491554 573491325 573466301 573383331 573158722 572926521 572823524 572755089 572693329
3059 572693329 572574120 572270126 571939468 571689835 571544647 571628799 571741791 571686249 571576118 571441650
3069 571441650 571333160 571328888 571374397 571432800 571526756 571705093 571851959 571825714 571751099 571701508 571687927
3080 571687927 571759949 571872711 572026482 572134705 572037697 571953506 572106590 572316895 572470398 572592735
3090 572592735 572652092 572706223 572809906 572939606 573133698 573259811 573141098 572947502 572781792 572668762
3100 572668762 572714081 572775574 572717171 572625885 572523117 572468262 572591057 572701187 572607040 572440605 572273712
3111 572273712 572094917 571882935 571738243 571776123 571930389 572234383 572501640 572496872 572397232 572300415 572206268
3122E72206268l8414m5280j18027j30653q2970j04179j85509k35291k88505k98042
3132E70679398k91558k08168R804P1297L090j4077l6010k1210N6763M6959n1499q6784
3144E70158005o9390j11351k42004k32429p4654l0975o5575o2218j6708o2943k41508
3155E68948250k59400j11808j11809k86369k15035J53542J91688l7651j59988k97547
3165E67813873l35464k97547k04315M044J05858J71661J38054j5984j43280l16887
3175E66920013l94554m42047l41415K67R1553j7434l5743m3869j2665J09215Q5334
3186E65918655o9122j80740l52135l46870j45455o5079l7918j9073p401n5542k42004
3197E64397316k01912J17264J40228r2277j71929k12898j70212L1700M4594j17302
$$ plain form
3122 572206268 572167854 572122574 572004547 571873894 571790924 571686745 571501236 571265945 570977440 570679398
3132 570679398 570387840 570179672 570189476 570260773 570263863 570249786 570213776 570192566 570249329 570296288 570244789 570158005
3144 570158005 570088615 569977264 569735260 569502831 569428177 569397202 569331627 569269409 569252701 569189758 568948250
3155 568948250 568688850 568577042 568465233 568178864 567963829 568117371 568309059 568271408 568111420 567813873
3165 567813873 567478409 567180862 566976547 566980591 567086449 567258110 567396164 567380180 567236900 566920013
3175 566920013 566525459 566083412 565741997 565742264 565833817 565816383 565780640 565736771 565724106 565833321 565918655
3186 565918655 565849533 565668793 565316658 564969788 564824333 564759254 564721336 564702263 564694862 564639320 564397316
3197 564397316 564195404 564312668 564452896 564360619 564188690 563975792 563805580 563837280 563881874 563764572
3207E63764572j64986j55448j52588j03493j56136l69339l60717j47820m4823J8616
3217E62127838P3395J16119J26839J14212O3896m2686j19896k11716k29149j61171
3227E61857681j40915j49002j31111r3727o6986k0981m5547j71891j86195j10855p1526
3238E60668945l0288j4801n722n3139k15073k12898l9597k136p5569n6496O9847L8643
3250E60071716j66435k18391j53771j54037k25067j62125J07079Q6746k43645l06854
3260E58635216k03362j11809P0801J08948M1733n4360l05633k85874M1008J04409q316
3271E58032761p7286j91422k16026j45683j38016j54991j92146l07084k75878j02005
3281E56232224J907J35879J12763j17035j70479j08986p1983K4071j8578k49405k73476
$$ plain form
3207 563764572 563599586 563444138 563291550 563188057 563031921 562662582 562301865 562154045 562109222 562127838
3217 562127838 562201233 562317352 562444191 562558403 562622299 562579613 562459717 562248001 562018852 561857681
3227 561857681 561716766 561567764 561436653 561342926 561275940 561254959 561209412 561037521 560851326 560740471 560668945
3238 560668945 560638657 560623856 560618134 560564995 560349922 560137024 560097427 560095291 560019722 559963226 560033073 560071716
3250 560071716 559905281 559686890 559533119 559379082 559154015 558991890 559098969 559185715 558942070 558635216
3260 558635216 558431854 558320045 558390846 558499794 558541527 558487167 558181534 557895660 557936668 558041077 558032761
3271 558032761 557955475 557764053 557548027 557402344 557264328 557109337 556917191 556610107 556334229 556232224
3281 556232224 556234131 556370010 556482773 556365738 556195259 556086273 556014290 556038361 556019783 555770378 555496902
3292E55496902j21574o5575l0021m6959j18752k03857m11720l48587N0048J32599l3645
3303E54298859o8169n1270m5547l319n3634k31057k70576k46544j28021K02636K42234
3314E53645592K6245q3923k11983k27890r7046q9188j82609j95999j80474j12991N5046
3325E52344780J03722Q8691M311k43454k75116j06812n6991p9880m2419Q6517M8676
3336E51872025j91956k37198j55716p2479J12762J21155m7951j14669j40419j60942
3346E50984612j83335j46408j6441P400q6555n4360J35651J13029j47590j75247J907
3357E50432663K3384p0114q4381l9101n1994j14441j44692j63803j71203j68534j50222
3368E49297562j16349p2708N493K2622j0720m3640j27296j09444L3150N3863K404p5837
$$ plain form
3292 555496902 555375328 555309753 555279732 555232773 555114021 554910164 554498444 554149857 554199905 554332504 554298859
3303 554298859 554230690 554179420 554133873 554130554 554076920 553845863 553575287 553328743 553200722 553403358 553645592
3314 553645592 553671837 553587914 553375931 553148041 553050995 552961807 552779198 552583199 552402725 552289734 552344780
3325 552344780 552448502 552537193 552541504 552298050 552022934 551916122 551859131 551779251 551736832 551823349 551872025
3336 551872025 551680069 551442871 551287155 551214676 551327438 551448593 551400642 551285973 551145554 550984612
3346 550984612 550801277 550654869 550638428 550645828 550559273 550504913 550640564 550753593 550606003 550430756 550432663
3357 550432663 550456047 550385933 550301552 550262451 550210457 550096016 549951324 549787521 549616318 549447784 549297562
3368 549297562 549181213 549108505 549113998 549136620 549125900 549082260 548954964 548845520 548878670 548932533 548934937 548859100
3380E48859100k50320k91596k38189j66893l6469O4125K16751J79978p0801j97639
3390E48068047k95906l24936k67525k34833k43912j15623K41051K81334M3640q3924
3400E47067413k66800k32238O6528J67389J94549J11542j98097k34871k2163L1013
3410E46684265j4076L319Q3465O3896p0076r9182L1929j17759p17659o49681J18942
3421E45317383L36189K37465J29929j87149k20299K6703P4157K5521n4627k90375k52723
3432E45142174Q2741J88560J56899J44233J32332L6697k34107k31514O2217J24474
3442E45604706Q2474n1003m33464m47998j03912J9302M3144N8632r15M0283K21481
3453E45032730K08359J2436p7973j42593j51863j20888k1210K27433K73971J68305
$$ plain form
3380 548859100 548608780 548317184 548078995 547912102 547875633 547939758 548156509 548336487 548265686 548068047
3390 548068047 547772141 547447205 547179680 546944847 546700935 546585312 546826363 547107697 547151337 547067413
3400 547067413 546800613 546568375 546634903 546802292 546996841 547108383 546910286 546675415 546653252 546684265
3410 546684265 546670189 546673508 546756973 546820869 546750793 546651611 546683540 546565781 545848122 545198441 545317383
3421 545317383 545653572 545891037 546020966 545833817 545613518 545640221 545714378 545739899 545685272 545394897 545142174
3432 545142174 545224915 545413475 545570374 545714607 545846939 545883636 545649529 545418015 545480232 545604706
3442 545604706 545687180 545636177 545202713 544754715 544650803 544670105 544713249 544771881 544770966 544811249 545032730
3453 545032730 545241089 545253525 545175552 545032959 544881096 544760208 544738998 544966431 545240402 545408707
3463E45408707O1531j38283k17209j92871k08397k69165k10762l7918J03493K75840
3473E44574966L73116M80423L60489l6736k74162n30243Tk79198l3378M59442M43916
3484E45008392r5100l43094n94597m88777J11122K97280K39143J65710q7967r2544
3494E44119568J04446K62757O29425M56085l41416o80236r36241o91414L25203O09855
3504E43858032M68979J80473o45637p29790j38054J11351K81334L38555K57492J73568
3514E44156303k4795k7199J80283K31018K53448R8686l97911m29649L4103O1760k28881
3525E43907166l77656o05125m90913M6997K59857L63617K41737l00178l69797r0332
3535E42585373J37787N17616O36826N78384M21791J42784k43873j002083j092911o30150
$$ plain form
3463 545408707 545470238 545331955 545114746 544921875 544713478 544444313 544233551 544195633 544299126 544574966
3473 544574966 544948082 545428505 545788994 545752258 545478096 544947853 544417610 544138412 544105034 544564476 545008392
3484 545008392 544913292 544570198 543975601 543486824 543597946 543895226 544134369 544300079 544212112 544119568
3494 544119568 544224014 544486771 545116196 545572281 545230865 544550629 543614388 542922974 543248177 543858032
3504 543858032 544327011 544507484 543861847 543132057 542994003 543105354 543386688 543725243 543982735 544156303
3514 544156303 544131508 544104309 544284592 544515610 544769058 544867744 544469833 544040184 544074287 544136047 543907166
3525 543907166 543529510 542924385 542433472 542480469 542740326 543103943 543345680 543045502 542675705 542585373
3535 542585373 542723160 543240776 543877602 544455986 544877777 545020561 544776688 543774605 542681694 542051544
3545E42051544k00043O49949O94732p5798l97911o99310n35736K55584N79377P15484
3555E43037872O36826R6550J07536N41687Q97637J781005J270295o70433j977692l838539
3565E41882744l570061r90410M89235K153855K273101N11895n9395m2191j03683k6970
3575E42518120j4763j57356J08947P75338J311302K298355J941185M12979j186142
3584E48007965m268875m285126j296501L92914K452354K507477K06680o72073j094589
3593E41950226r77783J49040L16849l06588m22973m94004K7886J482963J962433K102356
3603E45790405J265068j215706k039413j847992j375656L8834M84466q8196M28429
3612E41440239K511253K143174n12162k094726m266510l740082k13852J818199L698349
$$ plain form
3545 542051544 541851501 542501450 543196182 543120384 542722473 542023163 541487427 541743011 542322388 543037872
3555 543037872 543674698 543771248 543878784 544420471 545318108 547099113 548369408 547698975 545721283 541882744
3565 541882744 538312683 537322273 537811508 539965363 542238464 542750359 542690964 542648773 542545090 542518120
3575 542518120 542503357 542346001 542454948 543230286 544541588 546839943 548781128 549194107 548007965
3584 548007965 543739090 539453964 538157463 538550377 541002731 543510208 543716888 543044815 541950226
3593 541950226 540972443 541121483 541438332 541131744 540708771 540214767 540242653 541725616 543688049 545790405
3603 545790405 547055473 545839767 543800354 541952362 540576706 540615540 541100006 541011810 541440239
3612 541440239 543951492 546094666 545582504 543487778 539221268 535481186 535267334 537085533 540783882
3621E40783882M550934N271912L149986k743492n984078r722709p783623K062759M719506
3630E34305077K314109J431199j3085k70119Q50182Q39004j75247k00271L24745J163483
3640E40569077K837142L497620M180679K590638j753312m632949q588791p677803j319886
3649E29702415K219658O325035N722504q53538l069878l346214k339325J556129K573738
3658E38490524J358033J093635P63168J248360L132324L198891K296906K43682n087852
3667E46737671n010147P13844K447128L271103M93737r170533r888153k622604O43005
3676E27615051L184319L879547J797218J784554L298301L663292M106026K393952k206536
3685E49515724m530906o460915n635491r97772Q61626J197319J579056J446266J469612
$$ plain form
3621 540783882 545334816 550606728 553756714 551013222 545029144 535306435 527522812 529585571 534305077
3630 534305077 536619186 538050385 538037300 537767181 538617363 539456367 539281120 539080849 539405594 540569077
3640 540569077 543406219 546903839 551084518 553675156 551921844 547288895 538700104 531022301 529702415
3649 529702415 531922073 538247108 543969612 543116074 540046196 536699982 534360657 535916786 538490524
3658 538490524 539848557 540942192 541705360 542953720 546086044 549284935 551581841 551825523 546737671
3667 546737671 541727524 542441368 544888496 548159599 548653336 539482803 529594650 526972046 527615051
3676 527615051 530799370 534678917 536476135 538260689 541558990 545222282 549328308 551722260 549515724
3685 549515724 544984818 538523903 532888412 531890640 532752266 533949585 535528641 536974907 538444519
3694E38444519J607895J354446R72977q6784k696267k819519p99903O97136K934455
3703E39608955L522377K954979J644593r96094l030319n965004n711289k256889K56309
3712E30027618L825684M601440K657662J546631J47094o10580q86421r73969n30472
3721E39804687o33468j574783j112442O23703J909980L990174L610611N87196j092644
3730E46113014k364654l474007n015335m365463j782189J141320O338577P665901O802063
3739E51059227L173828o397247q627396n844116k022743P803650P739563k233735o149063
3748E38501968q694419p087441N47142L924370N919227N314599Q51631j219521k840271
3757E35217285k495041O16532J775512K141228J792908J32560n30242l47138j023788
$$ plain form
3694 538444519 540052414 541406860 542379837 542293053 539596786 536777267 535977364 536674500 539608955
3703 539608955 543131332 546086311 547730904 546734810 543704491 537739487 532028198 529771309 530027618
3712 530027618 533853302 538454742 541112404 542659035 542806129 542195549 541309128 540335159 539804687
3721 539804687 539171219 537596436 536483994 537107697 539017677 543007851 546618462 547205658 546113014
3730 546113014 543748360 540274353 535259018 530893555 529111366 530252686 536591263 544257164 551059227
3739 551059227 554233055 547835808 539208412 533364296 531341553 539145203 546884766 544651031 538501968
3748 538501968 529807549 522720108 523267250 527191620 533110847 538425446 539277077 538057556 535217285
3757 535217285 532722244 533338776 535114288 537255516 539048424 539180984 538650742 538303604 537279816
3766E37279816k929688k882461j193772J97678K357941K959480K348900J464843l69529
3775E39233208j387596k365342j965561M52767R87053J98364k54860j133194j053810
3784E32711029R1324M84924L53813O06766J184960J411438J641273J128655p92008
3793E38822174p14073J633415J759529P11899j212578o306648n696793J402855K974053
3802E33373833J120567n56946m855156m189987J681557M200249N805969N295028K196084
3811E44071198m02947m878731m813461N56946J757622Q40683r31054o191482n667916
3820E24340858J013031L084183K545357K161522O46095L78876J344414J220970m4861
3829E36690445P8468J821747J729965N31922j234055n102653n476227k718926r74655
$$ plain form
3766 537279816 534350128 531467667 530273895 530471573 532829514 535788994 538137894 539602737 539233208
3775 539233208 537845612 535480270 533514709 533967476 534954529 535152893 534898033 533764839 532711029
3784 532711029 532802353 533287277 533641090 534247856 535432816 536844254 538485527 539614182 538822174
3793 538822174 538108101 539741516 541501045 542212944 541000366 534693718 528996925 530399780 533373833
3802 533373833 534494400 533937454 529082298 524892311 526573868 530774117 536580086 541875114 544071198
3811 544071198 543668251 538789520 533976059 534533005 536290627 537131310 536200256 530008774 524340858
3820 524340858 525353889 528438072 530983429 533144951 533791046 534169922 535514336 536735306 536690445
3829 536690445 536768913 538590660 540320625 540852547 539618492 534515839 529039612 526320686 525346031
3838E25346031J531105J842995n91049o08177R26704K306938M317055N523453P610321
3847E48205376N271415j664390p208824j6171227j5304298m020233K079238Q093606
3855E19280663R225120M618416K491493Q50907n48859k145996j944771N51453J360664
3864E33739090J851807N29747m023323m643898j996041n88417R48181J642227J355896
3873E28815269J612168K774963J862526j884003k449722k92778M04091J041184K00042
3882E32083740l464203l155975J325150K382049J593819K39601l604431l524056K54174
3891E24129868K221107M324913M278870J831321K75116j482963k364159k290954k654305
3900E28268814l617783l139724j314888J91002K479782K807617R51042N45006R70840
$$ plain form
3838 525346031 526877136 528720131 528129082 527520905 528447609 530754547 535071602 540595055 548205376
3847 548205376 553476791 551812401 544603577 528432350 513128052 509107819 511187057 519280663
3855 519280663 528505783 533124199 535615692 536466599 535917740 533771744 531826973 532378426 533739090
3864 533739090 535590897 536120644 532097321 527453423 525457382 524868965 525817146 527459373 528815269
3873 528815269 530427437 533202400 535064926 533180923 530731201 530438423 530842514 531883698 532083740
3882 532083740 528619537 525463562 526788712 529170761 530764580 531004181 527399750 523875694 524129868
3891 524129868 526350975 530675888 534954758 536786079 537061195 535578232 533214073 530923119 528268814
3900 528268814 524651031 521511307 520196419 520387421 522867203 525674820 526625862 527170868 528141708
3909E28141708J065522J354446Q98590m12941j200180k140999j906662k47688N09720
3918E26061516J100311R08394m28467q47816q94051m54903J004906J230507N15709
3927E28196106o2256j088371j301766q42323m12483L34015P14073R23157Q60214M91867
3937E27812233N2223q31146r02863k07214J74294P43866N73616n46189q51631o34918
3947E25382271m93508k01263o5536q0834L4332K70615L83835M77791L78379L0022j71165
3958E25944939l13530m40598o66847m91600K31247M15573K10266J05133o1264j33514
3968E24799805j10627j54266k69623k74887j79558j29432r6092m8409M9362K2164j53313
3979E23455124k11220k37961j55906Q4610K03628L08037K46544l5553j71433k68936
$$ plain form
3909 528141708 529207230 530561676 531460266 531047325 529847145 527706146 525799484 525551796 526061516
3918 526061516 527161827 528070221 527641754 526793938 525899887 525444984 526449890 527680397 528196106
3927 528196106 528133850 527045479 525743713 524901390 524488907 524822922 525536995 526460152 527320366 527812233
3937 527812233 527864456 527033310 526130447 525923233 526097527 526841393 527415009 526868820 526017189 525382271
3947 525382271 524888763 524687500 524621964 524541130 524575462 524846077 525229912 525707703 526086082 526116104 525944939
3958 525944939 525631409 525190811 524523964 524032364 524263611 524679184 524889450 524994583 524933319 524799805
3968 524799805 524689178 524534912 524265289 523990402 523810844 523681412 523585320 523536911 523586273 523608437 523455124
3979 523455124 523243904 523005943 522850037 522934647 523138275 523446312 523692856 523657303 523485870 523216934
3989E23216934k66533j29203o0578M044P629j07269n3902K61078J74980m01459m51355
4000E22194366
$$ plain form
3989 523216934 522950401 522821198 522760620 522764664 522772293 522665024 522611122 522872200 523047180 522645721 522194366
4000 522194366
##END=$$ End of the data block
