##TITLE=$$ Begin of the data block
##JCAMP-DX=5.00 $$ ACD/SpecManager v 10.08
##SPECTROMETER/DATA SYSTEM=16PC
##DATE=28 May 2013 10:26:04
##DATA TYPE=INFRARED SPECTRUM
##DATA CLASS=XYDATA
##ORIGIN=
##OWNER=
##NPOINTS=3601
##FIRSTX=400.00000000
##LASTX=4000.00000000
##MAXX=4000.00000000
##MINX=400.00000000
##MAXY=72.94584656
##MINY=6.16798973
##XFACTOR=1.0000000000
##YFACTOR=0.000000100000000
##FIRSTY=23.85399055
##DELTAX=1.00000000
##XUNITS=1/CM
##YUNITS=TRANSMITTANCE
##XYDATA=(X++(Y..Y))
400B38539906N7787628M6663761L1489410J6310196M442864k588311n219230n176239
408C82249985m412003m218063m888306n966377o798363p015686o698913o214638n908356
417C30129280n884437n999737o024723n835858n493774n171967n004863m972783m901943
426B80839195m569187l834953k716694j365357K4853J303082K397098L287068L955364
435B79320469M359817M448433M198876L647651K880974J994210J051635O9599r61723
444C01009941k040195l128167m159965n075073n852623o519814p131119p731075q327618
453B51044292q890628r374600r745903r996509j0135708j0171051j0091934r869862
461A72768097r472237q875932q077088p084751n912647m575195l091574j494074J67990
$$ plain form
400 238539906 296327534 342991295 374480705 390790901 395233765 392645454 387426224 382249985
408 382249985 377837982 373619919 368731613 362765236 355966873 348951187 342252274 336037636 330129280
417 330129280 324244843 318245106 312220383 306384525 300890751 295718784 290713921 285741138 280839195
426 280839195 276270008 272435055 269718361 268353004 268377857 269680939 272078037 275365105 279320469
435 279320469 283680286 288128719 292327595 295975246 298856220 300850430 301902065 301971664 301009941
444 301009941 298969746 295841579 291681614 286606541 280753918 274234104 267102985 259371910 251044292
453 251044292 242153664 232779064 223033161 213036652 202900944 192729893 182637959 172768097
461 172768097 163295860 154419928 146342840 139258089 133345442 128770247 125678673 124184599 124352589
470A24352589J836891L458891M999017O441756P780924R005708J0092917J1010170
478A78978863J1729069J2234630J2525959J2608204J2479935J2131805J1555500J0760307
486B75004272R785424Q697452P572327O472397N428486M439468L485756K545967J613159
495C25044708O93016j99432j049194j844979k576828l231926l795337m255352m611130
504C04173546m877262n081215n253906n418911n583992n740891n871506n955467n979938
513B54410458n943394n857449n744285n630703n541134n489712n476093n487614n504398
522B03735676n509587n493335n452538n383434n274181n103970m848518m491463m035196
531A58143454l500691k918300k312909j692142j046677l61681L68862J129084J884995
$$ plain form
470 124352589 126189480 129648371 134647388 141089144 148870068 157875776 167968693 178978863
478 178978863 190707932 202942562 215468521 228076725 240556660 252688465 264243965 275004272
486 275004272 284789696 293487148 301059475 307531872 312960358 317399826 320885582 323431549 325044708
495 325044708 325737724 325538292 324489098 322644119 320067291 316835365 313040028 308784676 304173546
504 304173546 299296284 294215069 288961163 283542252 277958260 272217369 266345863 260390396 254410458
513 254410458 248467064 242609615 236865330 231234627 225693493 220203781 214727688 209240074 203735676
522 203735676 198226089 192732754 187280216 181896782 176622601 171518631 166670113 162178650 158143454
531 158143454 154642763 151724463 149411554 147719412 146672735 146311054 146679916 147809000 149693995
540A49693995K595253L227510L768740M223375M603882M919185N168629N347061N452805
549A89000435N496902N503540N502777N519791N565281N636730N722904N813294N904121
558B39665775N999813O107140O228828O361256O492615O608619O697598O752872O774197
567B97688713O766300O734658O684856O619568O539001O441002O322289O180153O015167
576C55991707N831566N639114N450440N279006N131836N009919M905433M805451M696464
585D02740936M570923M429283M279900M134560M003028L888626L786469L686714L578377
594D39098816L453903L311920L158531L003693K862015K748031K674752K651443K678452
603D65641556K747574K841606K939338L020936L075180L098678L096695L076248L043900
$$ plain form
540 149693995 152289248 155516758 159285498 163508873 168112755 173031940 178200569 183547630 189000435
549 189000435 194497337 200000877 205503654 211023445 216588726 222225456 227948360 233761654 239665775
558 239665775 245665588 251772728 258001556 264362812 270855427 277464046 284161644 290914516 297688713
567 297688713 304455013 311189671 317874527 324494095 331033096 337474098 343796387 349976540 355991707
576 355991707 361823273 367462387 372912827 378191833 383323669 388333588 393239021 398044472 402740936
585 402740936 407311859 411741142 416021042 420155602 424158630 428047256 431833725 435520439 439098816
594 439098816 442552719 445864639 449023170 452026863 454888878 457636909 460311661 462963104 465641556
603 465641556 468389130 471230736 474170074 477191010 480266190 483364868 486461563 489537811 492581711
612D92581711L003998K960357K917252K879448K846527K811050K755356K659493K510376
621E17925568K309608K077599J843490J632653J455230J302872J156273R99298Q29544
630E31532135O59065N07126L86887K99225K34146J79939J34125J06086J10169J57471
640E34306374K44293L54767M66461N61409O30951O74896O97556P02858O93664O75011
650E40008240O52389O28929N98145N42564M43192K94571J18599l6354j19706j11999
660E43018570n2643l7155j76010n35202j085243j694680k177467k374954k235260j842690
670E30807266j383934j061973j008187j227607j614457k013130k301407k438888k469673
679E15288010k477494k530594k644500k787361k910271k988968l038444l098298l194618
$$ plain form
612 492581711 495585709 498546066 501463318 504342766 507189293 510000343 512755699 515415192 517925568
621 517925568 520235176 522312775 524156265 525788918 527244148 528547020 529703293 530702591 531532135
630 531532135 532191200 532698326 533085213 533384438 533618584 533798523 533932648 534038734 534148903 534306374
640 534306374 534550667 534905434 535371895 535933304 536564255 537239151 537936707 538639565 539333229 540008240
650 540008240 540660629 541289558 541887703 542430267 542873459 543168030 543286629 543250275 543130569 543018570
660 543018570 542965927 542928772 542752762 542217560 541132317 539437637 537260170 534885216 532649956 530807266
670 530807266 529423332 528361359 527353172 526125565 524511108 522497978 520196571 517757683 515288010
679 515288010 512810516 510279922 507635422 504848061 501937790 498948822 495910378 492812080 489617462
688D89617462l305015l346062l196221k740058j914483p38563O88705K215119L674507
697D80955391M928093N891304O544075O925850P115059P202339P263107P335434P416115
706E41576767P468452P444802P309532P054825O699600O278229N821457N347404M857597
715E99858665M350930L832245L319702K838707K409095K033463J695328J366653J024513
724F22729301O63910K97509n1575l67890o54792r32465j229210j562042j926994k299157
734F14666595k645568k940674l178940l372498l541908l699226l840294l944435l985138
743E83517914l940888l804855l583145l290444k942123k552223k134056j703835j280403
752E58285942q83026n24559k07901P0724L15476N22728O76460P54547P38602O23016
$$ plain form
688 489617462 486312447 482966385 479770164 477030106 475115623 474377060 475065765 477280884 480955391
697 480955391 485883484 491774788 498318863 505244713 512359772 519562111 526825218 534160652 541576767
706 541576767 549045219 556490021 563799553 570854378 577553978 583832207 589653664 595001068 599858665
715 599858665 604209595 608041840 611361542 614200249 616609344 618642807 620338135 621704788 622729301
724 622729301 623393211 623690720 623639145 623271255 622616463 621683998 620454788 618892746 616965752 614666595
734 614666595 612021027 609080353 605901413 602528915 598987007 595287781 591447487 587503052 583517914
743 583517914 579577026 575772171 572189026 568898582 565956459 563404236 561270180 559566345 558285942
752 558285942 557402916 556878357 556670456 556741180 557056656 557579384 558255844 559010391 559748993 560372009
762E60372009M20761J55678j47133m72564q20961j199990j617431k069168k533951
771E52087250k975350l347244l601303l692398l585587l266487k748337k081985j351204
780E25437355o61583j13792K20680L18108K00843p6904m55818q90312j353608j828231
790E20796738k284623k665596k882881k830543k411499j566239k93426J341858L213386
799E10417175N154076O979446Q519020R644318J0291824J0469170J0249557R744721
807E81469307R073677Q330154P568779O806221O040230N270729M514199L804473L177071
816F36054840K653542K231483J885758J583786J301117J030502P82165N70679M04587
825F48498459K79541J79748Q8730l509r6054j81351k52304l08991l58429m09317m66537
$$ plain form
762 560372009 560792770 560948448 560801315 560328751 559507790 558307800 556690369 554621201 552087250
771 552087250 549111900 545764656 542163353 538470955 534885368 531618881 528870544 526788559 525437355
780 525437355 524775772 524661980 524882660 525200768 525401611 525324707 524868889 523978577 522624969 520796738
790 520796738 518512115 515846519 512963638 510133095 507721596 506155357 505861931 507203789 510417175
799 510417175 515571251 522550697 531069717 540714035 551005859 561475029 571724586 581469307
807 581469307 590542984 598873138 606441917 613248138 619288368 624559097 629073296 632877769 636054840
816 636054840 638708382 640939865 642825623 644409409 645710526 646741028 647523193 648093872 648498459
825 648498459 648778000 648957748 649046478 649042969 648946915 648765564 648513260 648204269 647845840 647436523 646969986
836F46969986n30167n95855o62156p32574q16269r20029j045684j183625j320190j443443
846F37719994j549797j646576j745568j856231j979447k108574k234535k353859k469063
855F19776344k588348k716255k848587k973976l079911l162651l232116l309212l414231
864E92451057l558654l736191l928757m114265m277878m414215m524498m606590m650612
873E54639397m639054m557724m406929m208412m004021l841629l762779l790359l927117
882E17501373m159012m465522m824410n215606n619889o019859o402207o760787p099839
891D66934242p432785p774849q136100q517228q906593r289093r649735r980049j0275917
900C86971893j0532989j0738182j0865059j0872002j0706482j0310287r630642q629398
$$ plain form
836 646969986 646439819 645843964 645181808 644449234 643632965 642712936 641667252 640483627 639163437 637719994
846 637719994 636170197 634523621 632778053 630921822 628942375 626833801 624599266 622245407 619776344
855 619776344 617187996 614471741 611623154 608649178 605569267 602406616 599174500 595865288 592451057
864 592451057 588892403 585156212 581227455 577113190 572835312 568421097 563896599 559290009 554639397
873 554639397 550000343 545442619 541035690 536827278 532823257 528981628 525218849 521428490 517501373
882 517501373 513342361 508876839 504052429 498836823 493216934 487197075 480794868 474034081 466934242
891 466934242 459501457 451726608 443590508 435073280 426166687 416877594 407227859 397247810 386971893
900 386971893 376438904 365700722 354835663 343963661 333257179 322946892 313316250 304686852
908C04686852p295170n653534l772221j758156K54956K130317L751087N041447N974484
917C03360062O566543O862889O918163O782379O494904O084251N576172M997139M378166
926C58020668L752937L153801K609444K142181J767540J495171J328239J265259J298447
935C76833687J416588J603584J840591K104836K370911K610702K795105K898674K900696
944C97375374K790108K565193K232704J804466J296196P23381J02158n51071j220589
953D07117920j890221k545585l175850l773804m337006m865417n361900n828247o264954
962C69074936o670456p040825p371712p658271p896882q085441q223858q312817q354587
971B99460087q351803q308716q230991q125305q000870p865715p727642p591191p457962
$$ plain form
908 304686852 297391682 291738148 287965927 286207771 286462727 288593044 292344131 297385578 303360062
917 303360062 309926605 316789494 323707657 330490036 336984940 343069191 348645363 353642502 358020668
926 358020668 361773605 364927406 367536850 369679031 371446571 372941742 374269981 375535240 376833687
935 376833687 378250275 379853859 381694450 383799286 386170197 388780899 391576004 394474678 397375374
944 397375374 400165482 402730675 404963379 406767845 408064041 408787422 408889580 408338509 407117920
953 407117920 405227699 402682114 399506264 395732460 391395454 386530037 381168137 375339890 369074936
962 369074936 362404480 355363655 347991943 340333672 332436790 324351349 316127491 307814674 299460087
971 299460087 291108284 282799568 274568577 266443272 258442402 250576687 242849045 235257854 227799892
980B27799892p326774p195778p063236o931191o803684o686974o588153o512719o462097
989A66229286o434183o421337o412973o396056o357021o284008o168137o005096n794735
998A09955740n538540n238333m892034m493447m032850l500671k892575k215882j490593
1007G5660815p50546l8715N98894J120018J491185J692061J715088J566525J263370
1016H4318695Q32787L09152k68192q58126j418857j912318k305331k571959k696305
1025G3429546k673311k509050k219601j828704j362734q47931l08318K35443P65214
1034F2680554J264592J718888K116818K452135K724896K940321L107252L234239L327779
1043H5567474L390913L424511L429318L407421L361978L296767L214454L115883L000803
$$ plain form
980 227799892 220473118 213277340 206214104 199282913 192479229 185792255 179204102 172691383 166229286
989 166229286 159795103 153373766 146960793 140564737 134207716 127923708 121755571 115750475 109955740
998 109955740 104417200 99178867 94286833 89793386 85760536 82259865 79367290 77151408 75660815
1007 75660815 74910269 74871554 75470448 76590466 78081651 79773712 81488800 83055325 84318695
1016 84318695 85151482 85460634 85192442 84334316 82915459 81003141 78697810 76125851 73429546
1025 73429546 70756235 68247185 66027584 64198880 62836146 61988215 61679897 61915340 62680554
1034 62680554 63945146 65664034 67780852 70232987 72957883 75898204 79005456 82239695 85567474
1043 85567474 88958387 92382898 95812216 99219637 102581615 105878382 109092836 112208719 115209522
1052A15209522K869578K724685K570753K414103K261076K115765J979751J851549J727505
1061A35724287J603460J473713J333399J178303J005945Q16097O13289M04806K00253
1070A44353552J1005j53398k85282l79649m33940m48437m25062l69130k86779j85842
1080A41397038p3367M5605J68285K93866M22239N51834O80227Q03414R18741J025772
1090A46233654J127386J227751J329870J434002J536627J630716J709948J771412J816501
1099A59817867J850567J879845J906872J930141J942139J935177J904258J853409J797524
1108A76817799J762523J780930J887913K110900K465268K948551L538074M194203M866028
1117B02372189N499706O048736O480503O779080O945991O995812O950588O836815O680355
$$ plain form
1052 115209522 118079100 120803785 123374538 125788641 128049717 130165482 132145233 133996782 135724287
1061 135724287 137327747 138801460 140134859 141313162 142319107 143135204 143748493 144153299 144353552
1070 144353552 144364557 144211159 143925877 143546228 143112288 142663851 142238789 141869659 141582880 141397038
1080 141397038 141323671 141369276 141537561 141831427 142253666 142805500 143485727 144289141 145207882 146233654
1090 146233654 147361040 148588791 149918661 151352663 152889290 154520006 156229954 158001366 159817867
1099 159817867 161668434 163548279 165455151 167385292 169327431 171262608 173166866 175020275 176817799
1108 176817799 178580322 180361252 182249165 184360065 186825333 189773884 193311958 197506161 202372189
1117 202372189 207871895 213920631 220401134 227180214 234126205 241122017 248072605 254909420 261589775
1126B61589775O504135O326618O159172O004735N859069N713883N561886N400123N233422
1135C14352818N070095M919128M784203M663047M547806M431305M309921M186898M068260
1144C55333481L960075L864823L781471L707504L644600L594894L558999L527259L474694
1153C88447800L363914L156853K831955K400093J909027J435471J063041Q56476Q42896
1162D06307526J004142J287270J622353J944694K210426K401658K523956K595978K639885
1171D24537888K673568K707596K743607K779121K807655K825585K831955K829284K822686
1180D49558945K816391K810630K802735K786751K758903K719383K673531K628937K591171
1189D74147377K560616K532005K499046K457314K409172K361183K321663K294922K277984
$$ plain form
1126 261589775 268093910 274420528 280579700 286584435 292443504 298157387 303719273 309119396 314352818
1135 314352818 319422913 324342041 329126244 333789291 338337097 342768402 347078323 351265221 355333481
1144 355333481 359293556 363158379 366939850 370647354 374291954 377886848 381445847 384973106 388447800
1153 388447800 391811714 394968567 397800522 400200615 402109642 403545113 404608154 405464630 406307526
1162 406307526 407311668 408598938 410221291 412165985 414376411 416778069 419302025 421898003 424537888
1171 424537888 427211456 429919052 432662659 435441780 438249435 441075020 443906975 446736259 449558945
1180 449558945 452375336 455185966 457988701 460775452 463534355 466253738 468927269 471556206 474147377
1189 474147377 476707993 479239998 481739044 484196358 486605530 488966713 491288376 493583298 495861282
1198D95861282K264099K245560K220268K191277K165604K147712K137451K128067K112084
1207E15473404K085838K052536K020264J997108J984063J975441J959495J927338J877746
1216E33353233J817818J759949J713104J679039J651649J621094J580734J531334J478730
1225E48186684J430778J390343J354599J317406J274147J226539J181488J148110J130943
1234E59641037J126900J127815J124077J110725J089592J066551J046791J032563J020279
1243E69386330J006012R89532R75037R70764R82818J010361J044731J071968J079369
1252E78516922J059990J014900R50203Q74024P93113P13234O40221N83114N52025N54543
1262E86252289N91812O54373P25174P85637Q22182Q31184Q19855P99789P81479P69768
$$ plain form
1198 495861282 498125381 500370941 502591209 504782486 506948090 509095802 511233253 513361320 515473404
1207 515473404 517559242 519611778 521632042 523629150 525613213 527588654 529548149 531475487 533353233
1216 533353233 535171051 536931000 538644104 540323143 541974792 543595886 545176620 546707954 548186684
1225 548186684 549617462 551007805 552362404 553679810 554953957 556180496 557361984 558510094 559641037
1234 559641037 560767937 561895752 563019829 564130554 565220146 566286697 567333488 568366051 569386330
1243 569386330 570392342 571381874 572356911 573327675 574310493 575320854 576365585 577437553 578516922
1252 578516922 579576912 580591812 581542015 582416039 583209152 583922386 584562607 585145721 585697746 586252289
1262 586252289 586844101 587498474 588223648 589009285 589831467 590662651 591482506 592282295 593063774 593833542
1272E93833542P62443P53823P39708P20100O99158O83136O74972O74973O78711O82068
1282F00902634O83059O82793O84738O90460O98929P05986P06215O96983O79474O58875
1292F07790146O41365O29425O22406O15349O03828N85709N64384N44777N31731N26276
1302F13655396N24864N23071N18074N11017N06515N08347N16434N26352N30052N23185
1312F18843307N06936M88548M77219M78363M89997N04685N13229N13344N08652N08194
1322F23832474N17845N35889N52711N55725N39971N10826M83131M73290M87060N15175
1332F29004097N37567N32570M91371M22402L49159K97775K84729L09563L57094M06608
1342F32992935M41971M57954M57688M48189M33464M13742L87726L57551L31268L20168
$$ plain form
1272 593833542 594595985 595349808 596089516 596809616 597508774 598191910 598866882 599541855 600220566 600902634
1282 600902634 601585693 602268486 602953224 603643684 604342613 605048599 605754814 606451797 607131271 607790146
1292 607790146 608431511 609060936 609683342 610298691 610902519 611488228 612052612 612597389 613129120 613655396
1302 613655396 614180260 614703331 615221405 615732422 616238937 616747284 617263718 617790070 618320122 618843307
1312 618843307 619350243 619838791 620316010 620794373 621284370 621789055 622302284 622815628 623324280 623832474
1322 623832474 624350319 624886208 625438919 625994644 626534615 627045441 627528572 628001862 628488922 629004097
1332 629004097 629541664 630074234 630565605 630988007 631337166 631634941 631919670 632229233 632586327 632992935
1342 632992935 633434906 633892860 634350548 634798737 635232201 635645943 636033669 636391220 636722488 637042656
1352F37042656L32336L67737M14314M53034M64516M37202L73726K88353K04773J46484
1362F40525131J30539J62125K32162L19519L97950M42199M38080L86429L03421K14767
1372F43552322J46485J15280J24283J64337K18506K71301L12958L39279L51791L53699
1382F45950241L49197L45078L52020L81928M42962N31006O26602O95877P03812O28967
1392F51007690M77143K84424J05438p630k6626M0359J54190K63520L27682L33634K95944
1403F53255768K44751K07443J96228K08283K37121K82517L52478M52346N68695O60325
1413F56665955O69784N51834L05100j1597k93808m35486l79944j50528J55793M14505
1423F57491608N35125N02091L79715K70767K58026L58429N15595O33316O27365M72564
$$ plain form
1352 637042656 637374992 637742729 638157043 638610077 639074593 639511795 639885521 640173874 640378647 640525131
1362 640525131 640655670 640817795 641049957 641369476 641767426 642209625 642647705 643034134 643337555 643552322
1372 643552322 643698807 643814087 643938370 644102707 644321213 644592514 644905472 645244751 645596542 645950241
1382 645950241 646299438 646644516 646996536 647378464 647821426 648352432 648979034 649674911 650378723 651007690
1392 651007690 651484833 651769257 651874695 651867065 651840439 651880798 652034988 652298508 652626190 652959824 653255768
1403 653255768 653500519 653707962 653904190 654112473 654349594 654632111 654984589 655436935 656005630 656665955
1413 656665955 657335739 657887573 658192673 658181076 657887268 657451782 657071838 656921310 657077103 657491608
1423 657491608 658026733 658528824 658908539 659179306 659437332 659795761 660311356 660944672 661572037 662044601
1433F62044601K12555o0882k50092k90298j70212P2403L65372O26068P80029P79648
1443F64109192O23703L67432J15966p171Q4533L90625Q01392J129990J193695R03930
1453F69713287L25775l37677q31298r66034p09610j99967L27530O59104P07244N42069
1463F69230423L37067K62069L83759O31409Q41064Q55560O16303J98593k26669m85230
1473F72644348m85306k59018O8207L51792N04913N34058N15670N34592O21796P31735
1483F75762787P71408O64062M06418Q8578j50300j91345r918L02200N77774O58722
1493F78880386M86451J43127j80435k77405l4943M94385J102982J514282J511536J041488
1503F84681854K46735n92270j176147j311799r84191l48053L52401Q92411J151046
$$ plain form
1433 662044601 662257156 662196274 661946182 661655884 661485672 661558075 661923447 662549515 663329544 664109192
1443 664109192 664732895 665100327 665216293 665209122 665293655 665684280 666485672 667615662 668809357 669713287
1453 669713287 670039062 669701385 668870087 667904053 667194443 666994476 667322006 667981110 668688354 669230423
1463 669230423 669567490 669829559 670213318 670844727 671685791 672541351 673157654 673356247 673129578 672644348
1473 672644348 672159042 671900024 671968231 672320023 672824936 673358994 673874664 674409256 675031052 675762787
1483 675762787 676534195 677198257 677604675 677693253 677542953 677351608 677341690 677643890 678221664 678880386
1493 678880386 679366837 679509964 679329529 679052124 679017181 679511566 680614548 682128830 683640366 684681854
1503 684681854 684928589 684336319 683160172 681848373 680864182 680516129 680868530 681760941 682911987
1512F82911987J135178R44137O97251M71649K78397Q1329j52054m11453o33316p27768
1522F84595337o31180l48205L7918L96957O11191O31790N04456L46756K90222M08554
1532F86843796O75125R64203J106262R66187N12619j54267q36258j310577j421433
1541F87345657j142273n85250M7454N48630P92236P80869O34842N26504N87845Q35495
1551F90372009J147614J312179J126328N07202m42200j447525k161941k309952j815796
1560F86287918q45795K51313J089935J411972J189804O22025K3803l31268l37524r1019
1570F89271164J82419K61307M7912l82538q31985j089783j042786p27767l02430M4098
1580F85429611J83335J00402j19171l49426m95834n33371n03998m75311m95758n70527
$$ plain form
1512 682911987 684047165 684991302 685688553 686160202 686438599 686519928 686367874 685956421 685323105 684595337
1522 684595337 683964157 683615952 683653870 684050827 684662018 685293808 685798264 686145020 686435242 686843796
1532 686843796 687518921 688483124 689589386 690555573 691068192 690913925 690077667 688767090 687345657
1541 687345657 686203384 685618134 685665588 686214218 687006454 687787323 688422165 688948669 689536514 690372009
1551 690372009 691519623 692831802 693958130 694465332 694023132 692575607 690413666 688103714 686287918
1560 686287918 685442123 685693436 686783371 688195343 689385147 690007172 690030975 689699707 689362183 689271164
1570 689271164 689453583 689714890 689762802 689380264 688548279 687458496 686415710 685687943 685385513 685429611
1580 685429611 685612946 685713348 685594177 685244751 684748917 684215546 683711548 683236237 682740479 682169952
1590F82169952o66885p42950p75147p70721p57447p62634p93304q35114q65555q72039
1600F74328156q65479q74481r25904j022720j132660j198272j166382j021195q04519
1609F65316544o06232n28412o34766r11789j266250j557160j658172j514206j169357
1618F55470200p48139m00925k38723k86255m74014o73523p50657o20727k82288J82267
1628F51177216O30493R08127R00421N82428M2572n29099q98514q76312m07181L87040
1638F51917191J240158J849136K014313J739959J237107Q18710P31812J016845J475830
1647F64041061J775361J632843R89990O7825p28760j013183o17447L18909J419143
1656F67885742K258682K569123K348633J826782J317215J046142J053772J214676J342774
$$ plain form
1590 682169952 681503067 680760117 679984970 679214249 678456802 677694168 676900864 676065750 675200195 674328156
1600 674328156 673462677 672588196 671662292 670639572 669506912 668308640 667142258 666121063 665316544
1609 665316544 664710312 664181900 663547134 662635345 661369095 659811935 658153763 656639557 655470200
1618 655470200 654722061 654321136 654082413 653796158 653322144 652648621 651897964 651277237 650994949 651177216
1628 651177216 651807709 652715836 653616257 654198685 654241257 653712158 652813644 651937332 651530151 651917191
1638 651917191 653157349 655006485 657020798 658760757 659997864 660816574 661548386 662565231 664041061
1647 664041061 665816422 667449265 668439255 668507080 667778320 666765137 666147690 666466599 667885742
1656 667885742 670144424 672713547 675062180 676888962 678206177 679252319 680306091 681520767 682863541
1665F82863541J313171J121292Q58307O29654M83017L93753L10822K22320J86691K98005
1675F88680573O07376J051559J449204J573562J274567N76477l08075j059799j394501
1684F92450943j189270n31845L31955J114578J608887J751632J609345J308136R52835
1693F99407196N87769K07519j95618n87387q84857r90753q51288m99496n2872L35236
1703F96475449N48706N66406M72488M08173M92477P47910J074371J290131J222305
1712G03298416Q00247J08872o35147j172104j316757j040650m82178J24894N66711
1721G00252304P46536P18994O34842O40946P83615R77249J053925Q66928L90777k47574
1731G06818542q19091j104889j005173n89828n6611L71170N56107N02625L36608K19040
$$ plain form
1665 682863541 684176712 685298004 686156311 686785965 687268982 687662735 687973557 688195877 688382568 688680573
1675 688680573 689287949 690339508 691788712 693362274 694636841 695213318 694905243 693845444 692450943
1684 692450943 691261673 690729828 691061783 692176361 693785248 695536880 697146225 698454361 699407196
1693 699407196 699994965 700202484 700006866 699419479 698534622 697543869 696692581 696193085 696140213 696475449
1703 696475449 697024155 697590561 698063049 698471222 698963699 699711609 700785980 702076111 703298416
1712 703298416 704098663 704207535 703572388 702400284 701083527 700042877 699560699 699685593 700252304
1721 700252304 700998840 701717834 702352676 702993622 703777237 704754486 705808411 706675339 707066116 706818542
1731 706818542 705999451 704894562 703889389 703299561 703242950 703614120 704170227 704672852 705009460 705228500
1741G05228500K49482M13742N99365O69098N41305K37809j26954m07257m97436l75900
1751G06531754j06965J98441M34952N38101M98886L51563J51825l5859j52740j53656
1761G08256302k0523K23694N10406P37000Q03146O50101K95715j66550n96695q62045
1771G09830551q86383o76575l15322P5378L78036N17884M78744L02124O7292j33439
1781G09638290k22015j60751L1509K82211M82331N31921L81928O5231l08457n96313
1791G10125885o83289n38559k31323J00403L15170L32871J70975p1030k65656l23333
1801G08932114k28958m3793J35956K29721K08511R9716l6697j43280j89972j78146
1811G08785172j29700o7597o790M7760R4605J31836J57699J73950J87226K03857K22779
$$ plain form
1741 705228500 705477982 705891724 706491089 707160187 707701492 707939301 707812347 707405090 706907654 706531754
1751 706531754 706424789 706623230 707058182 707596283 708095169 708446732 708598557 708562698 708409958 708256302
1761 708256302 708235779 708459473 708969879 709706879 710510025 711160126 711455841 711289291 710692596 709830551
1771 709830551 708944168 708267593 707952271 708027649 708405685 708923569 709402313 709704437 709771729 709638290
1781 709638290 709416275 709255524 709287033 709569244 710051575 710583496 710965424 711030655 710722198 710125885
1791 710125885 709442596 708904037 708672714 708773117 709088287 709421158 709592133 709521103 709255447 708932114
1801 708932114 708703156 708659363 708795319 709025040 709233551 709333267 709296570 709153290 708963318 708785172
1811 708785172 708655472 708587875 708581085 708628845 708723450 708855286 709012985 709186935 709374161 709578018 709800797
1822G09800797K29721K04086J32904K3193r3155j71737j79367j09787J0452J40533
1832G09987640K47727L26996L94745M71115N51757N97687N52826L76740Q2168k56958
1842G13332443n29785o38351n45960k98157j068K29569L21045K72674J43204J0681
1852G12296295p0648r4147r0637r6970j26876j58997j54648q8730K5177J36032J76850
1863G11752701J04675p5989l08304n09719o06842n67246m11682j97525M349J40228
1873G09324646J87912J59225Q7662J2894l3646l5705L662O6299J26343J57776J45798
1884G10202866R1476J2665o4163j13526j22680r4452m4937O561M5090O7443P7973Q4991
1896G10149307R4147J07422J22070J35498J46103J52588J52740J43357J22680R4376
$$ plain form
1822 709800797 710030518 710234604 710367508 710390701 710297546 710125809 709946442 709836655 709847107 709987640
1832 709987640 710235367 710562363 710957108 711428223 711979980 712577667 713130493 713507233 713589401 713332443
1842 713332443 712802658 712164307 711618347 711320190 711319122 711548691 711869736 712142410 712285614 712296295
1852 712296295 712225647 712131500 712040863 711943893 711817017 711658020 711503372 711414642 711439819 711575851 711752701
1863 711752701 711857376 711781387 711473083 710963364 710356522 709789276 709377594 709180069 709184418 709324646
1873 709324646 709512558 709671783 709759445 709772339 709738693 709702988 709706650 709772949 709899292 710057068 710202866
1884 710202866 710294342 710307007 710242844 710129318 710006638 709912186 709867249 709873810 709918900 709986343 710064316 710149307
1896 710149307 710243454 710350876 710472946 710608444 710754547 710907135 711059875 711203232 711325912 711420288
1906G11420288P0343O6300R4757J54342K27890K85645K98233K51999J57165M4251m8752
1917G13022461r4223q7280m4251O409M1656N3864N3100N5237P0954R7046J18713J19324
1929G13413010R3536N2719K0447J8845N4321J13296J65100J79444J41067N9586l5172
1940G14276199j06201j27868r6207k8763M5090R8800J20850J16272R9564Q6517Q4457
1951G14568710Q9264R3155Q8654P6523O3781N9891P0267R0713J10626J17646J04217
1962G15533447P1106K8839r613l2577l5858k2354%K2201L8147M5471M5166M0283L5019
1975G15759277L1739L3187M0207N2643O8207Q4152R7199J04599J04370R5062P5302
1986G16545944M4861N112l8758p6599r8419r4986o6452k0676K5559N5466N8975L8757
$$ plain form
1906 711420288 711490631 711556931 711651688 711806030 712033920 712319565 712617798 712869797 713026962 713071213 713022461
1917 713022461 712928238 712840958 712796707 712803116 712844772 712898636 712951736 713006973 713077927 713174973 713293686 713413010
1929 713413010 713506546 713559265 713579712 713598557 713652878 713766174 713931274 714110718 714251785 714311371 714276199
1940 714276199 714169998 714042130 713945923 713917160 713962250 714061050 714181900 714298172 714397736 714484253 714568710
1951 714568710 714657974 714751129 714839783 714916306 714980087 715039978 715110245 715200958 715311584 715429230 715533447
1962 715533447 715604553 715633392 715623779 715591202 715555344 715532990 715532990 715555191 715593338 715638809 715683975 715724258 715759277
1975 715759277 715791016 715824203 715864410 715917053 715985260 716069412 716166611 716271210 716375580 716470642 716545944
1986 716545944 716590805 716595917 716557159 716480560 716382141 716287155 716220703 716200027 716225586 716281052 716340027 716378784
1998G16378784Q545j4343j7700j53K6703M8904N5619M8751L9750M2877O5384J02462
2010G16785583J37406J53122J40228J04065O1264L1357K4795M0131O3400P9956Q0109
2021G17701416O6223M7150L3645K9755L2425L3569K8458J9226J2436J6632L4866O1646
2033G18117447Q6822J01166J01242R2545Q2931Q0033Q4228R0790R3536Q9417Q1100
2044G19101257P5302P8125Q8730J01776J09024J04599R0638P4157O3553O4011P3242
2055G20024414Q5068R1171Q8883P9345O8360O0424N6305N4779N2796N0430TN7068P1030
2068G20890503Q8119J00098R9487Q3542N8213L3874K1210K5100M2038O2790P7820Q2932
2080G21665726Q0185P6599P6828Q2092Q7509Q6746P6828O0120M4861L9291M6158O2485
$$ plain form
1998 716378784 716387329 716372986 716355286 716355133 716381836 716430740 716486359 716535110 716574860 716617737 716683121 716785583
2010 716785583 716922989 717076111 717216339 717320404 717381668 717413025 717437820 717477951 717541351 717621307 717701416
2021 717701416 717767639 717814789 717848434 717878189 717910614 717944183 717972641 717991867 718004303 718020935 718055801 718117447
2033 718117447 718204269 718305435 718406677 718499222 718582153 718662186 718746414 718837204 718930740 719020157 719101257
2044 719101257 719176559 719254684 719343414 719445190 719554214 719658813 719749451 719823608 719887161 719951172 720024414
2055 720024414 720109482 720200653 720289536 720368881 720437241 720497665 720553970 720608749 720661545 720711975 720762405 720819473 720890503
2068 720890503 720978622 721078720 721178207 721261749 721319962 721353836 721375046 721400146 721442184 721504974 721582794 721665726
2080 721665726 721745911 721822510 721899338 721981430 722068939 722155685 722232513 722292633 722337494 722376785 722422943 722485428
2092G22485428P9040Q7052Q1863O6605M8752L5400L1357L4866M1962M8675N3864N9204
2104G23154068O6528P4997Q0719P8125O5155M4632K3728J1215J1825K2889L7613M7225
2116G23718719M7150L9902L2349L2730M3258O0272P4921P8583O8741M8980K8306J4495
2128G24288406J1750J7852K7008L4180L7766L9596M2420M6844N0583M9896M2572L1052
2140G24719925K1667K0447K9755M6692O3019P0419O6376N3405M0512L5782M2038N6000
2152G25266037P0496P8048P7439P0419O3858O0501O0349N8822N1651L7689K2889J4648
2164G25932846J8311L3798N3711O8130O9428N8517M2420L1356L2349M4861O1493P3166
2176G26520386P4005O4926N2719M4937M5624N1956N7831N8136N1575M2038L5019L2730
$$ plain form
2092 722485428 722564468 722651520 722733383 722799988 722848740 722884140 722915497 722950363 722992325 723041000 723094864 723154068
2104 723154068 723220596 723295593 723376312 723454437 723519592 723564224 723587952 723599167 723610992 723633881 723671494 723718719
2116 723718719 723765869 723805771 723838120 723870850 723914108 723974380 724049301 724127884 724196625 724245605 724273911 724288406
2128 724288406 724300156 724318008 724345016 724379196 724416962 724456558 724498978 724545822 724596405 724646301 724688873 724719925
2140 724719925 724741592 724762039 724791794 724838486 724901505 724971924 725038300 725091705 725132217 725167999 725210037 725266037
2152 725266037 725336533 725414581 725492020 725562439 725626297 725686798 725747147 725805969 725857620 725895309 725918198 725932846
2164 725932846 725951157 725984955 726038666 726106796 726176224 726234741 726277161 726308517 726340866 726385727 726447220 726520386
2176 726520386 726594391 726659317 726712036 726756973 726802597 726854553 726912384 726970520 727022095 727064133 727099152 727131882
2188G27131882L3111L1205K2354Q392l738n417Q163L2730N7602O9962O3629M1656J6022
2201G27507553l05p63J0529K3345K5406J3733o561k3041k5940j2817Q545K5940K9754
2214G27575378J8692K29j4801j9149j3199k900M654N570L967M730J3123K6398L8070
2227G27640762M0589L0975J4191j145o027P63J3580K2354J9227M882j4572k7923k8763
2240G27708893j7090L05J4191K0141J8464J4953J4343J8006K1210J9073Q011r842k6093
2253G27804565l4103k9907j7090l510L968J678o790j4725j7395j3809j0071j1825k1515
2266G27629471l6392m7455m7379l4332j4114J983M807o333k2888k9220j3581K6551
2278G27411118Q0871J30463J58462J56403J29089Q9112N0277K0752l05j7090l3264
$$ plain form
2188 727131882 727164993 727196198 727218552 727226944 727223206 727217789 727225952 727258682 727316284 727386246 727449875 727491531 727507553
2201 727507553 727507248 727506485 727517014 727540359 727565765 727579498 727572937 727549896 727523956 727511139 727519684 727545624 727575378
2214 727575378 727594070 727594299 727579498 727560349 727547150 727544250 727548904 727554474 727558441 727563171 727576294 727602692 727640762
2227 727640762 727681351 727712326 727726517 727725372 727719345 727720108 727733688 727756042 727775269 727780151 727765579 727737656 727708893
2240 727708893 727691803 727692108 727706299 727726440 727744904 727759857 727774200 727792206 727813416 727832489 727840500 727830658 727804565
2253 727804565 727770462 727740555 727723465 727719955 727723923 727725601 727718811 727704086 727686691 727672882 727662811 727650986 727629471
2266 727629471 727593079 727545624 727498245 727463913 727449799 727451782 727456589 727450256 727427368 727398148 727384567 727411118
2278 727411118 727491989 727622452 727780914 727937317 728066406 728155518 728205795 728226547 728226242 728209152 728175888
2289G28175888m7302n3864m9743l6164k0904j3657j7242k5559k6169p095L2654Q1024
2301G27991867J18103J24283R3307L1891m2648j12534j64032j89209j83181j41373
2311G27526474o3400L5553J21231J45874O7215j24512l90396o49567q12607q23898
2321G25031967o94122m98810l41568l01743l93829n62439p15790p75833p18536n77698
2331G19451599m18472k96250k35443k39639l17383n02090q36334j322022j864471k256546
2341G11162949k232056j580124k70615J478882L238373M506531M898681M294587K882919
2350G28380127J078339o46744j930771k628021k806168k660751k399445k158356j975936
2359G12252274j823655j657791j457138j230240r98840p75375n55954l28370q8195
$$ plain form
2289 728175888 728128586 728074722 728024979 727988815 727967911 727954254 727937012 727911453 727885284 727878189 727910843 727991867
2301 727991867 728109970 728234253 728327560 728359451 728316803 728204269 728040237 727851028 727667847 727526474
2311 727526474 727463074 727498627 727619858 727765732 727832947 727708435 727318039 726668472 725855865 725031967
2321 725031967 724337845 723839035 723497467 723195724 722801895 722239456 721523666 720747833 720029297 719451599
2331 719451599 719033127 718736877 718501434 718261795 717944412 717442322 716605988 715283966 713419495 711162949
2341 711162949 708930893 707350769 707080154 708559036 711797409 716303940 721202621 725497208 728380127
2350 728380127 729458466 728811722 726880951 724252930 721446762 718786011 716386566 714228210 712252274
2359 712252274 710428619 708770828 707313690 706083450 705084610 704309235 703753281 703424911 703336716
2368G03336716J52511L71552N52139O96030Q23135R60159J122971J306000J484985
2377G10806198J630249J719971J745682J711654J623764J486740J305542J090393Q62351
2386G23982544O48422M74167L49884K68326K10037J54877R4986L6926m730j9379p934
2397G26188126J4801L1509L1433J5793l586j3885j0071J984J1749J0376l205k0904
2409G26254120l3188l4485k8610k2888k4414l3188m2496m4479l5706k0141q011p630
2421G25918884k0675l9521n2261n0201l3570j0910M578M501j0910l2883m9667n3406
2433G25573959m5242l2349k3727k3880l1052l8604m0131l4256k5330k0523k3956l5171
2445G25199738m7837n4092n0202l8070k4719j7930k0370k9602l8681m1123l5781k6780
$$ plain form
2368 703336716 703489227 703860779 704412918 705108948 705932083 706892242 708015213 709321213 710806198
2377 710806198 712436447 714156418 715902100 717613754 719237518 720724258 722029800 723120193 723982544
2386 723982544 724630966 725105133 725455017 725723343 725933380 726088257 726183243 726220169 726215439 726196060 726188126
2397 726188126 726202927 726234436 726265869 726281662 726278076 726264191 726254120 726256104 726267853 726278229 726275024 726254120
2409 726254120 726220932 726186447 726157837 726134949 726110535 726077347 726034851 725990372 725954666 725934525 725926514 725918884
2421 725918884 725898209 725858688 725806427 725756226 725722656 725711746 725716324 725720825 725709915 725677032 725627365 725573959
2433 725573959 725528717 725496368 725472641 725448761 725417709 725379105 725338974 725304718 725279388 725258865 725234909 725199738
2445 725199738 725151901 725097809 725047607 725009537 724984818 724966888 724946518 724916916 724878235 724837112 724801331 724774551
2457G24774551k0980k4338l5935n0583o0043n9585n0431l8528l0976l2119l9063m6310
2469G24285660m7837m2724l4866l1128l6164m8675o2104o8435o3172m8904l3188k3956
2481G23744507k5711l4714m4098m6463m0436l0517k3728k6245l7002m9820n6839n3101
2493G23275833m0054k4796j4496j3351j9074k6092k8610k5635k0599j8998k3574l2883
2505G22987671m0741m1733l3722k0141q240l586p400j6251k3651k6779k5406k4491
2517G22715530k8915l8300m9133n4474m9362l4943j7776o867p629j8616l2882m2496
2529G22334137m2419l5325k7618k6093l2348m1351m5166l7537j9531Q39J2436R002
2541G22049026r307l3112n1498n6839m9668l7613l0822l5019m9210o5842p6828p7972
$$ plain form
2457 724774551 724753571 724729233 724693298 724642715 724582672 724523087 724472656 724434128 724403152 724371033 724331970 724285660
2469 724285660 724237823 724195099 724160233 724129105 724092941 724044266 723982162 723913727 723850555 723801651 723768463 723744507
2481 723744507 723718796 723684082 723639984 723593521 723553085 723522568 723498840 723472595 723435593 723385773 723328934 723275833
2493 723275833 723235779 723210983 723196487 723183136 723164062 723137970 723109360 723083725 723063126 723044128 723020554 722987671
2505 722987671 722946930 722905197 722871475 722851334 722843094 722839508 722832108 722815857 722792206 722765427 722740021 722715530
2517 722715530 722686615 722648315 722599182 722544708 722495346 722460403 722442627 722435760 722428131 722409515 722376633 722334137
2529 722334137 722291718 722256393 722228775 722202682 722170334 722128983 722083817 722046280 722026749 722027588 722040024 722049026
2541 722049026 722039719 722006607 721955109 721898270 721848602 721810989 721780167 721745148 721695938 721630096 721553268 721475296
2553G21475296p0953o1417n5008n3100n2643m8447l7765k3499j0986o867j2741k4338
2565G21017532l4713l6850k8763j4343o11O333M425l586j2818j9760k4261k8000l3417
2578G20791168l9520m3869m2114l4256k3270j5411j5869k5712m0206n2338n5466m8752
2590G20354385l6926k7237k5329l1434m0893m6234m2877l2349j9226j0758j0299j6251
2602G20014572k3956k8534k8153k6474k7313l4103m4708n3864n5237m6768l1967j9150
2614G19594345j5488k4108m1428n8060o5536o0349m5013k7237j5640j2970j8464k6550
2626G19183502l1967l3264l2272l3494l8833m7150n5008n7144n2719m3945l5706l2883
2638G18689117l6239m3335m9286n1041m8446m4937m4404m9438n7831o4773o5995n9585
$$ plain form
2553 721475296 721404343 721342926 721287918 721234818 721182175 721133728 721095963 721072464 721061478 721054611 721041870 721017532
2565 721017532 720982819 720945969 720917206 720902863 720902252 720908585 720913010 720909424 720896606 720876846 720852585 720824585 720791168
2578 720791168 720751648 720707779 720665665 720631409 720608139 720592728 720576859 720551147 720510941 720458603 720403137 720354385
2590 720354385 720317459 720290222 720264893 720233459 720192566 720146332 720103455 720071106 720051880 720041122 720030823 720014572
2602 720014572 719990616 719962082 719933929 719907455 719880142 719846039 719801331 719747467 719692230 719645462 719613495 719594345
2614 719594345 719578857 719554749 719513321 719455261 719389725 719329376 719284363 719257126 719241486 719228516 719210052 719183502
2626 719183502 719151535 719118271 719085999 719052505 719013672 718966522 718911514 718854370 718801651 718757706 718722000 718689117
2638 718689117 718652878 718609543 718560257 718509216 718460770 718415833 718371429 718321991 718264160 718199387 718133392 718073807
2650G18073807m7989l6698l0593l1815l8300m6157n1575n2948n1804m9438m6692m2343
2662G17547455l3798k0752n951N188O485m578k5024m7913o4316o8588o1188m7912l6469
2675G17142639l2120l5934m3106m8065m6768l8758k7923j8464j4495j6480k3117l2272
2687G16765137m2115n1879o0273o5841o5995n9433m8217l6621k9755l1662m1351n4093
2699G16177902o3476o5537o1111n5466n4474n9891o8130p1564o3553m3182j8082J526
2711G15554962N951n493k4643l9368l8910k2964N34J7929J9302L205k2431m6310n8899
2724G15342865o0577n6992n6610o3019p3089p8888p4234n9128m0207k7161k6321l5935
2736G14690704m8141n3711m7989l3646j8234r689r613j5030k0447k3804k7084l6926
$$ plain form
2650 718073807 718025818 717989120 717958527 717926712 717888412 717842255 717790680 717737732 717685928 717636490 717589798 717547455
2662 717547455 717513657 717492905 717486954 717492142 717498627 717494049 717469025 717421112 717356796 717288208 717227020 717179108 717142639
2675 717142639 717110519 717074585 717031479 716983414 716936646 716897888 716869965 716851501 716837006 716820526 716797409 716765137
2687 716765137 716723022 716671143 716610870 716545029 716479034 716419601 716371384 716334763 716305008 716273346 716231995 716177902
2699 716177902 716114426 716048889 715987778 715932312 715877838 715817947 715749817 715678253 715614700 715571518 715553436 715554962
2711 715554962 715560913 715555420 715530777 715491409 715452499 715429535 715430069 715447998 715467300 715470505 715448074 715401764 715342865
2724 715342865 715282288 715225296 715168686 715105667 715032578 714953690 714879456 714820328 714780121 714752960 714726639 714690704
2736 714690704 714642563 714588852 714540863 714507217 714488983 714479294 714469681 714454651 714434204 714410400 714383316 714346390
2748G14346390n6076q1330j02691j07880r2544o2104l0975j4954k1286m5089p1717
2759G13659744q5602q0642o1341m2190l4332m1809n6611o6070o1340m2954k1896j1978
2771G13052979k0066m2877o8665q3541q2932p0724n7984n4550o1722p2632p6751o7597
2783G12292938m7607k7085j7013k3575m1962o1950p2098o8970n5923m3030l8300m4326
2795G11751099n7679p1716q1787q7891r3078j00098j08108j12153j07421r2926p2709
2806G10765533n6228n1422o0196p8049r5062j02692r8419q5297p2021o4926o6681p4692
2818G09859848q4228r1095r5292r9105j03989j08795j09635j02539q6593o6376m9286
2829G08862915m3030n0125o6986q5373r7504j00173r7123r6130j04828j26190j57089
$$ plain form
2748 714346390 714290314 714208984 714106293 713998413 713905869 713843765 713812790 713797836 713776550 713731461 713659744
2759 713659744 713574142 713493500 713432159 713389969 713355637 713313828 713257217 713191147 713129807 713086853 713064957 713052979
2771 713052979 713032913 712990036 712921371 712837830 712754898 712684174 712626190 712571640 712509918 712437286 712360535 712292938
2783 712292938 712245331 712218246 712201233 712177658 712135696 712073746 712001648 711932678 711876755 711833725 711795425 711751099
2795 711751099 711693420 711621704 711539917 711452026 711358948 711258850 711150742 711038589 710931168 710838242 710765533
2806 710765533 710709305 710657883 710597687 710519638 710424576 710321884 710223465 710138168 710066147 710001221 709934540 709859848
2818 709859848 709775620 709684525 709589233 709490128 709386139 709277344 709167709 709065170 708978577 708912201 708862915
2829 708862915 708819885 708769760 708702774 708617401 708519897 708419724 708322601 708226471 708121643 707995453 707838364
2840G07838364j89057k14462k29034k34528k35748k37809k42385k47422k47726k39334
2850G05520859k20566j93558j62353j30844j00861p3090m8370k8305j6632j6327k7161
2861G04502792m6005o5002p7515p9803p3243o4239n9815o4010p6828r2468j05362j11466
2873G03587036j11008j07955j06202j07422j10244j10855j06736r8495q9645q4839
2883G02553635q5602r1858r8953j04676j07421j10245j15662j26037j38474j48315
2893G01426392j50452j44806j34582j26877j27411j35575j46331j51520j45493j27716
2903G00035629j04065q1939o6681n8365n3787m9363m6005m8523o3095r3307j35422
2914F99235077j79825k15530k35901k40097k34223k24456k13395j98364j73797j37635
$$ plain form
2840 707838364 707649307 707434845 707205811 706971283 706735535 706497726 706255341 706007919 705760193 705520859
2850 705520859 705300293 705106735 704944382 704813538 704712677 704639587 704591217 704562912 704546280 704529953 704502792
2861 704502792 704456787 704391785 704314270 704234467 704161224 704096985 704037170 703973160 703896332 703803864 703698502 703587036
2873 703587036 703476028 703368073 703261871 703154449 703044205 702933350 702826614 702728119 702638474 702553635
2883 702553635 702468033 702376175 702277222 702172546 702065125 701954880 701839218 701713181 701574707 701426392
2893 701426392 701275940 701131134 700996552 700869675 700742264 700606689 700460358 700308838 700163345 700035629
2903 700035629 699931564 699849625 699782944 699724579 699670792 699621429 699575424 699526901 699463806 699370499 699235077
2914 699235077 699055252 698839722 698603821 698363724 698129501 697905045 697691650 697493286 697319489 697181854
2924F97181854r3689n1727k2507j0986j3580j9608j7013P6K8763N8822Q0872R0332
2936F97211609R0179Q9035R3995J06277J20392J28021J23215J06888Q5678O8435O0196
2947F98283920O0044O1416N6305L9292J0604k5634o4316j01090j35192j66703j96457
2958F97822189k22625k43225k55890k59476k53372k38114k13012j78147j33819q4000
2968F95740509l4027Q392L7766N2795N6381N5542N6458O2332P2174Q1635Q5754Q2169
2980F96357880P1182N6839M2572L1662K5406K2659K1439J9531J5488Q392k060j5945
2992F96655045l1662m7760o2256p4082q3008q9645r5749j01623j06812j09177j04980
3003F95748291r2087o9427l9749q851J5564K5712J6479j2436n6152j05362j49689j80969
$$ plain form
2924 697181854 697088165 697036438 697013931 697002945 696989365 696969757 696952744 696952820 696981583 697040405 697121277 697211609
2936 697211609 697301788 697390823 697484818 697591095 697711487 697839508 697962723 698069611 698155289 698223724 698283920
2947 698283920 698343964 698405380 698461685 698500977 698511581 698485947 698421631 698320541 698185349 698018646 697822189
2958 697822189 697599564 697356339 697100449 696840973 696587601 696349487 696136475 695958328 695824509 695740509
2968 695740509 695706482 695714874 695752640 695805435 695861816 695917358 695973816 696036148 696108322 696189957 696275711 696357880
2980 696357880 696429062 696485901 696528473 696560135 696585541 696608200 696629639 696649170 696664658 696673050 696670990 696655045
2992 696655045 696623383 696575623 696513367 696439285 696356277 696266632 696170883 696069260 695962448 695853271 695748291
3003 695748291 695656204 695586777 695547028 695538177 695553741 695579453 695595932 695583496 695527344 695421982 695272293 695091324
3015F95091324j94931j92948j79748j62277j45722j32599j22757j14669j07422j00708
3025F93637543r5673r3841r4910r9106j04523j09634j13297j14822j12457j06049r5367
3036F92497864q1635o8741o1950o5766q2473j09559j41067j67389j81503j79367j63956
3047F91194458j42288j23596j15433j20392j36108j54419j68000j70364j60141j40991
3057F89762726j19095j02158r4604r7733j08947j24131j39160j51291j59149j61819
3067F88504639j58539j47782j28936j04523p9422o1035n6763o9504r7046j31988j64490
3078F87304611j86920j95999j93558j84631j73950j64719j56784j50070j44882j43509
3088F85609589j48850j61819j79749j97296k07901k08130j99127j87149j78757j78528
$$ plain form
3015 695091324 694896393 694703445 694523697 694361420 694215698 694083099 693960342 693845673 693738251 693637543
3025 693637543 693541870 693448029 693353119 693254013 693149490 693039856 692926559 692811737 692699280 692593231 692497864
3036 692497864 692416229 692347488 692285538 692219772 692137299 692027740 691886673 691719284 691537781 691358414 691194458
3047 691194458 691052170 690928574 690813141 690692749 690556641 690402222 690234222 690063858 689903717 689762726
3057 689762726 689643631 689541473 689446869 689349136 689240189 689116058 688976898 688825607 688666458 688504639
3067 688504639 688346100 688198318 688069382 687964859 687885437 687824402 687767639 687698135 687601089 687469101 687304611
3078 687304611 687117691 686921692 686728134 686543503 686369553 686204834 686048050 685897980 685753098 685609589
3088 685609589 685460739 685298920 685119171 684921875 684713974 684505844 684306717 684119568 683940811 683762283
3098F83762283j85318j94091j96610j88446j70364j48087j30539j24054j31378j48468
3108F82144928j68457j82495j85852j77307j61057j43356j33286j36642j57089j93558
3118F80505829k39411k84500l17764l30200l18222k86637k45590k09198j89056j89896
3128F77895355k08816k34833k54974k59018k43225k12403j78222j52588j45035j58081
3138F75848160j86234k19574k47421k61764k61002k47803k28424k09045j95008j88293
3148F73603592j89972k00424k19727k47650k82135l18756l51486l73154l79410l69034
3158F70671844l45916l17078k90604k73056k67105k72293k83355k95563l03498l04489
3168F67718887k99225k90908k84882k85492k94418l10440l28522l43094l49045l45153
$$ plain form
3098 683762283 683576965 683382874 683186264 682997818 682827454 682679367 682548828 682424774 682293396 682144928
3108 682144928 681976471 681793976 681608124 681430817 681269760 681126404 680993118 680856476 680699387 680505829
3118 680505829 680266418 679981918 679664154 679333954 679015732 678729095 678483505 678274307 678085251 677895355
3128 677895355 677686539 677451706 677196732 676937714 676694489 676482086 676303864 676151276 676006241 675848160
3138 675848160 675661926 675442352 675194931 674933167 674672165 674424362 674195938 673986893 673791885 673603592
3148 673603592 673413620 673213196 672993469 672745819 672463684 672144928 671793442 671420288 671040878 670671844
3158 670671844 670325928 670008850 669718246 669445190 669178085 668905792 668622437 668326874 668023376 667718887
3168 667718887 667419662 667128754 666843872 666558380 666263962 665953522 665625000 665281906 664932861 664587708
3178F64587708l34702l23105l15933l16696l23487l33252l41186l45383l46374l47748
3188F61259842l53851l66288l84140m03900m21142m32358m35867m32358m22898m08783
3198F57198257l91922l73992l58429l48511l46985l54462l68194l84217l97644m04739
3208F53469162m05045m01001l95889l93753l96423m03824m13971m23813m30527m32357
3218F49372559m29764m24423m19846m19006m22898m29916m34876m32510m20074l99933
3228F45139313l78647l66593l70407l91464m23050m54101m74244m78973m71115m59595
3238F40871124m53644m56123m63943m68140m61197m40330m10653l82537l65601l65067
3248F36603889l78036l98102m16450m28048m31289m28009m20227m09050l95203l79677
$$ plain form
3178 664587708 664253006 663929901 663613968 663297272 662973785 662640533 662299347 661953964 661607590 661259842
3188 661259842 660905991 660539703 660155563 659751663 659330521 658898163 658462296 658029938 657607040 657198257
3198 657198257 656806335 656432343 656073914 655725403 655378418 655023956 654655762 654271545 653873901 653469162
3208 653469162 653064117 652663116 652267227 651873474 651477051 651073227 650659256 650235443 649804916 649372559
3218 649372559 648942795 648518372 648098526 647679520 647256622 646826706 646391830 645959320 645539246 645139313
3228 645139313 644760666 644394073 644023666 643632202 643209152 642755051 642280807 641801834 641330719 640871124
3238 640871124 640417480 639961357 639497414 639029274 638568077 638127747 637717094 637334557 636968956 636603889
3248 636603889 636225853 635827751 635411301 634983253 634551964 634123955 633703728 633294678 632899475 632519798
3258F32519798l64761l54080l47901l43971l36037l17535k86942k49671k18621k08282
3268F29491997k28234k77214l43742m08592m54712m72527m63218m37432m08668l87840
3278F25609818l79181l80936l86772l90930l90320l84674l76778l69835l66211l67546
3288F21816635l74412l86086m03213m26026m53529m84276n13954n36156n43518n30701
3298F17164764m97665m51431m05922l77922l82157m24003m97628n87120o72607p36504
3308F12131805p69805p74041p58934p37037p18842p09000p06863p08351p08580p05452
3318F04834900o99921o94961o95381p04995p25288p55310p90444q24394q52012q68454
3328E97223740q74024q71277q64792q57887q52814q49342q47473q47740q54569q71620
$$ plain form
3258 632519798 632155037 631800957 631453056 631109085 630773048 630455513 630168571 629918900 629700279 629491997
3268 629491997 629263763 628986549 628642807 628234215 627779503 627306976 626843758 626406326 625997658 625609818
3278 625609818 625230637 624849701 624462929 624071999 623681679 623297005 622920227 622550392 622184181 621816635
3288 621816635 621442223 621056137 620652924 620226898 619773369 619289093 618775139 618238983 617695465 617164764
3298 617164764 616667099 616215668 615809746 615431824 615049667 614625664 614128036 613540916 612868309 612131805
3308 612131805 611362000 610587959 609829025 609091988 608373146 607664146 606957283 606248932 605540352 604834900
3318 604834900 604134979 603440018 602744637 602039642 601314354 600559044 599768600 598944206 598092194 597223740
3328 597223740 596349716 595478439 594613647 593755760 592902946 592053604 591206131 590358391 589503822 588632202
3338E88632202r01756r42612r85718j020088j034775j025428r96476r60578r33571
3347E79831200r29032r52606r99794j058693j113357j150818j164856j156998j135750
3356E70169296j111374j092262j082191j079178j077805j073074j062546j049156j040192
3365E60501518j043167j063652j099777j143990j183357j205864j203384j175881j130752
3374E50251694j079636j035499j006737r96132j000099j010895j018066j012917r88884
3383E41102829r44634q84513q17757p57256p15866p01294p13195p41349p68432p77207
3393E33281326p57484p11174o52542o03791n83801o01692o50482p11174p59316p76024
3403E26473846p54470p02248o36520n75829n33791n14221n13000n21202n30205n35240
$$ plain form
3338 588632202 587730446 586787834 585802116 584782028 583747253 582721825 581725349 580764771 579831200
3347 579831200 578902168 577949562 576949768 575891075 574777718 573626900 572462044 571305046 570169296
3356 570169296 569057922 567965660 566883469 565804291 564726486 563653412 562590866 561541710 560501518
3365 560501518 559458351 558394699 557294922 556150932 554967575 553761711 552558327 551382446 550251694
3374 550251694 549172058 548136559 547129822 546133690 545133591 544122696 543104630 542091713 541102829
3383 541102829 540158195 539273682 538455925 537698669 536982803 536281509 535568314 534826965 534058533 533281326
3393 533281326 532523842 531812668 531160126 530556335 529972534 529370842 528720360 528009186 527249870 526473846
3403 526473846 525719376 525017128 524380608 523804779 523270988 522756767 522243767 521722565 521192360 520657120
3413E20657120n35431n31578n25360n16320n01594m78668m45328m02680l55110l09372
3423E16055679k72178k47650k34261k25258k11525j85127j44386r6398n3749k9411
3433E14355736k9869n1651q2054j05019j09749r4185o7291m1389k6436k3003k2697
3444E13702393j3085J5640O4469J25198J84479K30446K57721K68860K71797K74315
3454E15382233K79770K86026K87857K81562K68746K57377K58637K81296L26271L83186
3464E18292961M33045M55818M39338L86315L15437K54173K27509K45933L01095L68385
3474E21720009M18892M32396M05883L53432K98729K62680K55699K74773L07503L40957
3484E25070953L66021L80516L87306L90396L94211M02946M18854M43764M74624N02854
$$ plain form
3413 520657120 520121689 519590111 519064751 518548431 518046837 517568169 517122841 516720161 516365051 516055679
3423 516055679 515783501 515535851 515301590 515076332 514864807 514679680 514535294 514438896 514385147 514355736
3433 514355736 514325867 514274216 514192162 514087143 513977394 513883209 513815918 513774529 513748093 513725090 513702393
3444 513702393 513689308 513704948 513769417 513894615 514079094 514309540 514567261 514836121 515107918 515382233
3454 515382233 515662003 515948029 516235886 516517448 516786194 517043571 517302208 517583504 517909775 518292961
3464 518292961 518726006 519181824 519621162 520007477 520322914 520577087 520804596 521050529 521351624 521720009
3474 521720009 522138901 522571297 522977180 523330612 523629341 523892021 524147720 524422493 524729996 525070953
3484 525070953 525436974 525817490 526204796 526595192 526989403 527392349 527811203 528254967 528729591 529232445
3494E29232445N15404N00106M52500L79791L00331K37007K06413K12136K44446K85148
3504E32565727L18337L37181L45421L52935L69263L97110M32015M65431M89235M99382
3514E36572037M97284M86183M70238M51011M26903L94249L48778K90107K23198J60752
3524E40320740J20468J19095J62964K42958L33938M04740M31976M14200L72734L41949
3534E43265762L52021M07028M82902N35431N22843M28314K69050Q9303o0311j45836
3544E46146507j60827j23864o5002r232L1624N7755P4615Q7128R9678J19476J56670
3555E46414528K18925K99187L66020L65601K41051l9902m56848r30710j341744j570587
3565E43565521j546135j275444q46634l97834o6300O1264k3155k49062n00183o61392
$$ plain form
3494 529232445 529747849 530247955 530700455 531080246 531380577 531617584 531823997 532036133 532280579 532565727
3504 532565727 532884064 533221245 533566666 533919601 534288864 534685974 535117989 535583420 536072655 536572037
3514 536572037 537069321 537555504 538025742 538476753 538903656 539297905 539646683 539936790 540159988 540320740
3524 540320740 540441208 540560303 540723267 540966225 541300163 541704903 542136879 542551079 542923813 543265762
3534 543265762 543617783 544024811 544507713 545043144 545565987 545994301 546263351 546352654 546292343 546146507
3544 546146507 545985680 545861816 545796814 545787582 545819206 545876961 545951576 546038704 546138382 546257858 546414528
3555 546414528 546633453 546932640 547298660 547664261 547905312 547865410 547408562 546477852 545136108 543565521
3565 543565521 542019386 540743942 539897308 539499474 539433174 539494438 539471283 539222221 538722038 538060646
3575E38060646o64787n16281k94266j18904j07231l24822p57446j312256j848488k230568
3585E29885597k378502k298927k080193j855278j744728j807060k015991k274361k457237
3594E10973320k464714k260437j881638j421356r93042o98128o06079p50007j130524
3603D98767395j720581k466850l295746m127617m907761n635032o373482p226410q269119
3612D54744797r468117j0622711j1376763j1311149j0094757p637100m169503k13356
3620C89851341L564987O559411Q408546R084663Q860855Q171807P438545O925049O680832
3629D55546036O576156O403580N990143N276871M339447L349456K501793J934967J675759
3638D93594208J625900J594620J368713P97463j39313j306915k449723l277931l572578
$$ plain form
3575 538060646 537395859 536879578 536585312 536466408 536359177 536034355 535276909 533964653 532116165 529885597
3585 529885597 527507095 525208168 523127975 521272697 519527969 517720909 515704918 513430557 510973320
3594 510973320 508508606 506248169 504366531 502945175 501952133 501254005 500647926 499897919 498767395
3603 498767395 497046814 494579964 491284218 487156601 482248840 476613808 470240326 463013916 454744797
3612 454744797 445276680 434653969 423277206 411966057 401871300 394234200 390064697 389851341
3620 389851341 393416328 399975739 408384285 417468948 426329803 434501610 441940155 448865204 455546036
3629 455546036 462122192 468525772 474515915 479792786 484132233 487481689 489983482 491918449 493594208
3638 493594208 495220108 496814728 498183441 498980904 498841591 497534676 495084953 491807022 488234444
3647D88234444l269768k486534j475296n26276J41106M51088M81224M06227M06837
3656D82363052N85404R24911J304207J558266J554870J249085P01523M9019n49508
3665D89740829r73358j177864j199760j130829j071854j087227j180915j299706j361504
3674D79257812j300735j106453q40950o32019o38580j003876j810150l047829m609718
3683D64267502o307182p909012r188576r972191j0173340r807930q981247p854538
3691C94073486o594658n326919m104576k900200j628876j88179J495628L428154N528031
3700C83781891P632675R528618J1000519J1888008J2135887J1818962J1131897J0337372
3708D69255829R688492R347000R329643R511032R674988R607811R182510Q404923P399826
$$ plain form
3647 488234444 484964676 482478142 481002846 480476570 480617676 481068764 481549988 481956215 482363052
3656 482363052 482948456 483873367 485177574 486735840 488290710 489539795 490241318 490290337 489740829
3665 489740829 488767471 487589607 486389847 485259018 484187164 483099937 481919022 480619316 479257812
3674 479257812 477957077 476850624 476009674 475377655 474739075 473735199 471925049 468877220 464267502
3683 464267502 457960320 450051308 440862732 430890541 420717201 410909271 401928024 394073486
3691 394073486 387478828 382151909 378047333 375147133 373518257 373330078 374825706 378253860 383781891
3700 383781891 391414566 400943184 411943703 423831711 435967598 447786560 458918457 469255829
3708 469255829 478944321 488291321 497620964 507131996 516806984 526414795 535597305 544002228 551402054
3717E51402054O350746N424194M717903M252892M001236L921890L974228M100990M200402
3726E92346535M121742L711662K899666J780968O35032j54190k58560M23241J680298
3735F07186394L044204L977814M111214L407326K170753Q89320n073l35236k30179
3744F24216537j2702J3046k56920o69670r18770p34901n6878R18465J832581K350845
3754F26681633K328377J873932J275100Q38089P33147R22623J203308J329460J145401
3763F38331070O61545M1885m78096p00111n43976p3471N37109J076203J370773J344986
3773F41567917J036148N71518J14212k00043l06549k25448l5553J69906L28140M24347
3783F43444595M85306N48706O38046P52106Q74100R85718J073303J121902J101838
$$ plain form
3717 551402054 557752800 563176994 567894897 572147789 576149025 580070915 584045143 588146133 592346535
3726 592346535 596468277 600179939 603079605 604860573 605495605 605341415 605082855 605506096 607186394
3735 607186394 610230598 614208412 618319626 621726952 623897705 624787025 624781952 624446716 624216537
3744 624216537 624203835 624216881 623959961 623290291 622371521 621636620 621579742 622498207 624330788 626681633
3754 626681633 629010010 630883942 632159042 632997131 633730278 634652901 635856209 637185669 638331070
3763 638331070 638992615 639034500 638556404 637856293 637312317 637238846 637775955 638852158 640222931 641567917
3773 641567917 642604065 643175583 643289795 643089752 642783203 642557755 642522202 642692108 643020248 643444595
3783 643444595 643929901 644478607 645116653 645868759 646742859 647728577 648801880 649923782 651025620
3792F51025620R71221O93055K67181k48947p50046j122131j294480j269912j113205
3801F47158356q98590o60630l68118M2954O03408J254425J840210K164307K084503
3810F53220825J587525Q03375n3024p78504j259537j490173j529846j434250j213532
3819F47852859q40835l05176L39127R65423J424332J618805J557083J341934J102600
3828F55056152R08966P29981M58603o87o45676j346282j894303k106094j914444j391220
3838F47854996o91681M9286P84988J547394K356110L110961L549347L325348K189789
3847F64076538J83029k280578m498444n734634n524445l892288j362839J242981L138504
3856F45347824L872452L468857K347412J085052J44959k96631l56522l07083l87115
$$ plain form
3792 651025620 651996841 652689896 652957077 652708130 651958084 650835953 649541473 648271561 647158356
3801 647158356 646259766 645599136 645231018 645273972 645877380 647131805 648972015 651136322 653220825
3810 653220825 654808350 655611725 655558701 654780197 653520660 652030487 650500641 649066391 647852859
3819 647852859 647012024 646706848 647045975 648011398 649435730 651054535 652611618 653953552 655056152
3828 655056152 655965118 656695099 657153702 657153015 656507339 655161057 653266754 651160660 649246216 647854996
3838 647854996 647163315 647212601 647997589 649544983 651901093 655012054 658561401 661886749 664076538
3847 664076538 664259567 661978989 657480545 651745911 646221466 642329178 640966339 642209320 645347824
3856 645347824 649220276 652689133 655036545 656121597 656266556 655969925 655613403 655306320 654919205
3865F54919205o67725j032715j269836j201248p84455j29471N61066J086121J323318
3874F52804260J256867R56268N30167Q6746k90146n44357o50788o16073m80805l11889
3884F52740250j78070j20850j28632j37634o0806J64642N34058R58404J288376J366425
3894F56426163J093139M74778l68348j232986j899262k200927k077179j584091q65937
3903F47765350r9182N64881J036148J288223J339798J222839R69925O14700K05384
3912F54908066j88294m88433o35758o17828m76990k89764j26877k2660L5172Q3008
3922F52179642J43738K03933K18582J42975k8991k49024m31595m95071m04434j88141
3932F51091614P8277L05100M27017M20914L02200J14670q7967k51999l35464l21885
$$ plain form
3865 654919205 654251480 653218765 651948929 650747681 649963226 649833755 650394821 651480942 652804260
3874 652804260 654061127 655017395 655547562 655634308 655344162 654799805 654149017 653532944 653052139 652740250
3884 652740250 652562180 652441330 652312698 652175064 652114258 652278900 652812958 653771362 655059738 656426163
3894 656426163 657519302 657994080 657625732 656392746 654493484 652292557 650215378 648631287 647765350
3903 647765350 647666168 648231049 649267197 650555420 651895218 653118057 654087982 654702682 654908066
3912 654908066 654719772 654231339 653595581 652977753 652500763 652210999 652084122 652061462 652096634 652179642
3922 652179642 652323380 652527313 652745895 652888870 652859879 652610855 652179260 651684189 651279755 651091614
3932 651091614 651169891 651474991 651902008 652322922 652625122 652739792 652651825 652399826 652064362 651742477
3942F51742477k31247j16424m1733m8599j27106k18506k47497j75247k7237J13754
3952F50622635J60980Q1711p9117k26288k79083k26212j29623p5378j06202j85852
3962F49557571k31552j83410o3706K8763q469j92871m25796n51071m70353k30255p629
3973F47221222J3428k14768n47256p37381o23932k78397J3352n1499n43747j194839
3983F43056183j549606j307145o17332p9651l69186j690216l450127m481735l832779
3992F25678406j725846o4315j994934j0522652k6762238m8740463p1515961q8763466
4000C75588531
$$ plain form
3942 651742477 651511230 651394806 651353073 651304474 651177368 650958862 650711365 650536118 650508881 650622635
3952 650622635 650783615 650865326 650786209 650559921 650280838 650054626 649925003 649849625 649743423 649557571
3962 649557571 649326019 649142609 649078903 649107666 649099197 648906326 648480530 647929459 647459106 647228851 647221222
3973 647221222 647234650 647019882 646472626 645735245 645111313 644832916 644846268 644794769 644251022 643056183
3983 643056183 641506577 640199432 639582100 639502449 639133263 637443047 633992920 629511185 625678406
3992 625678406 623952560 623888245 621893311 611370659 584608421 535867958 464351997 375588531
4000 375588531
##END=$$ End of the data block
