##TITLE=$$ Begin of the data block
##JCAMP-DX=5.00 $$ ACD/SpecManager v 10.08
##SPECTROMETER/DATA SYSTEM=16PC
##DATE=16 Jul 2013 10:55:16
##DATA TYPE=INFRARED SPECTRUM
##DATA CLASS=XYDATA
##ORIGIN=
##OWNER=
##NPOINTS=3601
##FIRSTX=400.00000000
##LASTX=4000.00000000
##MAXX=4000.00000000
##MINX=400.00000000
##MAXY=36.24570465
##MINY=1.71623135
##XFACTOR=1.0000000000
##YFACTOR=0.000000100000000
##FIRSTY=28.99946976
##DELTAX=1.00000000
##XUNITS=1/CM
##YUNITS=TRANSMITTANCE
##XYDATA=(X++(Y..Y))
400 289994698 304830551 318548203 319018364 317483177 323892822 329994202 328829269 326462975 325694542
409 325694542 329360733 345641594 361303558 362457047 359249802 357856255 356306534 357219925 353002319
418 353002319 330710869 309010963 306607246 310437431 312759399 316316357 321882477 327621460
426 327621460 331881981 334880600 335895996 336089592 337974319 336772690 324542046 313287735 316505184
435 316505184 321778297 318148842 314738731 318818550 324981194 330817451 334601135 332212448 328421326
444 328421326 327105255 326821556 327395439 328900337 331905136 334747314 335406303 335524559 335945587
453 335945587 337044449 340433578 343244057 342242699 340134850 338482857 337479324 338434906 339554787
462 339554787 339279404 338210106 336330643 333931923 330732346 328432083 329007607 331344833 335796356
471 335796356 339935760 341395836 340348244 334694366 328877678 327469826 327985039 329767227 331896782
480 331896782 333003769 333779793 334746819 335042229 333423386 331550827 331601372 330780716 326028099 320316544
490 320316544 315183640 311874847 313785782 316002121 313196640 310001125 309885731 311007729 312976112
499 312976112 314905624 315372696 315600853 316788425 317584496 316074123 315147629 318008175 321801186
508 321801186 324575424 326821327 328324051 329246979 329655380 329627037 328953972 328556061 329677582 331135979
518 331135979 331777344 332758904 335393677 338059654 339687119 339929810 336910477 334151993 335740089
527 335740089 338107338 338992119 338561783 335215569 331995468 332173080 333455811 334779510 335727921
536 335727921 334951630 334183197 334857941 336516113 339492302 342838745 346353760 348130455 344461212
545 344461212 340544930 342123985 343859673 341042976 337525597 335939178 335231781 335237274 335930099
554 335930099 337556343 339133987 339658737 339442711 337905655 336718063 338034630 339821091 340699921
563 340699921 340856056 339602470 338175507 337785225 337822418 338165741 338560333 338779678 338614464 337834358
573 337834358 336272469 332952271 330069046 329993706 331222992 333839874 335455894 332284203 328601112
582 328601112 327843666 328739395 331997375 335109940 335172157 334084244 332423935 331253281 332497330
591 332497330 334143639 334599495 334527016 333753815 333188286 333935013 335232239 336724510 338296890 340370407
601 340370407 340978622 336875916 332319946 331276169 331372719 331533661 331834068 331999512 332001915 331642838
611 331642838 331156731 330378761 330308189 332650185 335119476 335766296 335286140 333184700 331081161 330750198
621 330750198 331227303 332243919 333482971 334475746 335405807 337030640 337156754 332431564 327087173
630 327087173 324494095 323883743 326588860 329672318 329984665 329494934 329217911 328865280 328474274 328082809
640 328082809 327925186 327448845 325636597 324116211 324895363 325815659 324886780 323609581 323055038 322521667
650 322521667 321320763 320485115 321312408 322317123 322123260 321698189 321703644 321678162 321387520 320811005
660 320811005 319468727 318502426 318316917 320639610 332097778 338394165 319892635 299234848 296178093
669 296178093 299736252 306760788 313495636 313521137 311677933 311249733 310485592 308229198 305978527
678 305978527 305068474 304831963 305341721 305710545 304613819 303435555 303385239 303658714 303915253 303970337
688 303970337 303206902 302581291 303357582 303995590 303204765 301497211 298824310 295576324 292103043
697 292103043 288476448 284962883 281328430 277255516 273259163 269463043 266721725 266729584 267088890
706 267088890 265581589 263360023 260956268 258010864 253985405 249946098 247771492 244485607 237422218
715 237422218 227529526 215459099 199431171 177170506 150811663 119997730 89924803 65448513
723 65448513 47233334 39058676 36434879 36066761 38150301 41467419 46963921 55441847 66113224
732 66113224 77993383 92473736 110563984 132421961 159474363 188924294 219396095 248052597
740 248052597 271223297 290032139 304266930 314264297 319559326 322344055 324805717 326492538
748 326492538 327662468 328370323 328689346 328820953 328884125 329196434 330516090 331640472 331333847 330451736
758 330451736 329343567 328290710 328034630 327540855 325443497 323476067 323463669 323762665 323017578 322188606
768 322188606 322064629 321803093 320725670 319127312 316726437 314573040 314022770 313875904 313210239
777 313210239 312545776 312369347 311858177 310171127 307847729 305076828 302069168 299143066 296162109
786 296162109 293349495 289943199 284958344 279285889 272630920 267563572 267044525 269607296 275606613
795 275606613 282538414 288035851 292040329 293194771 293027153 292416325 291950932 293254604 294097900
804 294097900 291968346 289336662 288087349 287463646 287285309 287704220 289321899 290606499 289592247
813 289592247 288180103 287990570 287897816 286986809 286243191 286727657 287297249 287007084 286321640 285124283
823 285124283 284212570 284998398 285518875 283606758 281285038 280135155 279313087 278738976 277698975
832 277698975 275137177 271996727 268658390 265750637 264317017 263493042 262762527 262123814 261503925
841 261503925 260597687 258788109 256937485 255721321 255081882 255439510 256033649 255965233 256069889 257314911
851 257314911 258403530 257833233 257187843 257971268 258917561 259120216 259001732 258778801 258161545 257054558
861 257054558 255088081 251892319 247371178 241102676 233694077 225895386 216855755 205137711 193249207
870 193249207 182352295 175045013 175819855 180153122 184810390 190414429 196412086 203095665 211001396
879 211001396 218842735 225436668 231008530 235102406 238575687 242356300 245775928 248505821 250453701
888 250453701 251289825 251397133 250856628 250243893 250319481 250606995 250848999 251146774 251420021 251953831
898 251953831 252997150 254577866 256857147 259683113 262886505 266679993 271437645 276504745 281310310
907 281310310 285975685 290681343 294675827 296827068 298454285 300774326 302960625 304429283 305666676
916 305666676 307038059 308320503 309411755 310312023 311037769 311436882 311178665 310813904 310850143 311084499
926 311084499 311630249 312046051 311742535 311275234 311076393 310925484 310795784 310537567 309784889 309156170
936 309156170 309428444 309758186 309418182 308833122 308109035 307471504 307234993 307237625 307615738 307789078
946 307789078 306983223 305914383 305156937 304359894 303222885 302168350 301731110 301273098 300172081
955 300172081 298915367 297899704 296774368 295307865 293539047 291323166 288977852 286859512 284705391
964 284705391 282410851 279856434 276777973 273502579 270024757 267077198 265575161 264965057 264955025
973 264955025 265675297 267302265 269405365 271627655 273921013 276166668 278216591 279851913 281164169
982 281164169 282107811 282875290 283639660 284409981 285491943 286166649 285402298 284443130 284422379 284641495
992 284641495 284829845 284833660 284372787 283552628 282317162 280867329 279462090 277869682 275799751 273684006
1002 273684006 272217503 270318260 267229538 262669067 255791893 247526875 239263535 228774071
1010 228774071 214407196 195820084 169996719 143303862 120475044 103390207 96393576 96822968
1018 96822968 104547968 116317263 129183521 142101278 152274361 162004223 173568726 184240799
1026 184240799 191892128 197002163 198776245 198905945 198939552 198510399 197770576 196710339 195286980
1035 195286980 193748474 192437878 191026688 189072113 187256813 186218262 185646286 185221424 185607662
1044 185607662 187522640 190482845 194363594 198804131 203344345 208156586 213310471 218651524 224213600
1053 224213600 229500999 233973255 237796783 241002541 243453026 244835854 245704155 246786575 247242203
1062 247242203 246280422 244476318 242061615 239272575 236575127 233509521 229652634 225360622 221157532
1071 221157532 216113548 209348907 201235275 191635590 181194534 170559158 159584990 148201694
1079 148201694 136832943 125756969 115338078 106315365 97841253 89051952 80731859 73505869
1087 73505869 66986313 61082830 55526009 49746504 44550886 40839901 37761679 34548750 31846991
1096 31846991 30059566 29144754 29355755 30210247 31344166 32653084 33828726 35117378 36696186
1105 36696186 38463821 40457478 42438021 44277897 45678606 46246519 46137800 45324793 43963184
1114 43963184 41907063 40031662 39397945 39301386 39304485 39667120 40520897 41811218 43664923 45669546
1124 45669546 47393551 49018373 50482025 52081814 54104080 56518307 59398165 62714090 66417208
1133 66417208 70636024 75503101 80956926 86924305 93570223 101116648 109316339 117973080 127153387
1142 127153387 136930933 147084942 157484999 167930355 178213120 188222160 197815647 206876507
1150 206876507 215276222 222907295 229507675 235412102 240941505 245872955 250073433 253593197 256442528
1159 256442528 258605461 260070801 260832787 260853043 260216217 259092331 257184486 254149189 250293484
1168 250293484 245509148 240697365 236661663 233584633 232034435 231657257 232232094 233926048 236937752
1177 236937752 240950584 245947113 251227837 256111851 260525932 264183044 267040710 268766632 269942741
1186 269942741 271187782 272059193 272144775 271971931 272165298 272019615 270780792 269219151 268016319
1195 268016319 266684036 264872551 262848129 260699978 258608570 256836643 255225639 253789902 252272110
1204 252272110 250258675 248230209 246720314 245154839 242954960 240667343 238805523 236887684 234665146
1213 234665146 231950512 228319397 224232178 220018616 215645542 211267700 206649532 201585770 196140289
1222 196140289 190389385 184088936 177008381 169181328 160665970 151155701 140246859 128286114
1230 128286114 115270844 101845016 88452568 75688829 64251652 54274073 46188107 39793005
1238 39793005 35234442 31905165 29226770 27256241 25948992 25030842 24177542 23494234 23044100
1247 23044100 22626629 21995535 21350374 20785799 20367136 20253410 20258417 20245543 20222416 20147791 20029058
1258 20029058 19875994 19637575 19168129 18760195 18738499 18858185 18910637 19110909 19682159 20388355
1268 20388355 21032324 21720638 22524586 23351183 24155846 24861326 25271406 25697699 26481619 27336349
1278 27336349 28151741 28736105 28627386 28524151 29122105 29966345 30730715 31724205 33223381 34998646
1288 34998646 36910524 38963547 41004648 43365707 46262255 49890270 54635754 60142984 66143980
1297 66143980 72758665 80191603 87918749 95479717 102885475 109946480 116801729 123423567 130122414
1306 130122414 137232056 144654503 152531137 160474777 168160667 175540199 182440033 188905945 194832554
1315 194832554 200498581 206122150 211778145 217670898 223628998 229639759 235429268 240649223 245509853
1324 245509853 250339966 254434814 257278900 258631210 258012276 255619507 251568546 245625496 237541656
1333 237541656 227475624 214951019 201622963 188649883 177043667 167987328 162124863 160450439
1341 160450439 163093071 171152344 182709198 196723442 211657524 225706100 238629799 249629021
1349 249629021 258579006 264779320 269155006 272397270 274504662 275581360 275998821 276511192 276073914
1358 276073914 274078598 269970398 262364616 253141155 243564606 234096527 225884190 218133678 209733467
1367 209733467 202779999 199440956 198390465 199230652 201342812 203784943 207128525 211913815 217290630
1376 217290630 222643852 227807045 232481956 236445885 239121895 241272678 243929615 245708923 245115280
1385 245115280 243512611 241589298 239875069 239526978 239348164 238940468 237062683 231115093 224773865
1394 224773865 222150555 219339600 213086357 205548038 197811832 189833145 182768574 174101830 160818100
1403 160818100 145568361 129101028 114107122 103540173 97360363 96117725 100994816 114290466
1411 114290466 133205404 156522503 181792965 207284203 229628563 243505230 253040771 259943008
1419 259943008 266145458 275921097 283956280 284402599 283137074 285358887 287250023 286512127 283783665
1428 283783665 278104782 271970978 267981987 264864426 263463249 260023117 248424759 236605148
1436 236605148 231802692 229993820 230114441 230521431 228407135 226197701 225890160 225962391 225750923
1445 225750923 224676132 221004944 217530956 217283249 217820396 216721039 216953506 223222733 227896690
1454 227896690 221445312 214264374 214812279 219371071 227744102 237825146 248297920 256594887
1462 256594887 257677307 257639389 261909943 267445793 273194065 278609028 283486118 285746803 280890217
1471 280890217 275978088 278314590 282669067 285775642 289041748 293083191 297006111 300093880 302427292
1480 302427292 303190937 304354420 308571091 312970867 315262794 316360703 316658020 315424423 310383301
1489 310383301 306565514 310170174 315412979 319329967 319655876 310779572 299774628 293117752 286986103
1498 286986103 279403191 271306744 262535553 254409542 248756161 243889561 236100426 233285408 245550385
1507 245550385 262557259 277600288 289885521 294217567 297094097 305983543 312776794 308235874
1515 308235874 303213120 309063911 315040340 312258224 306480160 299027443 294337978 300983429 307882309
1524 307882309 303286304 297766685 299707870 303918591 308434486 311956635 312121849 310158958 303849449
1533 303849449 301170807 314572334 328417778 329062920 322978973 308922520 296389809 298141232
1541 298141232 303138962 302853088 302519550 305461636 308885078 310935974 312114468 311721554 311498146
1550 311498146 313878517 316082706 314072361 314054718 326796761 334580650 315779190 292885284
1558 292885284 282726994 280671825 291759491 303797951 302587967 299189568 302242031 304805756
1566 304805756 302032471 296286583 286133518 278121223 281759720 286727180 285742760 279193382 260405045
1575 260405045 243276825 243179073 249020329 254333496 260614624 267153492 274098854 281913509 288944473
1584 288944473 293247223 296158791 298276176 299874058 301466217 302929153 304511776 305610657 305393925
1593 305393925 304793358 304548721 304403534 304406872 304378967 304290524 303735733 301915874 299978714 299074879
1603 299074879 298396568 297562599 296440582 294778099 292551498 288933029 286081543 286331635 288327675
1612 288327675 293410530 295821896 286099434 276695709 279441109 286738148 296486855 304022541 301483612
1621 301483612 296359520 293805580 292959919 296192627 298962097 295401802 291856518 293676605 297975769
1630 297975769 305395355 310700169 307501793 299901237 287070732 277405739 283211212 291928291
1638 291928291 292682648 292723408 297049274 301535835 304496517 303613663 292257309 281675091 282588234
1647 282588234 289942970 308042755 319537163 299931526 274960022 264204025 261626701 271086693
1655 271086693 282477837 284853210 284592133 285539627 284350395 276867142 269367924 267875175 268998375
1664 268998375 272778969 274942150 269522171 261631718 253175964 247809162 253679981 259208183 252166977
1673 252166977 242641678 237148514 234167557 235608807 237695923 236236076 234386196 236532669 234792938
1682 234792938 216898193 200392475 204001179 211910248 212890129 211909523 209645500 207740059 209632874
1691 209632874 210605373 206212997 199070435 188857784 179933300 180513840 178700447 160025349 140409460
1700 140409460 134940853 131649246 122444620 110771646 96628895 82261791 70357313 59586039
1708 59586039 49220076 40138474 33119192 27735939 23951998 21375408 19675245 18628111 17908325
1717 17908325 17490854 17233839 17162313 17332306 17506828 17240276 17213573 18328657 19475927 19471159
1727 19471159 19437304 20363083 21464338 21917334 22828569 25346746 28519382 31566610 35117378
1736 35117378 39366236 44833174 51917067 61175575 73697081 88286867 104140987 121175280
1744 121175280 139497271 157725801 174766769 189865818 201080780 210880737 221225014 231699944
1752 231699944 243688812 253756981 257005692 259208183 266095390 272892456 276195984 277622681
1760 277622681 276286831 276292076 283814182 291748505 293431740 293715706 295769691 297975769 300725937
1769 300725937 301156750 293716183 286858559 289469223 294699898 298278313 301359406 303927174 305222263
1778 305222263 303360691 301699142 304411392 307162514 305726051 303946724 304692020 306664925 310155373
1787 310155373 313267460 314398994 312955132 305538883 298954468 300920944 305296650 308295002 310567608
1796 310567608 311442604 311102619 308866959 306652775 306579094 307356586 308542004 309715500 310149651
1805 310149651 310321312 310662727 310578346 309215546 307776680 307318916 307423344 308309307 309118977 308763962
1815 308763962 308153858 307874184 307805290 307910671 308524361 310770035 312238922 309332352 306743374
1824 306743374 309680443 312997322 312547436 310539951 306864491 304330578 307182541 311003189 312149754
1833 312149754 312541962 312929859 313179474 312885513 313610306 318054657 322395096 323676338 321992645
1842 321992645 313902607 307054520 310822716 316586723 317504635 317612152 319196453 320658913 320842972
1851 320842972 320709229 320909958 321213226 321669083 322081795 322204094 322238197 322224617 322399139 323059311
1861 323059311 324057579 325595131 326921921 327585449 326890717 322871437 318887463 318202248 319138527
1870 319138527 321655273 324105988 324334602 323826790 323336601 322901001 322929840 323057404 323003044 322920799
1880 322920799 322931290 322852364 322192421 322000008 324038010 325671921 323970566 321583252 320224762
1889 320224762 319765797 321337204 322870483 322010269 320747833 320537567 320633621 320807686 320960045 320876579
1899 320876579 320669861 320294609 320009232 320179214 320436707 320574760 320474625 319831352 318995476 318090439
1909 318090439 317491035 317706337 318456402 320060234 321228981 320422897 318712692 316071968 314250698
1918 314250698 316179733 318287601 317055931 315256119 314775219 314745407 315093498 315320015 314634781
1927 314634781 313834419 313650837 313485851 312855721 312146416 311637878 311163177 310525398 310091476 310363045
1937 310363045 310736408 310989132 310477257 307655334 305001717 305262794 306087952 305701485 305122128 304865341
1947 304865341 304663658 304308643 304135780 304603806 305131416 305116405 305076828 305554619 305873871 305247059
1957 305247059 304550400 304517746 304788342 305222511 305889359 307033291 307987671 307887306 307571640 307617416
1967 307617416 307946434 308852425 309795132 310213089 310461044 310693493 310946693 311382751 311776867 311879864
1977 311879864 311923981 312087517 312282066 312486153 312677135 312863579 312927475 312584629 312340240 312841644
1987 312841644 313377838 313387871 313065987 312104683 311447144 312394142 313563347 313775063 313720932 313704491
1997 313704491 313709717 313806286 314038506 314610710 315111618 315006714 314869385 315231075 315680733 315977097
2007 315977097 316141129 315979710 315891018 316400986 316931000 317020645 316838017 316239357 315697670 315740089
2017 315740089 316060524 316671600 317141285 316825619 316371670 316340675 316344261 316100578 315849056 315741043
2027 315741043 315755844 315995216 316241016 316213360 316197147 316486588 316771259 316760769 316687336 316731453 316755295
2038 316755295 316665649 316508999 316285362 316039543 315768242 315613022 315862656 316072216 315757980 315325489
2048 315325489 315057259 314835548 314563980 314458847 314858437 315298080 315381050 315240364 314777603 314289322
2058 314289322 314119568 314024200 313917160 313665848 312925568 312244873 312191963 312362900 312564602 312732697
2068 312732697 312715530 312581062 312328091 312011471 311675301 311350822 311048508 310873737 311066380 311230164
2078 311230164 310939064 310519218 310171833 309844246 309570065 309290886 308883171 308575134 308627129 308817616
2088 308817616 309064617 309208145 308981171 308623066 308245659 307962646 308019867 308132877 308046799 307915192
2098 307915192 307809830 307718983 307642937 307614326 307719460 307794323 307641735 307446709 307330589 307286968 307383537
2109 307383537 307518959 307615509 307669144 307619801 307556858 307555904 307595005 307697296 307800522 307835579 307842960 307813873
2121 307813873 307827225 308017483 308205833 308238029 308171272 307978630 307756176 307576637 307480087 307574730 307728519
2132 307728519 307890396 307921867 307498684 307125320 307374706 307714214 307721367 307637920 307565441 307499886 307458878
2143 307458878 307476273 307606697 307804337 308101654 308315735 308222523 307976723 307589760 307266464 307276726
2153 307276726 307435741 307669144 307913532 308075657 308170319 308158627 308108330 308050385 308052769 308212280 308470230
2164 308470230 308835258 309201241 309449902 309624672 309781303 309762707 309260597 308782082 308849087 309106331
2174 309106331 309389572 309644699 309745789 309741478 309597969 309435596 309397926 309381237 309332123 309241295 308988571
2185 308988571 308851700 309204559 309636822 309813957 309882622 309847107 309799423 309930553 309947243 309514503 308947792
2196 308947792 308393230 308020096 308179359 308472137 308560600 308612328 308728218 308770409 308553925 308320503
2206 308320503 308301430 308340778 308394890 308358192 308041077 307649117 307286968 307066193 307238083 307486992 307550659
2217 307550659 307518711 307308903 307172775 307435036 307793846 308112850 308217506 307683220 307123642 307144871
2227 307144871 307345390 307521324 307685356 307802906 307810059 307604790 307265987 306761971 306319695 306211224
2237 306211224 306266289 306439629 306626778 306697598 306681633 306535473 306345215 306238632 306043854 305533638
2247 305533638 304998856 304688206 304501286 304437389 304445267 304450264 304520607 304738503 304985046 305212479 305288315
2258 305288315 304933548 304538002 304471016 304512253 304612865 304625969 304251900 303898087 303948154 304172974 304558506
2269 304558506 304839592 304644814 304275742 303879013 303544750 303483238 303477993 303373566 303196182 302780857
2279 302780857 302543144 303038597 303678970 303990822 304182510 304336777 304355621 304037552 303773155 304028263
2289 304028263 304373970 304467430 304515114 304636955 304748993 304794064 304809570 304714203 304804802 305445175 306349983
2300 306349983 307457199 308457375 308930397 309142570 309201241 309161892 309138756 309059849 308903446 308629990
2310 308629990 307958355 307590237 308286419 309587479 311716537 313384762 313000183 311692238 309912910
2319 309912910 308101406 306915741 306148758 305827847 305907249 306678047 307155609 306382885 304565430 300730934
2329 300730934 297452431 297816505 299307575 300470352 301209202 300636292 299672832 299286594 298447361
2338 298447361 296456566 293286552 288656940 282623997 272828331 266233444 270285835 281174412
2346 281174412 300706863 319472771 326865921 328279724 324508667 318742981 315153351 311593056
2354 311593056 306915035 302287807 298699131 295541992 292697659 289687157 285486679 281609764 279545059
2363 279545059 278340340 277715912 277142525 275768032 274279099 272937775 272165298 272829762 273851624
2372 273851624 274163475 274596443 275748959 277250748 278913956 280786972 282870998 285118103 287618866
2381 287618866 289955368 291635265 292970886 294120293 295052986 295848846 296333542 296172600 295924187
2390 295924187 296161880 296501865 296753159 296907883 296833496 296711922 296756496 296739807 296396008 296053391
2400 296053391 295963516 296087971 296557655 297112923 297536602 297831993 297883034 297829132 297747841 297706833 297849655
2411 297849655 298024178 298104744 298152428 298229923 298203926 297855606 297503223 297404747 297522545 298085442 298551311
2422 298551311 298254967 297793140 297578316 297495346 297589054 297788620 298053246 298334579 298601856 298758736
2432 298758736 298649540 298419228 298121204 297873497 297865868 297934532 297978401 297997704 297906151 297861328 298032990
2443 298032990 298295727 298672428 298887711 298475494 298030853 298166733 298360577 298196793 297964096 297854176
2453 297854176 297740688 297497501 297312241 297396660 297551384 297632675 297684422 297692528 297684174 297680130 297685852 297741394
2465 297741394 297762375 297680855 297484150 297035446 296638489 296631317 296771049 297001839 297097435 296722412 296146393
2476 296146393 295394402 294864655 295233955 295688629 295461407 295086365 294869881 294727077 294704189 294711571
2486 294711571 294631710 294591408 294784050 294889908 294488182 294072857 294121494 294262390 294300537 294180145 293651085
2497 293651085 293100815 292899361 292848339 292893410 292970657 292985916 292974701 292952042 292882919 292707195 292513123
2508 292513123 292390823 292273750 292116871 291943054 291755905 291568031 291387558 291229477 291106930 291032543
2518 291032543 291054230 291079025 290998211 290903549 290879250 290837288 290693741 290519714 290315132 290207367 290414085
2529 290414085 290664177 290724506 290697803 290568104 290455570 290540447 290626278 290562382 290388336 289990425 289676418
2540 289676418 289843311 290109386 290211678 290188789 289922466 289617767 289446583 289389839 289527893 289733162
2550 289733162 289919853 290040722 290022602 289857368 289398899 288985958 289021492 289165726 289195061 289160957 288972607
2561 288972607 288832169 288959732 289210777 289612999 289867153 289523582 289061546 288852196 288767319 288842201
2571 288842201 288954010 288991680 288954010 288752308 288536301 288433304 288421135 288549652 288729420 288875084
2581 288875084 289023628 289217949 289354782 289314022 289188137 288985958 288837891 288938980 289102306 289206734
2591 289206734 289248695 289076309 289010754 289512138 290009003 289942970 289731979 289629936 289567223 289573669 289604187
2602 289604187 289644241 289630394 289417973 289235821 289313545 289504280 289815407 290013065 289696693 289370766
2612 289370766 289569130 289800873 289679756 289423447 289142609 288772087 288205376 287677765 287411690 287338486
2622 287338486 287537575 287786236 287864914 287841301 287673225 287468910 287322750 287232151 287241440 287302475 287392368
2633 287392368 287477493 287474632 287508717 287733307 287978401 288128357 288171997 287962189 287790527 287998199 288285961
2644 288285961 288448792 288544884 288574924 288502922 288208008 287942886 288030376 288138390 287988415 287740936 287380676
2655 287380676 287156334 287463646 287844410 287882080 287847271 287864189 287952652 288233509 288524628 288706284 288709641
2666 288709641 288300743 287853241 287713509 287725677 287874222 288082352 288308601 288429012 288202038 287937393
2676 287937393 287900200 287979832 288233757 288419724 288215389 287917595 287761440 287609329 287340393 287136784
2686 287136784 287225475 287348976 287247887 287152996 287274818 287413101 287445774 287345638 286947002 286541443
2696 286541443 286384335 286415806 286767464 287116756 287102203 286969185 286842575 286719551 286645393 286598206 286573410
2707 286573410 286561718 286558380 286542645 286435585 286405067 286758652 286997299 286564827 285940399 285350304 284997215
2718 284997215 285337448 285836449 286081772 286162834 285974255 285687675 285454979 285229912 285016060 284813881
2728 284813881 284585457 284449806 284573784 284775238 284980526 285028458 284589043 284094086 283931732 283900719
2738 283900719 283951263 284013748 283991089 283914318 283755531 283592224 283536663 283455849 283171883 282928696 282978516
2749 282978516 283115139 283243179 283279171 283013573 282729378 282731285 282742252 282490482 282261848 282315483 282457581
2760 282457581 282579174 282684784 282713394 282751083 282895317 283047676 283127537 283178787 283227196 283246269 283251266
2771 283251266 283142090 282772064 282295227 281767349 281336288 281232338 281261673 281314850 281366577 281327000 281278839
2782 281278839 281293144 281312943 281295776 281268349 281273346 281218529 280992508 280693054 280325642 280053844 280106773
2793 280106773 280291786 280542126 280707359 280534019 280261269 280071259 279880981 279652824 279432297 279235592
2803 279235592 279112091 279174309 279245605 279120445 278996925 279035797 279142132 279315948 279432755 279316177
2813 279316177 279122105 278905144 278791428 279027214 279305916 279366493 279317131 279134750 278949490 278938751
2823 278938751 278936615 278827667 278637390 278331985 277971020 277556419 277223816 277159691 277213326 277330856 277407398
2834 277407398 277269821 277065277 276923637 276721706 276352386 275895824 275341263 274854164 274663200 274565697
2844 274565697 274456024 274271469 273903122 273381691 272624722 271862984 271375408 270934105 270403366 269783478
2854 269783478 268953075 268137932 267511826 267107468 267102470 267232895 267286758 267285099 267165642 266964912 266702156
2865 266702156 266364098 265868187 265439491 265452385 265375366 264578094 263729553 263446083 263254395 262821903
2875 262821903 262342453 261868229 261490097 261460762 261344185 260628204 259791832 259182682 258679390 258260727
2885 258260727 257971992 257912636 257897835 257720947 257545471 257466774 257479668 257611027 257858982 258298378 258724670
2896 258724670 258885136 258995514 259260883 259459248 259426346 259191017 258543243 258032551 258337250 258859634
2906 258859634 259138107 259441605 259872189 260466805 261379242 262361031 263225555 263938179 264348259 264615288
2916 264615288 264874916 265045872 265070419 265011063 264924278 264767647 264472713 264170647 264019966 263868790
2926 263868790 263602962 263266068 262947540 262394180 261242867 259912243 258746605 257606010 256475677
2935 256475677 255321503 254188290 252824535 250852814 248692513 246761322 244683266 242097855 239373913
2944 239373913 236751060 234253387 232044449 229942551 227767696 225675087 223788261 222022285 220334282
2953 220334282 218721390 217061043 215666275 214923611 214490395 214097252 213907948 214006882 214359741 215018024
2963 215018024 215806713 216472130 217299461 218586426 220041504 221404781 222878456 224674225 226502876
2972 226502876 228092194 229601860 231087685 232586365 234224548 235786190 236990204 238157272 239665737
2981 239665737 241060486 241829624 242519379 243679504 244786263 245357971 245814781 246449928 247161140
2990 247161140 247992744 248797169 249380341 249926071 250595093 251260757 251850128 252361298 252732029 253068199
3000 253068199 253431072 253888836 254607430 255354156 255939236 256396294 256618004 256835937 257257214 257847786
3010 257847786 258699875 259638062 260546684 261338692 261776199 262193184 262946587 263727417 264285088 264801483
3020 264801483 265445461 266004791 266223183 266400089 266790390 267270088 267873039 268378010 268464088 268461456
3030 268461456 268676262 268859863 268783798 268691769 268840065 268960953 268822174 268573265 268263092 267957916
3040 267957916 267874718 267610054 266741505 265542259 264032364 262547245 261473408 260674706 260213604
3049 260213604 259878616 259455681 259011726 258446693 258046608 258129826 258498898 259179115 259817352 259974937
3059 259974937 259932022 259790878 259644508 259691696 259714832 259510994 259234886 258952847 258724213 258618107
3069 258618107 258671761 259016037 259436359 259751549 259989967 260113468 260139923 260037880 259914150 259892921
3079 259892921 259888649 259850502 259795418 259622326 259633293 260146599 261012306 262441139 263667812 263693085 263425827
3090 263425827 263548126 263739090 263987045 264044514 263551216 262831917 262055397 261328697 260822525 260514717
3100 260514717 260447502 260595551 260996323 261503448 262012711 262434235 262516975 262636642 263161659 263860931
3110 263860931 264701347 265456657 265830994 265999298 266020527 265946617 265855541 265725842 265550117 265363693
3120 265363693 265191307 265055408 264985313 264981976 265050888 265205383 265497665 265813332 266030312 266222458 266417255
3131 266417255 266628494 266896954 267168751 267410736 267600517 267681122 267723312 267746429 267845860 268229942 268577328
3142 268577328 268494606 268404007 268713703 269069672 269222965 269264927 269232750 269039383 268481960 267943382 267812004
3153 267812004 267867317 268057327 268261414 268247604 268295994 268727303 269185066 269373894 269429665 269372215 269252777
3164 269252777 269112816 268999805 269003372 269036522 269012451 269019127 269162884 269298782 269302597 269217243 268996468
3175 268996468 268782616 268731823 268754005 268828392 268900871 268882027 268855553 268910866 268938293 268766632 268667450
3186 268667450 269057503 269327393 268753757 268094521 267984142 268068066 268212547 268386345 268516541 268594246
3196 268594246 268548965 268492451 268557053 268610954 268533936 268423309 268321495 268272629 268416157 268508415 268257370
3207 268257370 267944336 267747383 267682076 267914276 268169861 268139343 268092155 268318405 268443813 268056145
3217 268056145 267558556 267229309 267027607 267031174 267162075 267395020 267648449 267827034 267946243 268001308
3227 268001308 267954578 267715683 267435780 267300110 267113914 266614418 266187172 266269436 266442528 266380539
3237 266380539 266241531 266068687 265877724 265633583 265528908 265865078 266277771 266525021 266540527 265985241
3247 265985241 265432587 265526772 265716305 265516987 265370598 265731812 266075363 265867939 265586853 265660038
3257 265660038 265699139 265293579 264937401 265203705 265442848 264977455 264461269 264431953 264558067 264673691
3267 264673691 264817944 265023232 265142193 264990311 264708271 264309883 263987541 264031868 264161110 264170876
3277 264170876 264116745 263924351 263778687 263899078 264107456 264348736 264471512 264191132 263849716 263783913
3287 263783913 263722172 263376236 263131847 263462524 263816833 263697128 263411980 263106575 262772312 262392998
3297 262392998 262136211 262227516 262475471 262823811 263091545 262975197 262784004 262835732 262797813 262271633
3307 262271633 261772861 261779785 262005310 262370110 262729397 262879601 262915611 262868881 262725105 262444954 262131443
3318 262131443 261843433 261671295 261825066 262003651 261939754 261741638 261408310 260999680 260525932 260133495
3328 260133495 259985199 260039082 260448208 260787716 260539761 260133972 259773712 259618988 260071983 260606766
3338 260606766 260740738 260742645 260680428 260672569 260977497 261241417 261065712 260840645 260849953 261013031 261477699
3349 261477699 261842232 261591911 261211147 261058807 260994415 261016598 261063576 261066189 261044006 260959129 260912170
3360 260912170 261062374 261193504 261048775 260908356 261054745 261222839 261179924 261109581 261159897 261203041 261151314
3371 261151314 261030655 260796051 260571232 260474434 260474205 260675659 260785561 260405769 259955635 259717445 259702682
3382 259702682 260185699 260658264 260598888 260320415 259932022 259522896 259204617 259017696 259140720 259269714
3392 259269714 259109497 258810501 258338432 257952194 257971516 258177757 258567562 258811703 258421650 257869949
3402 257869949 257482529 257210007 257273674 257187595 256255150 255326500 255283813 255331039 254793625 254189243 253947964
3413 253947964 253655186 252939682 252098083 251323452 250551929 249644737 249017715 249371529 249710083 248979568
3423 248979568 248050442 247570038 247151833 246498108 245988846 245981216 246246338 246783257 247264614 247189522
3433 247189522 247075539 247328262 247782936 248446693 249207954 250053635 250694275 250683289 250476589 250402679
3443 250402679 250394325 250429382 250697594 251535645 252478104 253113022 253615837 254025459 254336815 254510632
3453 254510632 254685402 255028954 255412560 255842915 256079178 255698910 255253792 255250206 255401115 255592346
3463 255592346 255808334 255974045 256152382 256423950 256659260 256701221 256711006 256869068 256957283 256603699 256446590
3474 256446590 257410049 258263588 257742386 256873837 256269913 255908241 256129723 256453972 256510735 256308556
3484 256308556 255459785 254782906 255243053 256012421 256639938 256960144 256457558 255728226 255187988 254860382
3494 254860382 255000114 255329838 255778065 255979290 255384903 254470825 253288975 252562752 253446579 254696121
3504 254696121 255467167 255713921 254746189 253650894 253506660 253648033 253778915 253866653 253692627 253516426
3514 253516426 253601074 253715744 253669243 253602982 253645172 253643265 253492107 253174286 252600899 251879692 250931244
3525 250931244 250228157 250348549 250895729 251864891 252656937 252489548 251906624 251068344 250342598 250161400
3535 250161400 250492802 251696339 253029099 253901939 254210472 253531914 252231102 250242691 248434525
3544 248434525 247790337 247893791 249000301 250075092 249904137 249278526 248361588 247821808 248744717 250041008
3554 250041008 250963440 251568794 251273384 251249313 252997398 254944077 256299019 256213417 252817860 248382568
3564 248382568 244044304 241333714 243205070 246524086 249074440 251054993 251652718 251685848 251724243
3573 251724243 251700153 251641502 251827698 252562752 253801098 255832176 257951965 259931564 260632267 258286705
3583 258286705 254549484 249747734 246093979 246751060 249191513 252480011 255001526 253968239 251959801
3592 251959801 250679722 249965420 250678291 251447906 250711193 249907722 249934654 250853767 253665428 256449451
3602 256449451 257558575 257171860 254262924 250800362 248436928 247092953 247611046 248875370 249884357
3611 249884357 251136284 253524284 254862061 252504101 248720398 244068851 241039734 243159752 247875671
3620 247875671 254726410 260958900 263890018 262846222 254556160 244129639 234529247 228925209
3628 228925209 234446278 242178192 244190674 244660378 245108109 245567780 246862869 248141994 248337250
3637 248337250 248919487 251312714 254589081 258827438 262431374 264443150 263022175 254033546 243399620
3646 243399620 235274067 230826130 234338989 240621071 246464005 250199547 247323990 243135452 241857986
3655 241857986 242208939 244957199 248171558 249564629 250971069 253776302 257040482 260945549 263511887
3664 263511887 262203445 258869400 253317833 249134521 251788845 255437126 256423950 253651848 241074791
3673 241074791 229881744 232514839 239167442 243509045 247550011 250959625 254428139 259124508
3681 259124508 263279915 266159515 265830040 258351784 249007931 241327991 236629944 239036064 243661880
3690 243661880 246498566 249040833 251624336 253716698 254836311 255166512 254837990 253524284 249870529
3699 249870529 247090092 248803139 252431374 257196426 261316528 262740364 261498451 255956650 249054184
3708 249054184 242524605 238347511 240153065 244719963 250670185 256103020 258038273 258333206 257768860
3717 257768860 256590118 255311012 253904343 252358894 251137733 250583153 251044731 253263931 256405582
3726 256405582 260840645 263691406 261154633 256377926 251194229 245742302 239852409 236281147 238251686
3735 238251686 244192829 255944252 266493797 268198719 264790535 255425205 246185303 243649235
3743 243649235 245481949 255058517 261824360 251670113 238633385 233204346 231915474 235803833
3751 235803833 241844883 247976532 252348175 251080742 248194447 246406555 245746365 247752895 250612259
3760 250612259 253237724 254986515 254301777 252835979 252181759 250958900 247351151 244258881 244491806
3769 244491806 246504536 250395279 254042625 254890194 254340630 252810936 250701656 248121719 246361485
3778 246361485 247496605 249279976 249973297 250126114 249407520 248719215 249037247 249805450 250766258 251999855
3788 251999855 253727913 255266895 255726089 255947342 256601562 257307758 258391609 258401146 255561333 251166573
3798 251166573 244462242 239817619 243886452 249060135 248938560 246550064 241096954 237657051 243247261
3807 243247261 251252632 257448196 261679878 261918297 259562492 254175892 249232998 249606361 250662556
3816 250662556 249040604 245794525 239075413 234230270 238249779 244353523 247358780 249462128 251020660
3825 251020660 252368431 254267197 255788078 255864372 255669594 256721954 256918411 254175186 249952068
3834 249952068 244231453 239360809 238427620 239193192 240597477 242188911 242426376 243516197 247413139
3843 247413139 253328323 262449970 270798683 275405636 274427414 262924652 247214317 229664555
3851 229664555 217182159 220769386 230504265 240615597 249652138 253383141 254374008 253515701 251600266
3860 251600266 249361992 247863770 249184837 251008034 252027264 251288414 245819798 240365982 239591103
3869 239591103 240764370 242838364 245425682 247745514 249930382 252351513 253511887 250852585 247926941
3878 247926941 248306503 249378204 249868622 249329319 245523682 242542496 245575657 249088516 248392811
3887 248392811 246136894 242379417 240199089 244186153 249864578 254345398 257456284 257779350 256158581
3896 256158581 252542000 248197784 244457703 241075516 237889519 235974770 236777534 239021530 242286434
3905 242286434 245449066 246804466 247674942 249013405 250219574 251124611 251384964 250418415 248769512
3914 248769512 246372452 244474869 244834900 245854130 246514072 246832123 246252289 245476475 244858742
3923 244858742 244886150 246843567 248690357 248435020 247213116 245081902 243282547 243426552 244458904
3932 244458904 246101837 247634888 247975349 247930031 248094788 248017769 247254124 246376266 245715141 245548000
3942 245548000 246767502 247856140 247105598 245979767 245532265 245284081 245045166 245000343 245401382 245856514
3952 245856514 245910873 246002903 246639957 247158279 246846428 246353607 246215820 246061554 245537262 245123367
3962 245123367 245301476 245713692 246206512 246645927 246802330 246807804 246697178 246530037 246430149 246238461
3972 246238461 245725632 245223751 245017281 245017757 245311241 245656013 245767822 245858650 246118050 246327858 246289005
3983 246289005 246132355 245912304 245658150 245382309 245188942 245223045 245373726 245669594 245834351 245446663
3993 245446663 244967461 244739761 244694939 244934788 245288124 245686283 245923042
4000 245923042
##END=$$ End of the data block
