##TITLE=Zn - bpa - 1 $$ Begin of the data block
##JCAMP-DX=5.00 $$ ACD/SpecManager v 10.08
##SPECTROMETER/DATA SYSTEM=Alpha
##DATE=15 Apr 2015 09:49:12
##DATA TYPE=INFRARED SPECTRUM
##DATA CLASS=XYDATA
##ORIGIN=
##OWNER=
##NPOINTS=1765
##FIRSTX=399.76428223
##LASTX=3997.64306641
##MAXX=3997.64306641
##MINX=399.76428223
##MAXY=1.00180089
##MINY=0.51863867
##XFACTOR=1.0000000000
##YFACTOR=0.000000010000000
##FIRSTY=1.00000000
##DELTAX=2.03961372
##XUNITS=1/CM
##YUNITS=ARBITRARY UNITS
##XYDATA=(X++(Y..Y))
399.8A00000000l41874m18681l35431k30974k66683l66074l41082p4828L79175O67519
$$ 100000000 99658126 99239445 98904014 98673040 98406357 98040283 97699201 97624373 98003548 98671067
420.2I8671067N02330K84314J20109J23942K40499K06345K2567j16635p8112L3611
$$ 98671067 99173397 99457711 99577820 99701762 99942261 100148606 100171173 100054538 99976426 100010037
440.6A00010037j0037j86062l89272l64339k41059k74891m14425n09876m75931k91181
$$ 100010037 100000000 99813938 99424666 99060327 98819268 98544377 98129952 97620076 97144145 96852964
461I6852964j26004l0220J01251L24428M52351K34640k39342o27208p66635o29997
$$ 96852964 96726960 96696740 96797991 97122419 97574770 97809410 97570068 96942860 96176225 95546228
481.3I5546228k83385J34814M01652M92448N49554N53316M35084K93065K47961K77054
$$ 95546228 95262843 95397657 95799309 96291757 96841311 97394627 97829711 98122776 98370737 98647791
501.7I8647791K38466J00661l5167q2111k8146J1373q1426k79331m00055l23337j75780
$$ 98647791 98886257 98986918 98951751 98869640 98841494 98852867 98771441 98492110 98092055 97768718 97592938
524.2I7592938j36966j71059j30409k4790L6103m0156k17926l28136k56306n7244J23060
$$ 97592938 97455972 97284913 97154504 97129714 97165817 97125661 96907735 96579599 96323293 96266049 96389109
546.6I6389109J26833p9483l23081m53860m71270m07696l05140k10398r7817N4580
$$ 96389109 96515942 96436459 96113378 95659518 95188248 94780552 94475412 94265014 94167197 94221777
567I4221777J59812Q2832k11596n94628p95615n89037o2632M87041Q09258Q73524P85959
$$ 94221777 94381589 94464421 94252825 93658197 92862582 92273545 92210913 92697954 93507212 94380736 95166695
589.4I5166695O52987N39219M72981M05902K73645R8085k9981m6414k206k4092j47760
$$ 95166695 95819682 96358901 96831882 97237784 97511429 97609514 97579533 97533119 97530913 97506821 97359061
611.9I7359061k39902j17100K24310M99064M73184K74044J10143J2034r9402l11548
$$ 97359061 97119159 97002059 97226369 97725433 98198617 98472661 98582804 98594838 98495436 98183888
632.3I8183888o57058r92834r86743n06300Q3506L33023K32584J09279K86740O19656
$$ 98183888 97526830 96533996 95547253 95040953 95124459 95457482 95690066 95799345 96086085 96705741
652.7I6705741O67119M59009L16292K62618J70672O4439L6895Q1396J04499R4330M8685
$$ 96705741 97372860 97831869 98148161 98410779 98581451 98645890 98682785 98764181 98868680 98963010 99011695
675.1I9011695J4282P7533J90014K36863J74284P0566L1066O0457Q1908N1332j3238
$$ 99011695 99025977 99103510 99293524 99530387 99704671 99775237 99806303 99866760 99948668 100000000 99986762
697.5I9986762n0646j4180K3508m1562j80936k77829l41231m77976o92588q32200p75879
$$ 99986762 99936116 99921936 99945444 99903882 99722946 99445117 99103886 98625910 97933322 97101122 96325243
720I6325243o28585o22690q85022j361715j757920j626605q02678L10523J069176J036209
$$ 96325243 95696658 95073968 94188946 92827231 91069311 89442706 88640028 88950551 90019727 91055936
740.4I1055936O2888j819330m272640o439644p218087o156414l894353j474452M76080
$$ 91055936 91118824 89299494 85026854 78587210 71369123 65212709 61318356 59843904 60319984
758.7F0319984J882631K881109L591478M012489M091871L838015L377402K850920K271628
$$ 60319984 62202615 65083724 68675202 72687691 76779562 80617577 83994979 86845899 89117527
777.1H9117527J555252P89809L33929M51333R25046J234609J169538R55075Q07691
$$ 89117527 90672779 91462588 91796517 92247850 93172896 94407505 95577043 96532118 97339809
795.4I7339809P21246N88250L68947J59335O7055Q0049R2721L6025m7350n8752K2841
$$ 97339809 98061055 98649305 99018252 99177587 99244642 99324691 99417412 99453437 99406087 99347335 99370176
817.9I9370176R7423O3926o4712j73778j83046j59323k24083l78448n08392n29969
$$ 99370176 99467599 99531525 99466813 99293035 99109989 98950666 98726583 98348135 97839743 97309774
838.3I7309774m82774m60857m74083m45610l08335r9755M2630J3154j65206l71486
$$ 97309774 96827000 96366143 95892060 95446450 95138115 95038360 95080990 95094144 94928938 94557452
858.7I4557452n41788p49159j076186j436251j525265j084417l03912K37703J93977
$$ 94557452 94015664 93266505 92190319 90754068 89228803 88144386 87840474 88078177 88272154
877H8272154k30819o11120o82569m56166r7769J96015K60336Q5497j93036l91013l50010
$$ 88272154 88041335 87430215 86747646 86291480 86193711 86389726 86650062 86735559 86542523 86151510 85801500
899.5H5801500m5311L71718O70868P22510N89222M33343L44503K98309K39194J61052
$$ 85801500 85756189 86127907 86798775 87521285 88110507 88543850 88888353 89186662 89425856 89586908
919.9H9586908J15478J10709P4548m5312j89018k34502j52433m1926j5301p2133r1738
$$ 89586908 89702386 89813095 89887643 89842331 89653313 89418811 89266378 89224452 89209151 89137018 89045280
942.3H9045280J8722K00063L10862K94310K12496J23907K390j56683k13659m3201K45452
$$ 89045280 89064002 89264065 89574927 89869237 90081733 90205640 90208030 90051347 89837688 89794487 90039939
964.7I0039939M27973M38327L72541L20643L09646L10772K65795J34480n8883k33412
$$ 90039939 90467912 90906239 91278780 91599423 91909069 92219841 92485636 92620116 92561233 92327821
985.1I2327821l57043n00376p38704r86886r45747m54652R9099K09373j06818n00321
$$ 92327821 91970778 91470402 90731698 89744812 88799065 88344413 88443512 88652885 88546067 88045746
1005.5H8045746p02232o06179k94549m7701j40131n12981p20942k97374O66106J366103
$$ 88045746 87343514 86737335 86442786 86395085 86254954 85741973 85021031 84723657 85389763 86755866
1025.9H6755866J123404J85269p19505j193923j202863q22282k57325K20775M22204
$$ 86755866 87879270 88064539 87345034 86151111 84948248 84125966 83868641 84089416 84511620
1044.3H4511620K99346M6164L7700M74280J090843J354664J036626M28319q9955m33034
$$ 84511620 84810966 84857130 84894830 85369110 86459953 87814617 88851243 89279562 89189607 88756573
1064.7H8756573o91432q88079r60994q94576p70104o85126o42347n25522k26659K00898
$$ 88756573 88065141 87177062 86216068 85321492 84551388 83866262 83223915 82698393 82471734 82672632
1085.1H2672632N56880O58774M74304J24652j70506j86991R6857M04322M67337L16965
$$ 82672632 83229512 83888286 84362590 84487242 84316736 84129745 84226602 84630924 85098261 85415226
1105.5H5415226P2158j82367j93888K47616R66734J564115J738882J486987J083779
$$ 85415226 85487384 85305017 85111129 85358745 86325479 87889594 89628476 91115463 92199242
1123.8I2199242P88051O32203N12415L64578K25877J54728J19156j937l12400p81918
$$ 92199242 92987293 93619496 94131911 94496489 94722366 94877094 94996250 94994313 94681913 93899995
1144.2I3899995j210368j439780j526862j487225j134068m44132K22814M93294L66926
$$ 93899995 92689627 91249847 89722985 88235760 87101692 86657560 86880374 87373668 87740594
1162.6H7740594J26439J4616Q1211K48110M27669N72318O69849P07793O36864M10444
$$ 87740594 87867033 87881649 87962860 88210970 88638639 89210957 89880806 90588599 91225463 91635907
1183I1635907Q2469j75226k17795q4418M0388K7895p3135j16974j4478J85006L41511
$$ 91635907 91718376 91543150 91325355 91240937 91281325 91309220 91236085 91119111 91104633 91289639 91631150
1205.4I1631150L60912K66576J31107R584o1059q9908j47599l04037n65970q64607
$$ 91631150 91992062 92258638 92389745 92399329 92338270 92248362 92100763 91796726 91230756 90366149
1225.8I0366149j081997j167691j207024j308775j476967j623678j662863j590472
$$ 90366149 89284152 88116461 86909437 85600662 84123695 82500017 80837154 79246682
1242.1G9246682j495737j482719j589692j772117j955223k083213k101451j959699
$$ 79246682 77750945 76268226 74678534 72906417 70951194 68867981 66766530 64806831
1258.4F4806831j656884j321918j229781j526922j978403k097642j542449m06743R58288
$$ 64806831 63149947 61828029 60598248 59071326 57092923 54995281 53452832 53046089 54004377
1276.8E4004377K255219L165293L359747K788478J807368R67771O18750P06845J056487
$$ 54004377 56259596 59424889 62784636 65573114 67380482 68348253 68967003 69673848 70730335
1295.2G0730335J600885K170622K476204K427506K168608J819354J423031J092166
$$ 70730335 72331220 74501842 76978046 79405552 81574160 83393514 84816545 85908711
1311.5H5908711R23550R08721J028275J167077J119047Q61275N37241L09354K37316
$$ 85908711 86832261 87740982 88769257 89936334 91055381 91916656 92453897 92763251 93000567
1329.8I3000567K48110K50525K26533J95086J48737P0417k7227j44315k81781m15385
$$ 93000567 93248677 93499202 93725735 93920821 94069558 94139975 94112748 93968433 93686652 93271267
1350.2I3271267n45907p07918r07689j069200j192153j313180j219558q58391m34994
$$ 93271267 92725360 92017442 91109753 90040553 88848400 87535220 86315662 85457271 85022277
1368.6H5022277k3133K36088J97357l8558j79196j49822Q208K38138M13644L59786
$$ 85022277 84999144 85235232 85432589 85394031 85214835 85065013 85073221 85311359 85725003 86084789
1389H6084789J84494O4731o0684j98036k89124k93666k30599j94782j82861j55085
$$ 86084789 86269283 86334014 86273330 86075294 85786170 85492504 85261905 85067123 84884262 84729177
1409.4H4729177j25760r1750p2330j81353n17398p84904r35900j036644r56809q77160
$$ 84729177 84603417 84511667 84439337 84257984 83740586 82955682 82019782 80983138 80026329 79149169
1429.8G9149169q20142q54874j411056k147997k040809j628608j206517j114965j699036
$$ 79149169 78329027 77474153 76063097 73915100 71874291 70245683 69039166 67924201 66225165
1448.1F6225165k278924k219492j370305P47508L668785M293340M248858M528850L305251
$$ 66225165 63946241 61726749 60356444 61103952 64772737 69066077 73314935 77843785 81149036
1466.5H1149036Q52978j685751n285680p314592o009669m334276l311700k196479K76220
$$ 81149036 82002014 80316263 75030583 67715991 61706322 57372046 54060346 51863867 52140087
1484.9E2140087L868341P573885Q930266O857306M976785L908527K284986J039731
$$ 52140087 56008428 63582313 72512579 79369885 84346670 88255197 90540183 91579914
1501.2I1579914O21230O62016P54649M05025K58702L40933L96657L73024K94089K31463
$$ 91579914 92201144 92863160 93617809 94022834 94281536 94622469 95019126 95392150 95686239 95917702
1521.6I5917702Q6814l5429j02735j25920r6208j63168k15369j60850k64388n49143
$$ 95917702 96004516 95969087 95866352 95740432 95644224 95481056 95265687 95104837 94840449 94291306
1542I4291306o32966o33615o34152p15888q13192q63057q49104j211220j712680j213193
$$ 94291306 93658340 93024725 92390573 91674685 90861493 89998436 89149332 87938112 86225432 85012239
1562.4H5012239j169079j531542j994216k086157q80992P38609J874876J331711L52603
$$ 85012239 83843160 82311618 80317402 78231245 77350253 78088862 79963738 81295449 81648052
1580.7H1648052k03699q89635j967180l310674m274571m025990k371597j99545J056373
$$ 81648052 81444353 80554718 78587538 75276864 71002293 66976303 64604706 64405161 65461534
1599.1F5461534R17578J49655l6114R95982K867990M244823M266250L845817L246551
$$ 65461534 66379112 66528767 66492653 67488635 70356625 74601448 78867698 82713515 85960066
1617.4H5960066J889241J120037R56976O97583M76599L78388L45016M43482N59586
$$ 85960066 87849307 88969344 89926320 90623903 91100502 91478890 91823906 92267388 92826974
1635.8I2826974L65436K06006K34133L02243L92509L59821K63006M38445N39589K01136
$$ 92826974 93192410 93398416 93632549 93934792 94327301 94687122 94950128 95388573 95928162 96129298
1656.2I6129298J53238K58022L18313K62284K16222K67655K42066J32662J26112J15323
$$ 96129298 96282536 96540558 96858871 97121155 97337377 97605032 97847098 97979760 98105872 98221195
1676.6I8221195Q4060J26070J93435J32126l3838l8922o872L1370R9432J06573M8214
$$ 98221195 98305255 98431325 98624760 98756886 98723048 98684126 98677254 98708624 98808056 98914629 98962843
1699I8962843l2490p0375m5288o4820r1225o5964k5851n489j03283k56950k66027k50692
$$ 98962843 98930353 98859978 98814690 98749870 98658645 98592681 98566830 98561341 98458058 98201108 97935081 97684389
1723.5I7684389k78610l12674l70890m77111q11672j062358r15002r33814r15277o56230
$$ 97684389 97405779 97093105 96722215 96245104 95433432 94371074 93456072 92522258 91606981 90950751
1743.9I0950751l09539R9278N33396Q45891R58091J115620J187742J052314R16886
$$ 90950751 90641212 90740490 91273886 92119777 93077868 94193488 95381230 96433544 97350430
1762.2I7350430O61308M63468M08208L46411K31272P0750Q953M2081O3765M1693J8257
$$ 97350430 98011738 98475206 98883414 99229825 99461097 99531847 99540800 99582881 99646646 99688339 99706596
1784.7I9706596J0717M5282R2876O2996j9908k9808K402Q452j3602k1386o092J1581
$$ 99706596 99717313 99762595 99855471 99918467 99898559 99868751 99871153 99879605 99866003 99844617 99838525 99850106
1809.2I9850106J5670K170O26R06j985J7494M7994M5472K1237L10l4612l4744q464
$$ 99850106 99865776 99867946 99868572 99869478 99867493 99884987 99932981 99978453 99999690 100000000 99965388 99930644 99922180
1835.7I9922180j2028k0886P308K7907j5831n7328n8335l8355j3358J347k181j2827
$$ 99922180 99910152 99889266 99896574 99924481 99908650 99851322 99792987 99754632 99741274 99742621 99740440 99727613
1860.2I9727613j1915J2833M7648L6364l7527o8825l3736m191p277k6340l2448j8347
$$ 99727613 99715698 99728531 99776179 99812543 99775016 99706191 99672455 99668264 99660987 99634647 99602199 99583852
1884.6I9583852N371J4293j2958l1287j3983L475Q822Q869K873M601K1184K7942N228
$$ 99583852 99589223 99603516 99590558 99559271 99545288 99548763 99557585 99566454 99569327 99573928 99595112 99623054 99628282
1911.1I9628282j3179L630K5505J6182j764j4686k6161j4692P122J7536J4174R167
$$ 99628282 99615103 99618733 99644238 99660420 99658656 99643970 99617809 99603117 99610239 99627775 99641949 99651116
1935.6I9651116J9914M5675O0445L5066K443L231K1166L0231K1762L111l338R835K0456
$$ 99651116 99671030 99716705 99777150 99812216 99814659 99817890 99839056 99869287 99891049 99894160 99890822 99900657 99921113
1962.1I9921113J8603N948j0156r132P236R948n543j4287n841P426R019k921r441J639
$$ 99921113 99939716 99945664 99935508 99926376 99933612 99943560 99938017 99923730 99917889 99925315 99934334 99931413 99921972 99923611
1990.7I9923611R727L016o127j0425l070J3489K0397Q559n520l373J4049K5588J0079
$$ 99923611 99933338 99936354 99930227 99919802 99916732 99930221 99950618 99959177 99953657 99950284 99964333 99989921 100000000
2017.2A00000000j9383l3188l4583k3460J6844L8755K0641R865J3011O706p194j6201
$$ 100000000 99980617 99947429 99912846 99889386 99906230 99944985 99965626 99975491 99988502 99995208 99988014 99971813
2041.7I9971813j4025n382q226k1493k5749j8764j0592r405j5921j7196q452k908k051
$$ 99971813 99957788 99952406 99944180 99922687 99896938 99878174 99867582 99858177 99842256 99825060 99816608 99813700 99811649
2068.2I9811649k139m274j931J0371K1338J7476N824K104J1480K4062K3085P981M05
$$ 99811649 99809510 99805236 99803305 99813676 99835014 99852490 99858314 99860418 99871898 99895960 99919045 99927026 99927431
2094.7I9927431R269J7351J5032Q732J484j847K414L749k849r698r382m816m089r477
$$ 99927431 99936700 99954051 99969083 99977815 99979299 99977452 99979866 99983615 99980766 99971068 99961686 99956870 99952781 99943304
2123.3I9943304j4514j2523n436j168n579j3983k0331j8621r989q399j5706k0152j7124
$$ 99943304 99928790 99916267 99910831 99909663 99904084 99890101 99869770 99851149 99841160 99832761 99817055 99796903 99779779
2149.8I9779779j2172j2207j6069j6934j2052l850k700j3441k0015p660R674R203l618
$$ 99779779 99767607 99755400 99739331 99722397 99710345 99706495 99703795 99690354 99670339 99662679 99672353 99681556 99677938
2176.3I9677938j1110q577k969k503p194j1319j0711p761o544r293j4269j6582j6779
$$ 99677938 99666828 99658251 99655282 99652779 99645585 99634266 99623555 99615794 99609250 99599957 99585688 99569106 99552327
2202.8I9552327j9049k4623l1656l2383k4837k0236k7359l8105m0925m2748n2524o3335
$$ 99552327 99533278 99508655 99476999 99444616 99419779 99399543 99372184 99334079 99293154 99250406 99197882 99134547
2227.3I9134547p0853p9387q7684r2638r5004r6082r7919j01221j06304j16462j37818
$$ 99134547 99063694 98984307 98896623 98803985 98708981 98612899 98514980 98413759 98307455 98190993 98053175
2249.7I8053175j70553k12156k61098l11828l57276l83920l75038l25686k39575j31237
$$ 98053175 97882622 97670466 97409368 97097540 96740264 96356344 95981306 95655620 95416045 95284808
2270.1I5284808k1828P5651J61040K27397K57045K50375K16795J64312R8151J5962
$$ 95284808 95262980 95338631 95499671 95727068 95984113 96234488 96451283 96615595 96713746 96729708
2290.5I6729708q2600j93686l07148m09198m95810n70070o19030o20115n66959m70108
$$ 96729708 96647108 96453422 96146274 95737076 95241266 94671196 94052166 93432051 92865092 92394984
2310.9I2394984l46554k07996o1351P7498J82807K40291K52711K35975K12079J81354
$$ 92394984 92048430 91840434 91779083 91856581 92039388 92279679 92532390 92768365 92980444 93161798
2331.3I3161798J32441P2265R429n0253j11854j98412k97540l33995l10373l00765
$$ 93161798 93294239 93366504 93375933 93325680 93213826 93015414 92717874 92383879 92073506 91772741
2351.7I1772741l16608l15267k84028k28864j55067r1487n1415j1975M1419R3151J28871
$$ 91772741 91456133 91140866 90856838 90627974 90472907 90381420 90330005 90318030 90359449 90452600 90581471
2374.1I0581471J54739J79142K06626K40999K73412K90591L01266L19135L41082L53986
$$ 90581471 90736210 90915352 91121978 91362977 91636389 91926980 92228246 92547381 92888463 93242449
2394.5I3242449L46022L25507L12132L07095L00407K82407K51967K25329K12139K02918
$$ 93242449 93588471 93913978 94226110 94533205 94833612 95116019 95367986 95593315 95805454 96008372
2414.9I6008372J83642J53262J29670J22940J19650J05572Q1551O1649N6523N8258
$$ 96008372 96192014 96345276 96474946 96597886 96717536 96823108 96904659 96966308 97022831 97081089
2435.3I7081089N0724L2943K1178K3114K9171K7257J5509K355n13N436L749q726k0206
$$ 97081089 97131813 97164756 97185934 97209048 97238219 97265476 97280985 97283340 97282827 97288263 97292012 97283286 97263080
2461.8I7263080k0343j0044n006j2118j8883j7190j1033p575j3280k3145k1666j0741
$$ 97263080 97242737 97232693 97227687 97215569 97196686 97179496 97168463 97160888 97147608 97124463 97102797 97092056
2486.3I7092056p307j0741j3781j6498j1861L03N645J192k235J115P271R215K742q583
$$ 97092056 97084749 97074008 97060227 97043729 97031868 97032171 97037816 97039008 97036773 97037888 97045159 97054374 97057116 97048533
2514.9I7048533j3614r989j0092j8447k7180l0666l1001l4642m5097n7083o2061o3163
$$ 97048533 97034919 97024930 97014838 96996391 96969211 96938545 96907544 96872902 96827805 96770722 96708661 96645498
2539.3I6645498o1941n7286n9229o4939o2287n3156m5740m4465m5651m3738l7343k9528
$$ 96645498 96583557 96526271 96467042 96402103 96339816 96286660 96240920 96196455 96150804 96107066 96069723 96040195
2563.8I6040195k5242k4253k1810j5366j0741j2082j5991j6219j2529j2862j5670j6308
$$ 96040195 96014953 95990700 95968890 95953524 95942783 95930701 95914710 95898491 95885962 95873100 95857430 95841122
2588.3I5841122j4532j0037k367O247P129M595J1444K2680K4742K0003K3013L0488
$$ 95841122 95826590 95816553 95814186 95820433 95827562 95832157 95843601 95866281 95891023 95911026 95934039 95964527
2612.8I5964527L2193L2818L7587M2361M3904M6158M6146M0198L3980L2520L7486M3136
$$ 95964527 95996720 96029538 96067125 96109486 96153390 96199548 96245694 96285892 96319872 96352392 96389878 96433014
2637.2I6433014M1783L5387L2770L7468L8475K7948J2488J579j13J281n448k0307l0714
$$ 96433014 96474797 96510184 96542954 96580422 96618897 96646845 96659333 96660912 96660799 96662080 96656632 96636325 96605611
2663.7I6605611l1048l1448l8093m5729n0807n2487n3436o3700p9184q2040p1383o3306
$$ 96605611 96574563 96543115 96505022 96459293 96408486 96355999 96302563 96238863 96159679 96077639 96006256 95942950
2688.2I5942950o7407p6383p8976p3958p0679p4911p9471p5817o2275m5216l5161l1399
$$ 95942950 95875543 95799160 95720184 95646226 95575547 95500636 95421165 95345348 95283073 95237857 95202696 95171297
2712.7I5171297k6012k1142j2666P16L332J454P445J3959J6808J7184K0063K7281L3057
$$ 95171297 95145285 95124143 95111477 95112193 95115525 95116979 95124424 95138383 95155191 95172375 95192438 95219719 95252776
2739.2I5252776L6252M0525M5514N0050N6130N9777N7435N4318N2106M8894M3976L4452
$$ 95252776 95289028 95329553 95375067 95425117 95481247 95541024 95598459 95652777 95704883 95753777 95797753 95832205
2763.7I5832205K3693J7106J3054J0693L647j5115l5566m2141l9041m2641n5522p2795
$$ 95832205 95855898 95873004 95886058 95896751 95900398 95885283 95849717 95807576 95768535 95725894 95670372 95597577
2788.2I5597577r3895j17755j41990j65647j91880k17420k23177k07341j86706j63960
$$ 95597577 95503682 95385927 95243937 95078290 94886410 94668990 94445813 94238472 94051766 93887806
2808.6I3887806j38784j11931q7130q1390r7227j16223j30326j46866j71220j98704
$$ 93887806 93749022 93637091 93549961 93468571 93371344 93255121 93124795 92977929 92806709 92608005
2828.9I2608005k20722k32411k38192k56240k94912l27766l21126k81620k34699j82343
$$ 92608005 92387283 92154872 91916680 91660440 91365528 91037762 90716636 90435016 90200317 90017974
2849.3I0017974j13767k8819N4014J15204J44785J48535J49727J53691J41549J10376
$$ 90017974 89904207 89875388 89929402 90044606 90189391 90337926 90487653 90641344 90782893 90893269
2869.7I0893269P2974K6267k5773o5362r2459j12790j23137j23709j21540j17594j13827
$$ 90893269 90966243 90992510 90966737 90901375 90808916 90696126 90572989 90449280 90327740 90210146 90096319
2892.2I0096319j17940j26922j35940j50413j74349j90443j88172j85323j88565j91611
$$ 90096319 89978379 89851457 89715517 89565104 89390755 89200312 89012140 88826817 88638252 88446641
2912.6H8446641j93012j85877j62625j27268q2922k2089N5241J27465J69611J79469
$$ 88446641 88253629 88067752 87905127 87777859 87694937 87672848 87728089 87855554 88025165 88204634
2933H8204634J75649J72901J76174J85489J85913J69516J58602J68419J85460J94120
$$ 88204634 88380283 88553184 88729358 88914847 89100760 89270276 89428878 89597297 89782757 89976877
2953.4H9976877J94389J97690K07961K13444K07693J90466J69540J54692J37615J10996
$$ 89976877 90171266 90368956 90576917 90790361 90998054 91188520 91358060 91512752 91650367 91761363
2973.8I1761363P9792M8042J8924j0902m8238q8125j16831j28853j47135j89226k34235
$$ 91761363 91841155 91889197 91908121 91897219 91848981 91760856 91644025 91515172 91368037 91178811 90944576
2996.2I0944576k68447k79915k55996k21420j87683j35285o7657j4603N442J252k1768
$$ 90944576 90676129 90396214 90140218 89918798 89731115 89595830 89528173 89513570 89519012 89520264 89498496
3018.6H9498496n9849q9651j06979j18893j11777r5403r6124j15562j17528o7336n430
$$ 89498496 89438647 89348996 89242017 89123124 89011347 88915944 88819820 88704258 88586730 88519394 88513964
3041.1H8513964J4991j496k7841n6500r9206j33836j38336j35511j24163p9280o20
$$ 88513964 88528955 88527459 88499618 88443118 88343912 88210076 88071740 87936229 87812066 87732786 87732166
3063.5H7732166R1183J62953K11823K60800L09009L44795L47453L05319K52873K16937
$$ 87732166 87823349 87986302 88198125 88458925 88767934 89112729 89460182 89765501 90018374 90235311
3083.9I0235311J90323J74600J57684J22977R6136R2041Q8233O1018J9854O383K7693
$$ 90235311 90425634 90600234 90757918 90880895 90977031 91069072 91157305 91218323 91238177 91244560 91272253
3106.3I1272253M3553L5512L4869M9597M5192J5539k2018n3847o8175o5965o2990p2938
$$ 91272253 91315806 91351318 91386187 91435784 91480976 91496515 91474497 91420650 91352475 91286510 91223520 91150582
3130.8I1150582r0391r8103r4569r8097j11335j15747j06042r2072p7074o9905q8328
$$ 91150582 91060191 90962088 90867519 90769422 90658087 90542340 90436298 90344226 90267152 90197247 90108919
3153.2I0108919j15651j20389j10746j04522j03540j05220j04618j01173r7668r4497
$$ 90108919 89993268 89872879 89762133 89657611 89554071 89448851 89344233 89243060 89145392 89050895
3173.6H9050895q9383q4418q6379q9437q1009p0005p0203p3880p1209o5917o3336o4164
$$ 89050895 88961512 88877094 88790715 88701278 88620269 88550264 88480061 88406181 88334972 88269055 88205719 88141555
3198.1H8141555o5750o3771n6422m7988m2796m0001l6013k9856k8592l3176l4124k7227
$$ 88141555 88075805 88012034 87955612 87907624 87864828 87824827 87788814 87758958 87730366 87697190 87663066 87635839
3222.6H7635839j5640p105m8J8311L3909K0045L117J4860L6335N3125O4749N5903L5810
$$ 87635839 87620199 87613094 87613046 87631357 87665266 87685311 87688428 87703288 87739623 87792748 87857497 87913400 87949210
3249.1H7949210L9691O1959O6912M9025L7491M3303M9788N1504N6839O1030M0799P844
$$ 87949210 87988901 88050860 88117772 88166797 88204288 88247591 88297379 88348883 88405722 88466752 88507551 88515395
3273.6H8515395j2243k2119k0522j2136n346J359J3196L4082M2016K5177N686m017
$$ 88515395 88503152 88481033 88460511 88448375 88443029 88444388 88457584 88491666 88533682 88558859 88564545 88560528
3298H8560528M041L7139O8236N6833Q917k9278k8211p409k050r209j5211j4591j6636
$$ 88560528 88564569 88601708 88669944 88726777 88735694 88706416 88678205 88670796 88668746 88659537 88644326 88629735 88613099
3324.6H8613099m1306o8474p4643p2342o4808o1292r4086j44571j68502j74081j64175
$$ 88613099 88571793 88503319 88428676 88356334 88291526 88230234 88136148 87991577 87823075 87648994 87484819
3347H7484819j44846j69420k21836k31517k10356k02078k15757k21783j93727j80513
$$ 87484819 87339973 87170553 86948717 86717200 86506844 86304766 86089009 85867226 85673499 85492986
3367.4H5492986k22134k69985k65175k24370j98567j89227j84768j81729j66738j33073
$$ 85492986 85270852 85000867 84735692 84511322 84312755 84123528 83938760 83757031 83590293 83457220
3387.8H3457220r4182j00904j50609j54472r9081p2503j18100j63257j40989r4647
$$ 83457220 83363038 83262134 83111525 82957053 82857972 82785469 82667369 82504112 82363123 82268476
3408.2H2268476p5805q0359r5158r6733p0566n1224n0819l5971m119J5932J3036J8900
$$ 82268476 82192671 82112312 82017154 81920421 81849855 81798631 81747812 81711841 81707722 81723654 81736690 81755590
3432.7H1755590L7092K0028j4705k414M3547Q0151Q9085P0572O6048Q5288J04654J24430
$$ 81755590 81792682 81812710 81798005 81795591 81839138 81919289 82008374 82078946 82144994 82230282 82334936 82459366
3457.1H2459366J36197J23143J18876J51699J66643J25545Q5730R9349J35874J59997
$$ 82459366 82595563 82718706 82837582 82989281 83155924 83281469 83367199 83466548 83602422 83762419
3477.5H3762419J54263J23948J21498J48183J48541J28764J31768J53458J63942J52600
$$ 83762419 83916682 84040630 84162128 84310311 84458852 84587616 84719384 84872842 85036784 85189384
3497.9H5189384J47176J50931J29592J11699J36507J64378J62470J45012J34671J45721
$$ 85189384 85336560 85487491 85617083 85728782 85865289 86029667 86192137 86337149 86471820 86617541
3518.3H6617541J73021J93756J73265J39994J38491J44213J51712J73170J77663J65063
$$ 86617541 86790562 86984318 87157583 87297577 87436068 87580281 87731993 87905163 88082826 88247889
3538.7H8247889J81955K09791J94639J39433J20127J51760J58095J42330J61624J98048
$$ 88247889 88429844 88639635 88834274 88973707 89093834 89245594 89403689 89546019 89707643 89905691
3559.1H9905691K04158J88118K06107K29973J78343J32018J52159J87427K05367K23899
$$ 89905691 90109849 90297967 90504074 90734047 90912390 91044408 91196567 91383994 91589361 91813260
3579.5I1813260K41876K49648K54268K27713J77246J77932K17140K34592K29812K20954
$$ 91813260 92055136 92304784 92559052 92786765 92964011 93141943 93359083 93593675 93823487 94044441
3599.9I4044441J98948J87892K06864K22897K11305K13170K16800K02715K20353K05415
$$ 94044441 94243389 94431281 94638145 94861042 95072347 95285517 95502317 95705032 95925385 96130800
3620.3I6130800J29891J15257J76323K45314J88333J00071J04099J13285J08462J12766
$$ 96130800 96260691 96375948 96552271 96797585 96985918 97085989 97190088 97303373 97411835 97524601
3640.7I7524601J20789J51396K24691K58089J02347k7806K8318J06758Q0610L3932
$$ 97524601 97645390 97796786 98021477 98279566 98381913 98354107 98382425 98489183 98569793 98603725
3661.1I8603725K6489N4413J10793J47796R5051O1643Q5575J7690l7878j6398K1667
$$ 98603725 98630214 98684627 98795420 98943216 99038267 99099910 99185485 99203175 99165297 99148899 99170566
3683.5I9170566Q7773J71078J38902j2725n6124j2958K1619M7218M9705O926n037M4966
$$ 99170566 99258339 99429417 99568319 99555594 99499470 99486512 99508131 99555349 99605054 99611980 99606943 99651909
3708I9651909R1243M3195m6885m5174O377M0192L7312J0246j6051j8144L0893J02634
$$ 99651909 99743152 99786347 99739462 99694288 99700665 99740857 99778169 99788415 99772364 99754220 99785113 99887747
3732.5I9887747J03724Q529o4141n7774O634M8470P159J1784M1520k2262o3366k8366
$$ 99887747 99991471 100000000 99935859 99878085 99884719 99933189 99940348 99952132 99993652 99971390 99908024 99879658
3756.9I9879658L529j2940k2245L743K0492J6517j2297l4952r399L4159L3361j2201
$$ 99879658 99883187 99870247 99848002 99851745 99872237 99888754 99876457 99841505 99832106 99866265 99899626 99887425
3781.4I9887425k2137j0097j8973k2751r465J7959M3088L8588L9590L0106k0671k3365
$$ 99887425 99865288 99855191 99836218 99813467 99804002 99821961 99865049 99903637 99943227 99973333 99952662 99929297
3805.9I9929297k7114n7543l3754L2080P4857N3775K7693k2644o4665l8517j5145r00
$$ 99929297 99902183 99844640 99810886 99842966 99917823 99971598 99999291 99976647 99911982 99873465 99858320 99857420
3830.4I9857420K4521M5532N2500K0027k5892l8916l7724l5542j0455M6814R2309P397
$$ 99857420 99881941 99927473 99979973 100000000 99974108 99935192 99897468 99861926 99851471 99898285 99990594 99997991
3854.8I9997991q3661n8204N901L8332R841o539K0838J0723k8193m2314k6136K1136
$$ 99997991 99914330 99856126 99862027 99900359 99910200 99903661 99924499 99935222 99907029 99864715 99838579 99859715
3879.3I9859715L2585J7006J0669k5332j8156J1319j8304k7395J4210M2129L6031Q559
$$ 99859715 99892300 99909306 99919975 99894643 99876487 99887806 99869502 99842107 99856317 99898446 99934477 99943036
3903.8I9943036l6627n4455l0619j979J9932L6365K6941M83m327L290o151n669K0379
$$ 99943036 99906409 99851954 99821335 99819356 99839288 99875653 99902594 99903077 99898750 99902040 99895889 99890220 99910599
3930.3I9910599K6566k229k2126j0729J6201K8378J8823J6844J7673M518l505K945
$$ 99910599 99937165 99934936 99912810 99902081 99918282 99946660 99965483 99982327 100000000 100004518 100001013 100003958
3954.8A00003958J2982J5080J2397Q631L839N495J0145R525Q452J1015J1837J2696
$$ 100003958 100016940 100032020 100044417 100053048 100056887 100062382 100072527 100082052 100090504 100101519 100113356 100126052
3979.3A00126052J4484R835k87k026L624L934M840J0395R238
$$ 100126052 100140536 100150371 100150084 100148058 100151682 100155616 100160456 100170851 100180089
3997.6A00180089
$$ 100180089
##END=$$ End of the data block
