##TITLE=$$ Begin of the data block
##JCAMP-DX=5.00 $$ ACD/SpecManager v 10.08
##SPECTROMETER/DATA SYSTEM=Varian
##DATE=16 Apr 2013 13:46:44
##DATA TYPE=INFRARED SPECTRUM
##DATA CLASS=XYDATA
##ORIGIN=
##OWNER=
##NPOINTS=3735
##FIRSTX=399.26403809
##LASTX=4000.35498047
##MAXX=4000.35498047
##MINX=399.26403809
##MAXY=221.50845337
##MINY=43.78741074
##XFACTOR=1.0000000000
##YFACTOR=0.000001000000000
##FIRSTY=221.50845337
##DELTAX=0.96440572
##XUNITS=1/CM
##YUNITS=TRANSMITTANCE
##XYDATA=(X++(Y..Y))
399.3B21508453p5941742m6548469k3362984o385338N016754N016755K407684l578407
407G8132706l578415j969567Q1940m50943j717766j031440J155487J845604k92992
415.7G2174614k557716p63115O062698J3968025J7134453J2651169K688240p409821
423.4A13948547j3031738j3000420r405349n304642k421692n70732J132065K775444
431.1G4121483L447349K400719J70342j685028j977715r42154J07529N7579j080498
439.8G4619606k312500k487343j041450J688850M539551N958343M819390J259597l164031
448.4H3880013o344697o956550n165474k195797O82037K741803L635803L082649J094673
457.1G4454460j456871k878555j781388J515732M792504N489799K811508j568679m889534
$$ plain form
399.3 221508453 145566711 99018242 75655258 69269920 74286674 79303429 81711113 78132706
407 78132706 74554291 72584724 72666664 72215721 70497955 69466515 70622002 72467606 72174614
415.7 72174614 69616898 68853783 74916481 88884506 106018959 118670128 121358368 113948547
423.4 113948547 100916809 87916389 78511040 73206398 70784706 70213974 71346039 74121483
431.1 74121483 77568832 79969551 80139893 78454865 76477150 75534996 75642525 75700104 74619606
439.8 74619606 72307106 69819763 68778313 70467163 75006714 80965057 85784447 87044044 83880013
448.4 83880013 77535316 70578766 65413292 63217495 63899532 66641335 70277138 73359787 74454460
457.1 74454460 72997589 70119034 68337646 69853378 74645882 80135681 82947189 81378510 76488976
465.8G6488976n463753l647179r93278J205696K487465K753257J858506k0935j879181
474.5G2789574k304062p52930J704727L234642K965782J756531J118851J471321J682884
483.2H3667320M42688k065605m076141l909462j664017Q26065J703926P34223o89103
491.8G4969894j030021m8622J115425J083404o06178l288895n808540p208519o972950
500.5E2204998m989155j611465K210178N146622O199703N410820L858101K819633K804749
509.2G4054184L304848L407715K606483J075340o48697k064293k802581k582550j367630
517.9G4982819L47480J593583J555290K99812j158325j649178q12347O56319J664619
526.6G7480072J619118P54966k54943r01970j100273j015740p82318m09203R8687N96435
$$ plain form
465.8 76488976 71025223 67378044 66384766 67590462 70077927 72831184 74689690 74668755 72789574
474.5 72789574 70485512 69732582 71437309 74671951 77637733 79394264 80513115 81984436 83667320
483.2 83667320 84110008 82044403 77968262 74058800 72394783 73220848 74924774 75658997 74969894
491.8 74969894 73939873 73891251 75006676 76090080 75483902 72195007 66386467 59177948 52204998
500.5 52204998 47215843 45604378 47814556 52961178 59160881 64571701 68429802 71249435 74054184
509.2 74054184 77359032 80766747 83373230 84448570 83799873 81735580 78932999 76350449 74982819
517.9 74982819 75330299 76923882 78479172 78778984 77620659 75971481 75159134 75815453 77480072
526.6 77480072 79099190 79854156 79599213 78697243 77596970 76581230 75798912 75389709 75488396 76084831
536.2G6084831Q13401N49850r6474o98089p63222j31493Q44315J527710J459244O53465
545.9H0243538m76303j408821j748894j335129l22677P75558J280319Q07358l52653
554.5G7462296j378258j557961q46748J95061R66613J277123J283333J143234Q70163
563.2G9414856M94980K00897J72005L42552M11331J49399l57788q15254j022286j009224
572.9G7981468q91701o82472l14628J77482N76805O25786K52213l38326p72171p26898
582.5G5887558j26709P83371J538834J706451J142021P2449j049492j784683j873482
591.2G6296318j296669k98920O37627R81873N00984m89258j271149j235397l38532
599.9G3486877Q93349J780762J924217J334648L09075p22771j315811j192795m69521
$$ plain form
536.2 76084831 76898232 77448082 77351608 76653519 75890297 75758804 76603119 78130829 79590073 80243538
545.9 80243538 79767235 78358414 76609520 75274391 74951714 75727272 77007591 77814949 77462296
554.5 77462296 76084038 74526077 73679329 73874390 74841003 76118126 77401459 78544693 79414856
563.2 79414856 79909836 80110733 80282738 80625290 81036621 81186020 80828232 80012978 78990692 77981468
572.9 77981468 77089767 76407295 76092667 76270149 76846954 77472740 77724953 77386627 76614456 75887558
582.5 75887558 75760849 76544220 78083054 79789505 80931526 81003975 79954483 78169800 76296318
591.2 76296318 74999649 74700729 75338356 76320229 76821213 76331955 75060806 73825409 73486877
599.9 73486877 74380226 76160988 78085205 79419853 79728928 79006157 77690346 76497551 76028030
608.5G6028030L30170O34186L06816k31384m18228r1843M03320O26206M76951J88965
618.2G8253189l8345k69852o51588j085076j211769p71263P1587Q12111J027832P13028
627.8G6849854K31124j3351J35757N33333Q81577R34204O39618J56013k72270m96429
637.5G9579430n51499n69664o17126o40908n73951m48708l62465l43132l04519j61332
647.1G5006126M6448J88904J96785J27243O6452J6823o6536j48735r8427J63353N35881
657.7G6034317Q12683Q73467P51625N08476J22017m17549r23020j041115n71693K44690
667.4G6393898Q38432P79381J54419n21278p58309m65553O9687M88792O20972N03517
677G8103958K51305l9887k93052m28231l93303k22045l9628J5915j01951l12783m84161
$$ plain form
608.5 76028030 76358200 76992386 77299202 77067818 76649590 76557747 76961067 77587273 78064224 78253189
618.2 78253189 78214844 77944992 77293404 76208328 74996559 74225296 74296883 75108994 76136826 76849854
627.8 76849854 77080978 77067627 77203384 77736717 78618294 79552498 80192116 80348129 80075859 79579430
637.5 79579430 79027931 78458267 77841141 77200233 76626282 76177574 75815109 75471977 75167458 75006126
647.1 75006126 75052574 75241478 75438263 75565506 75631958 75648781 75582245 75433510 75335083 75498436 76034317
657.7 76034317 76847000 77720467 78472092 78980568 79102585 78685036 77762016 76720901 76149208 76393898
667.4 76393898 77232330 78011711 78166130 77644852 76886543 76420990 76490677 76979469 77600441 78103958
677 78103958 78355263 78315376 78022324 77594093 77200790 76978745 76939117 76955032 76853081 76540298 76056137
687.6G6056137n53574n74996o30028o86920n74387j37642N60082J212829J485138J270523
697.3G7427162P43729J72470k94579o50818q95401r52842p62749m15176j29753o7444
706.9G4174599j78009k57271j51489J11656L85734N59105O21712O03996N05448L12248
716.6G6687729O2149j58180l00934m18617o00373q35457r63790q00789l34481K03606
726.2G2540863M89235L63083l3722l74817m20944k09374O371m27k42455n64422q56835
736.8G0696556j195328j748573k557175l425102m029739m106007l510612k174950j30768
745.5D7818302K324326M533340N719151N483688M134651K484741J267579O98127N35897
754.2G4999802M78599M27231M09805L82622K19765j08155m34234n34264l46229j3138
$$ plain form
687.6 76056137 75502563 74927567 74297539 73610619 73036232 72898590 73458672 74671501 76156639 77427162
697.3 77427162 78170891 78343361 78048782 77397964 76502563 75549721 74786972 74371796 74242043 74174599
706.9 74174599 73996590 73739319 73587830 73699486 74085220 74644325 75266037 75870033 76375481 76687729
716.6 76687729 76749878 76591698 76290764 75872147 75271774 74436317 73472527 72671738 72337257 72540863
726.2 72540863 73030098 73393181 73359459 72984642 72563698 72354324 72360695 72360268 72117813 71553391 70696556
736.8 70696556 69501228 67752655 65195480 61770378 57740639 53634632 50124020 47949070 47818302
745.5 47818302 50142628 54675968 60395119 65878807 70013458 72498199 73765778 74463905 74999802
754.2 74999802 75478401 75905632 76315437 76698059 76917824 76809669 76375435 75841171 75494942 75481804
763.8G5481804K79648M57206N35767N13504L56659J01517r4506p1540J50047L39767
773.5G8049873K47719j57249o32691q48121o47988j70601K62665L86421J68694j98700
783.1G6460022m66148n00672l35937r2789J22917K51724K55448J14761j26106l36723
792.7G5346497l68058j71814J43608L83477M01191J81473j74072n11772o84433n99701
802.4G3946396k73483J42623M21059M03008J23428k05025l55529k62459n7274N6221
812G3938965l8178l14315o72074j025268j315438j469741j402855j103653p24068n45662
821.7F5327713q10829j549500k546619l460396l969250l844154k970085j402371N50438
830.4D5324947K348793L446331L610527L079453K388184J984039J945839K025101J931137
$$ plain form
763.8 75481804 75761452 76218658 76754425 77267929 77624588 77726105 77631599 77560059 77710106 78049873
773.5 78049873 78297592 78140343 77507652 76659531 76011543 75840942 76103607 76490028 76658722 76460022
783.1 76460022 75993874 75493202 75157265 75064476 75187393 75439117 75694565 75809326 75683220 75346497
792.7 75346497 74978439 74806625 74950233 75333710 75734901 75916374 75742302 75230530 74546097 73946396
802.4 73946396 73672913 73815536 74236595 74639603 74763031 74558006 74202477 73940018 73882744 73938965
812 73938965 73900787 73586472 72914398 71889130 70573692 69103951 67701096 66597443 65873375 65327713
821.7 65327713 64516884 62967384 60420765 56960369 52991119 49146965 46176880 44774509 45324947
830.4 45324947 47673740 51120071 54730598 57810051 60198235 62182274 64128113 66153214 68084351
839F8084351J581749J119689P42089N40046M78264M72664M52530L65456J74286j12648
848.7G3898476m13758o07010o10855m37179j68205J02935L00431L59336K39472k2041
858.3G2641602k83539l68363j99012J26686L99215M49089K54761o6688l49106m65225
868G2139420l73330j28006J39656K80701K09168m5334l52989n53963n36881k91519
877.6G0486923P5859L80989M61281K92420K1789j38023q0864J14372K72537K80793
887.3G2168076J55761k2857k00303l47496m07951l06633m5769K33361L33877J77300
896.9G1737366j12335l10853k81799o5597J93519L75885M36684L68210J68434j28258
906.5G2381256m12056n35667m25080j57493Q3313J46431K6108j48522k27508j52108
$$ plain form
839 68084351 69666100 70785789 71527878 72067924 72546188 73018852 73471382 73836838 74011124 73898476
848.7 73898476 73484718 72877708 72266853 71829674 71661469 71764404 72064835 72424171 72663643 72641602
858.3 72641602 72358063 71989700 71790688 71917374 72316589 72765678 73020439 72953751 72604645 72139420
868 72139420 71766090 71638084 71777740 72058441 72267609 72222275 71869286 71315323 70778442 70486923
877.6 70486923 70562782 70943771 71405052 71697472 71719261 71581238 71500374 71614746 71887283 72168076
887.3 72168076 72323837 72300980 72100677 71753181 71345230 71038597 70992828 71226189 71560066 71737366
896.9 71737366 71625031 71314178 71032379 70966782 71160301 71536186 71972870 72341080 72509514 72381256
906.5 72381256 71969200 71433533 71008453 70850960 70934273 71080704 71106812 70958290 70730782 70578674
916.2G0578674K3377J96594K94403K98126K18750P2510j12434k79373l60001l26058
925.8G0604568k24113j45630j49406k11159k52113k16477j18149j5251M8203O5208
935.5F9385681L9391m0360j81091l44551m47792m24156k89071j39022p7629j36704
945.1F7344696k60490l55591l55515k53334r7130L5340P2830j0269j72775l28385m04121
955.7F5215256l90305l36647k99599k93327k90012k61814k15786j87897k07817k74361
965.4F2457691l63369m52942n35888o07903o50585o36631n60547m64806m26776n03655
975E7254589o81049q76305j001942j033355j015564j002507r92465r27594p59117n07519
984.7D8457172k49504l9222J57814M44881Q96095J465916J991814K297054K310783
$$ plain form
916.2 70578674 70602051 70798645 71093048 71391174 71609924 71682434 71570000 71290627 70930626 70604568
925.8 70604568 70380455 70234825 70085419 69874260 69622147 69405670 69287521 69272270 69320473 69385681
935.5 69385681 69425072 69384712 69203621 68859070 68411278 67987122 67698051 67559029 67481400 67344696
945.1 67344696 67084206 66728615 66373100 66119766 66022636 66057976 66130806 66120537 65947762 65619377 65215256
955.7 65215256 64824951 64488304 64188705 63895378 63605366 63343552 63127766 62939869 62732052 62457691
965.4 62457691 62094322 61641380 61105492 60497589 59847004 59210373 58649826 58185020 57758244 57254589
975 57254589 56573540 55697235 54695293 53661938 52646374 51643867 50651402 49723808 48964691 48457172
984.7 48457172 48207668 48168446 48326260 48771141 49667236 51133152 53124966 55422020 57732803
993.3E7732803K106243J829426J586949J390796J194405R62463O93970L85124l486
1002F7878693n13695j112564j657875j959969j894344j468880q00144m2717O57173
1010.7E9085678J169685J393368J296593R52293N12547J27632j23512k36016k34119
1019.4F3944149j43696p564R8350J00743j084j07319q1131J41186M90631Q10478R61686
1030F6206429Q99932O75782L82171J01479j20651k80610m08187n42588o99424q55988
1039.6F5358345r75189j049061j113892j213283j344219j445866j448425j333664j146675
1048.3E4288071r50951p77290o14159m34242k18788M0619L42422O57845R14116J015888
1058E4263531R07749O28521L03497P5798L1307J66066L99543O09684O78738N48977
$$ plain form
993.3 57732803 59839046 61668472 63255421 64646217 65840622 66803085 67497055 67882179 67878693
1002 67878693 67364998 66252434 64594559 62634590 60740246 59271366 58471222 58428505 59085678
1010.7 59085678 60255363 61648731 62945324 63897617 64410164 64537796 64414284 64178268 63944149
1019.4 63944149 63800453 63792889 63891239 63991982 63990898 63883579 63802448 63943634 64434265 65244743 66206429
1030 66206429 67106361 67782143 68164314 68265793 68145142 67864532 67456345 66913757 66214333 65358345
1039.6 65358345 64383156 63334095 62220203 61006920 59662701 58216835 56768410 55434746 54288071
1048.3 54288071 53337120 52559830 51945671 51511429 51292641 51333260 51675682 52333527 53247643 54263531
1058 54263531 55171280 55799801 56103298 56179096 56210403 56376469 56776012 57385696 58064434 58613411
1067.6E8613411K62272o4602l34957n55401q03101j080444j207241r06170n3635J131630
1077.2E5001762K172532K650104K478333J898670J230484O38733J23230l21968n95467
1085.9F5276413n50201j44661M89097J122544J562271J721321J612465J317474R60381
1094.6G3367104O64199M87542L93745K99271J63223K3613n7617p0801o2477p0030p8942
1105.2G5058830o1966m3762r3033k35840l96667m55856l75580k54524k39312l75732
1114.9G2526558n50125n78507l57582N5008M85123P57515P94060O40762M23675K65328
1124.5G4461815K10251K08763J73805O6864o5033j37970j18995o4347o8580j75515
1134.1G4491058l38417m61952m79317l93013k56668j30340n2460l7956q4687j74972
$$ plain form
1067.6 58613411 58875683 58811081 58476124 57920723 57117622 56037178 54829937 53923767 53870132 55001762
1077.2 55001762 57174294 59824398 62302731 64201401 65431885 66070618 66193848 65871880 65276413
1085.9 65276413 64726212 64581551 65070648 66193192 67755463 69476784 71089249 72406723 73367104
1094.6 73367104 74031303 74518845 74912590 75211861 75375084 75398697 75341080 75270279 75207802 75137772 75058830
1105.2 75058830 74996864 74953102 74860069 74624229 74227562 73771706 73396126 73141602 72902290 72526558
1114.9 72526558 71976433 71397926 71040344 71095352 71580475 72337990 73132050 73772812 74196487 74461815
1124.5 74461815 74672066 74880829 75054634 75121498 75056465 74918495 74799500 74735153 74666573 74491058
1134.1 74491058 74152641 73690689 73211372 72818359 72561691 72431351 72378891 72340935 72256248 72081276
1143.8G2081276k77603l60001m05945m23370m35509m64241n20332o05095p14485q36220
1153.4F7038475r42085r90036r47685q27302o99329o57520p46487r07139r94617q68038
1163.1E8458237m83544Q3897P00973J255429J685875J957218K035259J901413J586632
1171.8F9181389J174660P61634M13506J62338K8984K7474J36276K78442L53623L06625
1181.4G2824951J67511K2568n3543l9589M4441J70754L14544M41307N04700M74304
1191G4871948L67615K46368J72722J64513J90201K04780J87920J49406J04813N4642
1200.7G6714928p744p1510j01792o7146K3506J16646J53778J18347M3709k4071o6719
1211.3G6831932r6191j24764j44295j40152j18675j08566j31249j73454j95457j67191
$$ plain form
1143.8 72081276 71803673 71443672 71037727 70614357 70178848 69714607 69194275 68589180 67874695 67038475
1153.4 67038475 66096390 65106354 64158669 63331367 62632038 61974518 61228031 60320892 59326275 58458237
1163.1 58458237 57974693 58058590 58759563 60014992 61700867 63658085 65693344 67594757 69181389
1171.8 69181389 70356049 71117683 71531189 71693527 71722511 71749985 71886261 72164703 72518326 72824951
1181.4 72824951 72992462 73015030 72961487 72921898 72966339 73137093 73451637 73892944 74397644 74871948
1191 74871948 75239563 75485931 75658653 75823166 76013367 76218147 76406067 76555473 76660286 76714928
1200.7 76714928 76707184 76635674 76533882 76466736 76490242 76606888 76760666 76879013 76922722 76898651 76831932
1211.3 76831932 76735741 76610977 76466682 76326530 76207855 76099289 75968040 75794586 75599129 75431938
1220.9G5431938r4101r506N3146P9003O9877L4401j5449o2676q8005q0223m4884j922
1232.5G5271599K6527L0304J6060J610K304K0149M2595N1987L6422o988p6294j67442
1244.1G5248833k69348l58323m05052l95813l50158l13912l25531l80920m27727l97217
1253.7G1624832k50931q056K63206M80141N82069N52262M20539K47414R4612n455o1249
1264.3G3939384j04301j56624k15233k69409l29040m24752n68885p13936p58919o12389
1274F9785896k64534J93604O20292R01764R99787R43573P90573N94643L98864K38282
1283.6G5202744J33247P7103L7963j4442p8659j22444j19591q5182o6933r6062j50238
1294.2G4717506j72866j30242m4678L1296O6506O9175N8709L6491m753n2147p3288
$$ plain form
1220.9 75431938 75337837 75328331 75381477 75460480 75530357 75564758 75549309 75486633 75398628 75318405 75273521 75271599
1232.5 75271599 75298126 75328430 75344490 75346100 75348404 75368553 75411148 75463135 75499557 75492569 75416275 75248833
1244.1 75248833 74979485 74621162 74216110 73820297 73470139 73156227 72830696 72449776 72022049 71624832
1253.7 71624832 71373901 71365845 71629051 72109192 72691261 73243523 73664062 73911476 74006088 74000633 73939384
1264.3 73939384 73835083 73678459 73463226 73193817 72864777 72440025 71871140 71157204 70398285 69785896
1274 69785896 69521362 69714966 70335258 71237022 72236809 73180382 73970955 74565598 74964462 75202744
1283.6 75202744 75335991 75413094 75451057 75436615 75357956 75235512 75115921 75030739 74963806 74867744 74717506
1294.2 74717506 74544640 74414398 74369720 74401016 74467522 74536697 74595406 74631897 74627144 74574997 74501709
1304.8G4501709n4169k4727k9876p4570j11183r2507l0181J3114o912o4461r1384n2948
1316.4G3881905J3183L6896j2260r8023j57158j56822j12511o1126k7924j8868l1814
1327G3255478o2676r9456j19896j03981n2636Q286M4395L5912j2070p7171j34720j67305
1338.6G2514160j66008j28776o2882J1994O6795P7583M3137j0361m6883m9354l2929
1349.2G2216476k6832m0947n2788l2768J6975N3765L1196n4642j58660k29035k54082
1359.8G1468658k65678k97920l46840l71323l29864k14646n4489J05782K26478K82471
1369.4G0202629K65778J88034P8552k6894j02790j43525j59660j64955j65672j59134
1379.1F9812363j40786j12228q3107o5201o4224p7476r8092j19476j34300j32790j09611
$$ plain form
1304.8 74501709 74447540 74422813 74392937 74318367 74207184 74114677 74084496 74097610 74090698 74026237 73934853 73881905
1316.4 73881905 73895088 73931984 73919724 73821701 73664543 73507721 73395210 73334084 73306160 73287292 73255478
1327 73255478 73192802 73093346 72973450 72869469 72816833 72825119 72869514 72905426 72893356 72816185 72681465 72514160
1338.6 72514160 72348152 72219376 72156494 72168488 72235283 72312866 72356003 72345642 72298759 72249405 72216476
1349.2 72216476 72189644 72148697 72095909 72063141 72080116 72133881 72165077 72110435 71951775 71722740 71468658
1359.8 71468658 71202980 70905060 70558220 70186897 69857033 69642387 69587898 69693680 69920158 70202629
1369.4 70202629 70468407 70656441 70734993 70708099 70605309 70461784 70302124 70137169 69971497 69812363
1379.1 69812363 69671577 69559349 69476242 69411041 69346817 69269341 69171249 69051773 68917473 68784683 68675072
1389.7F8675072p6714o5826j09040k10434l37471m45335n12474n52017n88196o23924
1399.3F5153641o34705n95405n11277m21428l67779l55263l37311k42450k7100K82749
1409F1943672N93872P95517Q22479O85578M50600J89186n5489k67090m35119n44503
1418.6F4178703n86773n76244n51090n57415o30379p83749j007358j268707j519829
1427.3E6697159j712715j815861j817135j708706j469318j067097m87457K35840J014202
1436D7868912J728676K267887K558616K582421K379139K033825J642940J272827R40834
1444.7F5276077O36353L59794J37589l128o7421r3140j17912j53145j90422k21352
1454.3F5563293k35908k04208q3153J36207L86582N47714N31181L49579J02509j02677
$$ plain form
1389.7 68675072 68598358 68532532 68423492 68213058 67875587 67430252 66917778 66365761 65777565 65153641
1399.3 65153641 64518936 63923531 63412254 62990826 62623047 62267784 61930473 61688023 61660923 61943672
1409 61943672 62537544 63333061 64155540 64841118 65291718 65480904 65425415 65158325 64723206 64178703
1418.6 64178703 63591930 63015686 62464596 61907181 61276802 60493053 59485695 58216988 56697159
1427.3 56697159 54984444 53168583 51351448 49642742 48173424 47106327 46618870 46854710 47868912
1436 47868912 49597588 51865475 54424091 57006512 59385651 61419476 63062416 64335243 65276077
1444.7 65276077 65912430 66272224 66409813 66406685 66339264 66246124 66128212 65975067 65784645 65563293
1454.3 65563293 65327385 65123177 65040024 65176231 65562813 66110527 66641708 66991287 67093796 66991119
1464F6991119k18139k58667k64366k74170l23334m38889o19430q24913j001629j125126
1473.6F1642456j218258j328659j495083j733734k036484k353000k560879k469170
1481.3D6447189j891918p67860P49607K302028L450699L869816L516083K672707J812576
1490F2160927J335392J342739J615509J812508J726921J393699R88823O53244M15489
1498.7G3445251K46422J32599O7444k197j60111m17465o44882o56777l92555m234K60589
1509.3G1874084K71050J03806o8604j52443j80641k12082k34459j94923j03188n5473
1518.9G1047127j32859k94380m01619l55575j94374m6326J427k5498m0672J808O8245
1529.5F9627304R6588O9748L4928N7746J60553K98287L86734L58711K06986j3855k21642
$$ plain form
1464 66991119 66772980 66514313 66249947 65975777 65652443 65213554 64594124 63769211 62767582 61642456
1473.6 61642456 60424198 59095539 57600456 55866722 53830238 51477238 48916359 46447189
1481.3 46447189 44555271 43787411 44537018 46839046 50289745 54159561 57675644 60348351 62160927
1490 62160927 63496319 64839058 66454567 68267075 69993996 71387695 72376518 73029762 73445251
1498.7 73445251 73691673 73824272 73891716 73889519 73729408 73311943 72667061 72010284 71617729 71613495 71874084
1509.3 71874084 72145134 72248940 72180336 72027893 71847252 71635170 71400711 71205788 71102600 71047127
1518.9 71047127 70914268 70619888 70218269 69862694 69668320 69621994 69623421 69597923 69557251 69559059 69627304
1529.5 69627304 69723892 69793640 69828568 69886314 70046867 70345154 70731888 71090599 71297585 71283730 71062088
1540.1G1062088l49617l73322l16543k40242k12868k66472l67981m44198m51515m21326
1549.8F7618004m22600m80087n53841o18347p39029j014477j410103j680229j523605
1558.5E9175686q63075L6808P61890J078331J078693J020768J053444J112381J051101
1567.1F5506027Q23494N22202K71393J21536M6936O706j9279m0558o7513r9914j19774
1577.7F6951256j13617r8343j10733j66794k41447k96929l26904l64174m44115n67352
1587.4F4220848p02103q18451r15096j014774j139389j291557j454995j607063j728859
1596.1E3548561j803776j807224j700485j442993j023075m85428P2830N44437Q65277
1604.7D6768124J039848J121838J169807J213596J251507J270352J264503J238712
$$ plain form
1540.1 71062088 70712471 70339149 70022606 69782364 69569496 69303024 68935043 68490845 68039330 67618004
1549.8 67618004 67195404 66715317 66161476 65543129 64804100 63789623 62379520 60699291 59175686
1558.5 59175686 58312611 58349419 59111309 60189640 61268333 62289101 63342545 64454926 65506027
1567.1 65506027 66329521 66851723 67123116 67244652 67291588 67298294 67279015 67238457 67170944 67071030 66951256
1577.7 66951256 66837639 66739296 66628563 66461769 66220322 65923393 65596489 65232315 64788200 64220848
1587.4 64220848 63518745 62700294 61785198 60770424 59631035 58339478 56884483 55277420 53548561
1596.1 53548561 51744785 49937561 48237076 46794083 45771008 45285580 45358410 45902847 46768124
1604.7 46768124 47807972 48929810 50099617 51313213 52564720 53835072 55099575 56338287
1612.5E6338287J196801J132362J033321Q96523P37347N82595M52031L46843K55066
1621.1F2971176J66214P9426R12o0276r2118q1718k5459O0878J48903K18632K69241
1631.7F3655811L04081L10204K67090J82579J09771J09200J88004K86727L36724L24760
1641.4F6074951K89681K60261K20612J51596Q7028Q9737J57028J79497L9322k36206
1651F7313507m47754l87794m4991L66356N90385N43274L50571J96472J57959J80443
1660.7F8818428J79115J32813Q1695O2706O9878P2929N7328L8337M0406O7375R2186
1671.3F9713196P7095R949p4318j15319q0207K563O8207P6515M2084K105l3538q3580
1682.9F9604752j48133j81747j33461j1269J10390J55975J13785L0281m8683j11618
$$ plain form
1612.5 56338287 57535088 58667450 59700771 60597294 61334641 61917236 62369267 62716110 62971176
1621.1 62971176 63137390 63216816 63217728 63157452 63065334 62983616 62958157 63019035 63167938 63386570 63655811
1631.7 63655811 63959892 64270096 64537186 64719765 64829536 64938736 65126740 65413467 65750191 66074951
1641.4 66074951 66364632 66624893 66845505 66997101 67084129 67173866 67330894 67510391 67549713 67313507
1651 67313507 66865753 66477959 66432968 66799324 67389709 67932983 68283554 68480026 68637985 68818428
1660.7 68818428 68997543 69130356 69212051 69274757 69344635 69417564 69474892 69513229 69553635 69621010 69713196
1671.3 69713196 69790291 69800240 69725922 69610603 69530396 69532959 69601166 69677681 69719765 69721870 69688332 69604752
1682.9 69604752 69456619 69274872 69141411 69130142 69240532 69396507 69510292 69540573 69491890 69380272
1692.5F9380272j57532j63185j00021J5548J10833J15379L1761o0638p8720r873Q4641
1703.1F9168465J32316J10504N0827l364l4462n0202n7258m6410q461L9849N4359q54
1714.7F9355309j10749k05711k10411j07392M3381J50009J58966Q8639J693n1178o2416
1725.3F9050140n3672m2916l0159j2047n64j8700p4196j40396j69227j30341m0352
1735.9F8337570M6021P6950M0336l3371r9121j27647j15517p7354l4111n715m638l0106
1747.5F7973297o7001r3872r3247n7419R621Q9905J52031J64551J19346M4022j5282
1758.1F8225952k9930j0162R277L143k5818n7884p8392q6380q7677q6883q6914r0043
1769.7F7598289r4978r6397r2156q9843r9640j18172j24970j01684n4672j1826M913
$$ plain form
1692.5 69380272 69222740 69059555 68959534 68975082 69085915 69201294 69233055 69172417 69093697 69083824 69168465
1703.1 69168465 69300781 69411285 69462112 69458748 69424286 69374084 69316826 69270416 69261955 69301804 69356163 69355309
1714.7 69355309 69244560 69038849 68828438 68721046 68764427 68914436 69073402 69162041 69163734 69112556 69050140
1725.3 69050140 68996468 68953552 68923393 68911346 68910782 68892082 68817886 68677490 68508263 68377922 68337570
1735.9 68337570 68383591 68460541 68500877 68467506 68368385 68240738 68125221 68047867 68013756 68008041 68003403 67973297
1747.5 67973297 67906296 67812424 67719177 67661758 67671379 67761284 67913315 68077866 68197212 68241234 68225952
1758.1 68225952 68196022 68185860 68195137 68198280 68172462 68114578 68036186 67949806 67862129 67775246 67688332 67598289
1769.7 67598289 67503311 67406914 67314758 67224915 67125275 67007103 66882133 66780449 66725777 66713951 66718864
1780.3F6718864N04l571L464J2474J2863J0323J7471K9534K1324k3697q6166j21949
1791.8F6591438j03599m6479Q744L3828K8809N509k9809o9648r0767o4911O279P4722
1803.4F6344116P9132K816j04783j69235j55464r1545l3531j4206k5955m4808n9646
1814F5726891p5760r7275j15669j16722r5940o4179l9543l4416m7676o6277p4302o4484
1825.6F4834648m3472k6764k5955l9803n7182o7322o7238o1310n6892o1752q1353j13449
1837.2F4132156j43657j50051j18393n5516J1364N0545M3755o775q2249j56239k03708
1847.8F3321232k10522j80950j36490j02722r2918j01510j12609j14483j05702r0133
1857.4F2073193o9596m3552j5053O180R361p824l5339n7564o5193o2164o1425p2765
$$ plain form
1780.3 66718864 66719368 66715797 66719261 66731735 66744598 66754921 66772392 66801926 66823250 66799553 66713387 66591438
1791.8 66591438 66487839 66441360 66450104 66483932 66512741 66518250 66488441 66418793 66328026 66263115 66269394 66344116
1803.4 66344116 66423248 66426064 66321281 66152046 65996582 65905037 65871506 65857300 65831345 65786537 65726891
1814 65726891 65651131 65553856 65438187 65321465 65225525 65161346 65121803 65087387 65039711 64973434 64899132 64834648
1825.6 64834648 64791176 64764412 64738457 64698654 64641472 64574150 64506912 64445602 64388710 64326958 64245605 64132156
1837.2 64132156 63988499 63838448 63720055 63664539 63675903 63726448 63770203 63763428 63681179 63524940 63321232
1847.8 63321232 63110710 62929760 62793270 62690548 62597630 62496120 62383511 62269028 62163326 62073193
1857.4 62073193 62003597 61960045 61944992 61951172 61960533 61952709 61917370 61859806 61794613 61732449 61671024 61598259
1869F1598259r2926j07533j03935q4274o5037o1695p2510p9353o7600m5521m0588p2640
1880.6F0704647j29925j74251j73409j29543p6050m7344n1704p1045q2058p4803n4027
1891.2E9640488k9911j1372n146j4484l5126n5283o3495n7919m7008m0806m3362n3387
1902.7E9183189o9248q9138j06426j09474r0462n4989j9649K880J6102L5659P2205
1913.3E8770649J18370J53500J61426J43765J17736J02082J04625J20591J38744J48319
1923F0079807J42628J21685R4158P5207P7084R8331J22673J32027J22646J07662J02608
1933.6F1276516J08620J11950J00601P9242O6014P4119R8053J18565J19862J02237
1943.2F2255779P9396O6135O8462Q2501R9766J12705J17683J14723J05767R3422Q0787
$$ plain form
1869 61598259 61505333 61397800 61293865 61209591 61144554 61082859 61010349 60930996 60863396 60817875 60777287 60704647
1880.6 60704647 60574722 60400471 60227062 60097519 60021469 59974125 59922421 59851376 59769318 59694515 59640488
1891.2 59640488 59610577 59599205 59594059 59579575 59544449 59489166 59425671 59367752 59320744 59279938 59236576 59183189
1902.7 59183189 59113941 59024803 58918377 58808903 58718441 58663452 58643803 58646683 58662785 58698444 58770649
1913.3 58770649 58889019 59042519 59203945 59347710 59465446 59567528 59672153 59792744 59931488 60079807
1923 60079807 60222435 60344120 60438278 60513485 60590569 60688900 60811573 60943600 61066246 61173908 61276516
1933.6 61276516 61385136 61497086 61597687 61676929 61742943 61817062 61915115 62033680 62153542 62255779
1943.2 62255779 62335175 62401310 62469772 62552273 62652039 62764744 62882427 62997150 63102917 63196339 63277126
1953.8F3277126P1907P0130P4699P9132P5146O0043M1004L0575L7258N8205Q0315Q7436
1965.4F4042976O8688K4681l0525p3906q4709n7831q656L6549N8853N8754N1018M8141
1977F4134033M8477M0566J8570p752j9851p859J8906L9490M0161K6138J4832J8440
1988.6F4364151L3188M5120M4121L1876J8135J2039J7578L3241N1926O1523N0629J9119
2000.1F4782646j6594l3111j8784J6037M7943O0326N4123M0985K9213J8532O775k350
2011.7F4985741j191J2825L2280M4091L9062J7967r033k7427k5109J549M4693Q7593
2023.3F5203041J13205J13258R1835O2058L9131L4706N2643Q5938J16752J23779R6199
2033.9F6132545M4899r84j3481J2413N3421P4928N7023P911m4540p4127p2228m8210
$$ plain form
1953.8 63277126 63349033 63419163 63493862 63572994 63648140 63708183 63749187 63779762 63817020 63875225 63955540 64042976
1965.4 64042976 64111664 64136345 64105820 64031914 63947205 63889374 63880718 63917267 63976120 64034874 64085892 64134033
1977 64134033 64182510 64223076 64241646 64233894 64214043 64206184 64225090 64264580 64304741 64330879 64345711 64364151
1988.6 64364151 64397339 64442459 64486580 64518456 64536591 64548630 64566208 64599449 64651375 64712898 64763527 64782646
2000.1 64782646 64766052 64732941 64714157 64730194 64778137 64838463 64892586 64933571 64962784 64981316 64988091 64985741
2011.7 64985741 64984550 64997375 65029655 65073746 65112808 65130775 65121742 65094315 65069206 65070755 65115448 65203041
2023.3 65203041 65316246 65429504 65521339 65583397 65622528 65657234 65709877 65795815 65912567 66036346 66132545
2033.9 66132545 66177444 66176460 66162979 66175392 66228813 66303741 66360764 66368675 66324135 66250008 66177780 66129570
2045.5F6129570j9165N49M219o607k2766l1273k2163L746L3234M7721L5683J549l5416
2058F6118881n2833m0108n257L1372N2376N3955M3213K6978O546j6175l0731k2667
2069.6F6165550J0033M7684O0707L4378j7708o5209q5083p5218m9133k2339m906j251
2081.1F5997505j0681k6016l5782l1616j4847M875J7151J6792M235j6175l6743m8866
2092.7F5819832m8103l8109k6848j7845p447P386J9714J5823r941m4937o6192n9746
2104.3F5543587l2921o966J068r201k4063k8465j7311J533J3108O065j8921m8782o6406
2116.8F5312325o1615l6767m135K1508K9625J8287n340k8084l8140l1860j5266R53
2128.4F5161491P996J755j7807m5944p2686q5525p7133n1285k0287M692J9516K4552
$$ plain form
2045.5 66129570 66110405 66110954 66115173 66108566 66085800 66054527 66032364 66036110 66069344 66117065 66152748 66154297 66118881
2058 66118881 66066048 66025940 66020683 66052055 66104431 66158386 66201599 66228577 66235123 66218948 66188217 66165550
2069.6 66165550 66175583 66223267 66283974 66318352 66300644 66235435 66150352 66075134 66026001 66003662 65998756 65997505
2081.1 65997505 65986824 65960808 65925026 65893410 65878563 65883438 65900589 65917381 65921616 65905441 65868698 65819832
2092.7 65819832 65771729 65733620 65706772 65688927 65681480 65688866 65708580 65724403 65714462 65669525 65603333 65543587
2104.3 65543587 65510666 65503700 65504768 65495567 65471504 65443039 65425728 65427261 65440369 65446434 65427513 65378731 65312325
2116.8 65312325 65250710 65213943 65209808 65231316 65260941 65279228 65273888 65245804 65207664 65175804 65160538 65161491
2128.4 65161491 65169487 65171242 65153435 65107491 65034805 64949280 64872147 64820862 64800575 64805267 64824783 64849335
2140F4849335J8974K113j8936k7969j1475K5864N9990O6017M0482M470j6197j4847
2151.5F4977821p789j4931l7819n6290m7538q561L8361O1318M1664j2940p3540j08230
2163.1F4751526j02272o6422k7984r293j0879j4611m753J3748J9478j846l9650o7001
2174.7F4440041o6513m5929k6925k1598k2484j5473K442K0141K5650J7273J435j6808
2186.3F4291252l7422n9418p5035p3234m9771j3447J8013K9419J7578p843l1921m4453
2197.8F3963718m4887l9288l3642l0197k9197l1800l8829m7650n2265m8309l7556k5890
2209.4F3504208j7144r960j507P637J3226J2470P332L086L208N856M150j0128m0161
2221.9F3482273p8518j08032j12701r1423o1299m3503m4033m8988m0474j7002L616
$$ plain form
2140 64849335 64868309 64870422 64851486 64823517 64812042 64837906 64897896 64963913 65004395 65008865 64992668 64977821
2151.5 64977821 64970032 64955101 64917282 64860992 64813454 64804893 64843254 64904572 64946236 64933296 64859756 64751526
2163.1 64751526 64649254 64582832 64554848 64545555 64534676 64520065 64515312 64529060 64548538 64546692 64507042 64440041
2174.7 64440041 64373528 64327599 64300674 64279076 64256592 64241119 64243561 64263702 64289352 64306625 64308060 64291252
2186.3 64291252 64253830 64194412 64119377 64046143 63996372 63982925 64000938 64030357 64047935 64040092 64008171 63963718
2197.8 63963718 63918831 63879543 63845901 63815704 63786507 63754707 63715878 63668228 63615963 63567654 63530098 63504208
2209.4 63504208 63487064 63477104 63475597 63483234 63496460 63508930 63516262 63519348 63522556 63528412 63532562 63522434 63482273
2221.9 63482273 63403755 63295723 63183022 63091599 63030300 62986797 62942764 62893776 62853302 62836300 62839916
2232.5F2839916J889k4220n7854p9277q0681o6425m3209j4614J4488L2604K5505j0986
2244.1F2537136o2614j02581j08853p8907l1032Q011J8772j538m0065p6481r4258q9016
2255.7F1878574p0152n3417m9164n5447o2198o1581n3940m3522l1345j5438J541Q515
2267.3F1392426n742l9527p5722r4521q9180o8855m8229l6602l6679m9015p2734j00632
2278.8F0674988j17645j09276p4093k8984r31j0117n5324j11309j41720j22307n9833
2289.4E9843449Q834M0291J4717n0788j15742j44173j25477p5901k5470m73j1040m8027
2301E9310200r1107j23310j40522j47712j46771j31836r9098n9536l6312m5193p7026
2311.6E8211777j02139r3540m8683Q423M3606L3851j9352q9969j40709j43906r8125
$$ plain form
2232.5 62839916 62841805 62817585 62759731 62680454 62599773 62533348 62490139 62475525 62490013 62522617 62548122 62537136
2244.1 62537136 62474522 62371941 62263088 62184181 62153149 62161160 62179932 62178394 62138329 62061848 61967590 61878574
2255.7 61878574 61808422 61755005 61705841 61650394 61588196 61526615 61472675 61429153 61397808 61382370 61383911 61392426
2267.3 61392426 61386684 61347157 61271435 61176914 61087734 61018879 60970650 60934048 60897369 60848354 60775620 60674988
2278.8 60674988 60557343 60448067 60373974 60344990 60344059 60333942 60278618 60167309 60025589 59903282 59843449
2289.4 59843449 59852283 59892574 59907291 59856503 59740761 59596588 59471111 59395210 59369740 59369267 59358227 59310200
2301 59310200 59219093 59095783 58955261 58807549 58660778 58528942 58429844 58370308 58333996 58288803 58211777
2311.6 58211777 58109638 58016098 57967415 57975838 58019444 58053295 58033943 57943974 57803265 57659359 57561234
2322.2E7561234k8706K8641M7283J9596m3648j16821j64906j57753r2075k575N5946
2332.8E7106216M7867j5819q7132j17859q9916j8040O5407J24645J29345O6952m1889
2343.4E7169777j43654j79558j26129j4137R0942J31737R1011n798j12416j88736k17193
2354.1E6495846k03037j61694j05312m1375J6442M1889J2531n9662j18503j00395M703
2364.7E5781433J27266J64372O7333j08578k42313k43023j18813L9372J37119J43551
2374.3E5747719R3025L5309q545m6516q5583j12263j05492o2740q568K4411K1755n200
2385.9E5487312l3733m8962n0712m7009m5635n1094o4541q2645r6833r7236q0330n2685
2397.4E4735897k6455j0048m192n318j1055k0714l1417l6942l2303j9768q800q930
$$ plain form
2322.2 57561234 57532528 57561169 57608452 57628048 57584400 57467579 57302673 57144920 57052845 57050270 57106216
2332.8 57106216 57154083 57138264 57051132 56933273 56843357 56825317 56890724 57015369 57144714 57211666 57169777
2343.4 57169777 57026123 56846565 56720436 56706299 56797241 56928978 57019989 57014191 56901775 56713039 56495846
2354.1 56495846 56292809 56131115 56025803 55984428 56000870 56042759 56055290 55995628 55877125 55776730 55781433
2364.7 55781433 55908699 56073071 56140404 56031826 55789513 55546490 55427677 55467049 55604168 55747719
2374.3 55747719 55840744 55876053 55867508 55820992 55735409 55623146 55517654 55454914 55446346 55470757 55492512 55487312
2385.9 55487312 55453579 55404617 55353905 55306896 55261261 55210167 55145626 55062981 54966148 54868912 54788582 54735897
2397.4 54735897 54709442 54699394 54695202 54689884 54678829 54658115 54626698 54589756 54557453 54537685 54528885 54519955
2409E4519955k1622l8528m7688m2511k8255j9822l2062o6811j07326j27346j10852
2419.6E3877132o6192k0607J556l303k0993l7582n1712o7799q1623p8689n0297q679
2431.2E3391212J8551J1818k3124o0955p9110p3639n6320m1237l5446l8940m7699n4840
2442.8E2910271n1892l4465p565J5938K4364J5374m235k5814m4113n6660o0646n2791
2454.3E2627766l3039o913J6045K6955K2113N284j3352k2224j6129n49J2535J5335
2465.9E2633827J1097R514J5018K0928J6407j213k2526l4210k9316r308K1053N6294
2477.5E2687565Q7108J00003Q7024N7915L8651N1593R4079J38141J53828J34746J01231
2488.1E3731884Q0704Q5216J06625J27907J35811J24095R0928L8951k1522p3948j04546
$$ plain form
2409 54519955 54498333 54459805 54412117 54369606 54341351 54321529 54289467 54222656 54115330 53987984 53877132
2419.6 53877132 53810940 53790333 53791889 53788586 53767593 53730011 53678299 53610500 53528877 53450188 53399891 53391212
2431.2 53391212 53409763 53421581 53398457 53337502 53258392 53184753 53128433 53087196 53051750 53012810 52965111 52910271
2442.8 52910271 52858379 52823914 52816349 52832287 52856651 52872025 52867790 52841976 52797863 52741203 52680557 52627766
2454.3 52627766 52594727 52587814 52603859 52630814 52652927 52658211 52644859 52622635 52606506 52605957 52618492 52633827
2465.9 52633827 52644924 52654438 52669456 52690384 52706791 52705578 52683052 52648842 52619526 52610218 52631271 52687565
2477.5 52687565 52774673 52874676 52961700 53019615 53058266 53109859 53203938 53342079 53495907 53630653 53731884
2488.1 53731884 53812588 53897804 54004429 54132336 54268147 54392242 54483170 54522121 54500599 54426651 54322105
2498.7E4322105j11736j06056r9899r7897r7092r5417r6634j05293j17409j19487j00422
2509.3E3174763o5419l6167l3966o0322r3822j06838q6758m2869M486L8814N2830M4849
2520.9E2789581J6571k2773n4509n9742l5694k533J0788r163m7844p5340p2342m5028
2532.5E2391972j6106k895m849j0078j0182o431l357j469J061J987m932k1302l8479
2545E2274940m4849l9268l2750l4816l9421k9515K701M3026O5987N8479L1292P599
2556.6E2263405K930J6952M0424O4610Q3088R0607Q5891P6180P3845Q4800J00762J05377
2568.1E3088871Q8505N4241J5610j5572l3817l8727l4077k7984k9839m2621n8716o6227
2579.7E2899647o0684m8584l9010l3687k8538k4109k8583m6974o8505p0831m0882R456
$$ plain form
2498.7 54322105 54210369 54104313 54004414 53906517 53809425 53714008 53617374 53512081 53394672 53275185 53174763
2509.3 53174763 53109344 53073177 53039211 52978889 52885067 52778229 52691471 52648602 52653088 52691902 52744732 52789581
2520.9 52789581 52806152 52783379 52728870 52669128 52633434 52630901 52641689 52632526 52584682 52509342 52437000 52391972
2532.5 52391972 52375866 52372971 52368122 52358044 52347862 52341431 52338074 52336605 52337666 52339653 52334721 52313419 52274940
2545 52274940 52230091 52190823 52158073 52123257 52083836 52054321 52057022 52100048 52166035 52224514 52255806 52263405
2556.6 52263405 52266335 52283287 52323711 52388321 52471409 52562016 52647907 52724087 52797932 52882732 52983494 53088871
2568.1 53088871 53177376 53231617 53247227 53231655 53197838 53159111 53125034 53097050 53067211 53024590 52965874 52899647
2579.7 52899647 52838963 52790379 52751369 52717682 52689144 52665035 52636452 52589478 52520973 52450142 52409260 52418716
2591.3E2418716N0652N9902L7892K609k8805n0060n9799n4268l0358M204L0106L0708
2602.9E2411499P389k0744l2910k2293L754L4424O3270Q5987R5784Q6387O0536L2840
2614.4E2805923K0421K8530M5761N3520M1592J5483r651k1312j7571n497N554R644
2626E2972397O004j373m410O043L4286P4051J09406J24496J14723Q9741O5178N1819
2637.6E3642361N2009O4194Q7326J19129J51375J70734J66443J38424R7866O0093L6598
2648.2E4786552L1510M2469O3038Q4938J00525J04961R6977P9026N6610L7033K5707
2658.8E5509346K1629J6064k518m0310r3284j48953j91963k09911j98166j63738j25023
2669.4E4373173j02314j03218j14491j12209q3183l8880o161k346j8520k7355q400
$$ plain form
2591.3 52418716 52469368 52529270 52567162 52569771 52540966 52490906 52431107 52376839 52346481 52350685 52380791 52411499
2602.9 52411499 52418888 52398144 52365234 52342941 52346695 52381119 52444389 52530376 52626160 52712547 52773083 52805923
2614.4 52805923 52826344 52854874 52900635 52954155 52995747 53011230 53001579 52980267 52962696 52957199 52962753 52972397
2626 52972397 52978401 52977028 52972618 52978661 53012947 53086998 53196404 53320900 53435623 53525364 53590542 53642361
2637.6 53642361 53694370 53758564 53845890 53965019 54116394 54287128 54453571 54591995 54689861 54749954 54786552
2648.2 54786552 54818062 54860531 54923569 55008507 55109032 55213993 55310970 55389996 55446606 55483639 55509346
2658.8 55509346 55530975 55547039 55544521 55504211 55410927 55261974 55070011 54860100 54661934 54498196 54373173
2669.4 54373173 54270859 54167641 54053150 53940941 53857758 53818878 53812717 53810371 53791851 53764496 53756096
2680E3756096L3935P5451R4326Q8028P0423N4787M1367K1816o893l5477n0445m8443
2691.6E4094971m0516m1558n6140p4578q2268p1132m2900n009L3550O3137P3929O1020
2703.1E3912506L0068k953k0733j6006L845K2545K6420J3504o599k0760k1606j0422
2714.7E3909809P912L0571N6190P9449Q9729P9132N3074L0110K8469N0914Q2688J03771
2726.3E4601818J02894Q2123N2162K5997J4130J9855L5240M3881L3035O180j8112k2373
2737.9E4976830p290Q255M982j7979m1580m3698j8642J7929M2522M2992K6917J3324
2749.4E5004562J5385L0567M6013N2494N2391N4634O3587P5284Q3519Q7745R2087R8034
2761E5756302J00574R3228P5531N3936L5743K4403K0889K6097L9070N2574N5481M3610
$$ plain form
2680 53756096 53790031 53865482 53959808 54047836 54118259 54173046 54214413 54236229 54229336 54193859 54143414 54094971
2691.6 54094971 54054455 54012897 53956757 53882179 53799911 53728779 53685879 53680870 53714420 53777557 53851486 53912506
2703.1 53912506 53942574 53939621 53918888 53902882 53906727 53929272 53955692 53969196 53962597 53941837 53920231 53909809
2714.7 53909809 53917721 53948292 54004482 54083931 54173660 54252792 54305866 54335976 54364445 54415359 54498047 54601818
2726.3 54601818 54704712 54786835 54838997 54864994 54879124 54898979 54934219 54978100 55011135 55017315 54999203 54976830
2737.9 54976830 54969540 54977795 54982777 54964798 54923218 54879520 54860878 54878807 54921329 54964321 54991238 55004562
2749.4 55004562 55019947 55050514 55096527 55149021 55201412 55256046 55319633 55394917 55478436 55566181 55658268 55756302
2761 55756302 55856876 55950104 56025635 56079571 56115314 56139717 56160606 56186703 56225773 56278347 56333828 56377438
2772.6E6377438K8339L0189O0830J10561J55235J76350J74149J62288J52786J48255
2782.2E7576420J47297J51443J63357J78867J86409J77082J54148J29174J09649R3182
2791.9E9067028P6046O3725O7665Q9454J12324J12774Q1642L2284j2768m1222n6495
2802.5E9592457o7833p9426r0050r8270j03253j01745q9546p0031n8746p4512j22555
2813.1E8636490j86398k38048k57622k44366k11506j72493j32396q9913m4517p25L4878
2823.7E7093384O0077P9438R9289J18461J25641J08132O6616K0721k640R724M5246
2834.3E7824089P3807O8981K5398m0016j00697j35974j39309j17249q2813m8779k3288
2844.9E7304150q404j57Q992K4315M2827N3322M5834K3784M631N776K7378N1166N7179
$$ plain form
2772.6 56377438 56405777 56435966 56496796 56607357 56762592 56938942 57113091 57275379 57428165 57576420
2782.2 57576420 57723717 57875160 58038517 58217384 58403793 58580875 58735023 58864197 58973846 59067028
2791.9 59067028 59143074 59206799 59274464 59363918 59476242 59589016 59670658 59702942 59690174 59648952 59592457
2802.5 59592457 59524624 59445198 59355148 59256878 59153625 59051880 58962334 58892303 58833557 58759045 58636490
2813.1 58636490 58450092 58212044 57954422 57710056 57498550 57326057 57193661 57103748 57059231 57058506 57093384
2823.7 57093384 57153461 57232899 57332188 57450649 57576290 57684422 57751038 57771759 57769119 57778843 57824089
2834.3 57824089 57897896 57966877 57992275 57952259 57851562 57715588 57576279 57459030 57376217 57327438 57304150
2844.9 57304150 57295746 57295589 57304581 57328896 57371723 57425045 57470879 57494663 57499294 57505070 57532448 57583614 57640793
2857.4E7640793M1126J5011o882j7887j5716M177M4204R3590J28651J31199J08020
2868.1E8166286Q8120R7805J37897J84617K09957K00855J62819J12785P0164M8508
2877.7E9479813M7001M7405K5161k9384r8942j51070j66133j53901j42543j51867j77967
2888.3E8527573k03194k16587k21581k23659k15378j78772j05396j2352O5174J00304
2897.9E7316132R5363P6828P0305Q1112R7946J11740J26133J48213J73229J84036J68129
2908.6E8649166J32664R8492P8159O2874L3889j2279n4184o3614l4386Q809L2554K5986
2920.1E8958130R308J1333M0592Q0456J11172J31737J56444J91227K19979K18559J81621
2930.7F0310558J30974R6577R1369J06606J27502J46801J61931J65355J46851J07582
$$ plain form
2857.4 57640793 57681919 57696930 57690048 57672161 57656445 57660622 57704826 57798416 57927067 58058266 58166286
2868.1 58166286 58254406 58352211 58490108 58674725 58884682 59085537 59248356 59361141 59431305 59479813
2877.7 59479813 59526814 59574219 59599380 59569996 59471054 59319984 59153851 58999950 58857407 58705540 58527573
2888.3 58527573 58324379 58107792 57886211 57662552 57447174 57268402 57163006 57150654 57215828 57316132
2897.9 57316132 57411495 57488323 57558628 57639740 57737686 57849426 57975559 58123772 58297001 58481037 58649166
2908.6 58649166 58781830 58880322 58958481 59021355 59055244 59042965 58988781 58925167 58890781 58899590 58932144 58958130
2920.1 58958130 58967438 58978771 59019363 59099819 59210991 59342728 59499172 59690399 59910378 60128937 60310558
2930.7 60310558 60441532 60538109 60629478 60736084 60863586 61010387 61172318 61337673 61484524 61592106
2940.4F1592106O6631M7939N9113Q4316R8320Q5656M7786k643m9832p8674p9285n5076
2952F1816357k6581k1698n5485j17241j78192k13768k21207k17575k21935k38735k55692
2962.6F0048248k56126k33387j94714j52260j11057o6253j2375M5478R1778J13339
2972.2E9272671J12076J04320J06949J25076J51592J76045J90628J88908J64299J15589
2981.8F0708153N4748M196j8783j6770j0005j7220l8822n9857o8428o9492p8548j03165
2993.4F0286007j32034j43795j26118q6456m4735j6426j751J0440L0396N8510Q6563
3004E9920601J05514J11504J05850R1938P4597O2168O4869Q6818J17489J34865J22482
3014.6F0998695Q6762N6156N8670R7076J45195J69117J53923J11859O8004L9517K6821
$$ plain form
2940.4 61592106 61658737 61706676 61765789 61850105 61948425 62034081 62081867 62079224 62029392 61950718 61871433 61816357
2952 61816357 61789776 61768078 61712593 61595352 61417160 61203392 60982185 60764610 60542675 60303940 60048248
2962.6 60048248 59792122 59558735 59364021 59211761 59100704 59034451 59022076 59067554 59159332 59272671
2972.2 59272671 59384747 59489067 59596016 59721092 59872684 60048729 60239357 60428265 60592564 60708153
2981.8 60708153 60762901 60767097 60748314 60731544 60721539 60704319 60665497 60605640 60537212 60467720 60389172 60286007
2993.4 60286007 60153973 60010178 59884060 59797604 59752869 59736443 59734692 59745132 59775528 59834038 59920601
3004 59920601 60026115 60137619 60243469 60335407 60410004 60472172 60537041 60623859 60741348 60876213 60998695
3014.6 60998695 61085457 61141613 61200283 61297359 61442554 61611671 61765594 61877453 61945457 61984974 62011795
3025.2F2011795K0371J2157J072r754j8673k8725m5833p2361j00522j11801q7345k4078
3036.8F1546303N6984J19808J36181J04297M8321n95k5009k7958k3369k2579k9484
3047.4F1882900m5078p2098j11431j54602j83872j84769j61007j35494j32027j52996
3057.1F0549526j74354j64715j11992l3543L8548Q2592J00456J09669J24904J46256
3066.7F0667347J62582J63964J51039J33522J20632J12038R7911O8310K4082k2056
3076.4F1679371n7461q3897j18759j77303k50431l01224k89131k03114p4104M6684
3086F0170631J24203J58852J74038J89167K05604K15267K16107K15732K21909K33883
3095.6F2125393K44862K49095K43748K25319J89304J37444Q2912M4434L1948L8258
$$ plain form
3025.2 62011795 62032166 62044323 62045395 62035641 62016968 61988243 61942410 61870049 61769527 61657726 61570381 61546303
3036.8 61546303 61603287 61723095 61859276 61963573 62011894 62011299 61986290 61958332 61934963 61912384 61882900
3047.4 61882900 61837822 61765724 61654293 61499691 61315819 61131050 60970043 60834549 60702522 60549526
3057.1 60549526 60375172 60210457 60098465 60064922 60103470 60186062 60286518 60396187 60521091 60667347
3066.7 60667347 60829929 60993893 61144932 61278454 61399086 61511124 61609035 61677345 61701427 61679371
3076.4 61679371 61621910 61538013 61419254 61241951 60991520 60690296 60401165 60198051 60123947 60170631
3086 60170631 60294834 60453686 60627724 60816891 61022495 61237762 61453869 61669601 61891510 62125393
3095.6 62125393 62370255 62619350 62863098 63088417 63277721 63415165 63498077 63542511 63574459 63612717
3105.3F3612717M5429L8727J5560j5663m2538n4707m8763l1200j6937j9909m2218p2002
3116.9F3368496r3929j01738j00178r5505q6216o4369k4773K8668Q4804J30410J53869
3127.5F3199539J47740J13433O5266K6409J5454L4126O7505R6699J11454J11591R9262
3138.1F4088478P3586L4736q804m0077m4075j9989J6365M3236M8377L6744K4551K4399
3149.6F4277527L4492M0535K9366J839k7085m0703l4446j7891m463L0o71l13L525R552
3163.1F4271294J6624K3903K8023K2995N737j8463l7994m3114l1677p904K1934M9156
3174.7F4300514O1585M8446J2413k5207l7399j4977K2698M3357L1021n64k3140k1164
3186.3F4397583l738Q491M608q873j8051j5480m448P157J3519J2672N402n966j8143
$$ plain form
3105.3 63612717 63658146 63696873 63712433 63696770 63654232 63599525 63550762 63519562 63502625 63482716 63440498 63368496
3116.9 63368496 63274567 63172829 63072651 62977146 62890930 62826561 62801788 62830456 62915260 63045670 63199539
3127.5 63199539 63347279 63460712 63525978 63552387 63567841 63601967 63669472 63766171 63877625 63989216 64088478
3138.1 64088478 64162064 64196800 64187996 64147919 64103844 64083855 64100220 64143456 64191833 64228577 64253128 64277527
3149.6 64277527 64312019 64352554 64381920 64383759 64356674 64315971 64281525 64263634 64259171 64259201 64258530 64258217 64261742 64271294
3163.1 64271294 64287918 64311821 64339844 64362839 64368576 64350113 64312119 64269005 64237328 64229424 64251358 64300514
3174.7 64300514 64362099 64410545 64422958 64397751 64360352 64345375 64368073 64411430 64442451 64441887 64418747 64397583
3186.3 64397583 64393845 64402336 64406944 64398071 64380020 64364540 64360092 64367249 64380768 64393440 64398842 64392876 64374733
3198.8F4374733k8763l7842m5509m8050l8200j2314K1133M3145L8169Q835k3010l2997
3210.4F4219330j3779J9997M5173M8027L0060k3l5247o9146q9691q1154l7796K4681
3222F4060432P4769Q6746N8410R011l8369p0648q4289p6996m7081j797L7991M8073
3233.5F4056252J9973k9258o8100p3441m6574r117J4679J4118n142k9403m6696n0533
3245.1F3746758l8949j4404J4763L5439L6735J8719o973k6219l3783l5766m1344n3749
3256.7F3601227o8440p8010p6599o1108l3257k418J6602J3748n921k4864k9217k1305
3268.3F3230438j3931j2913r147Q861L7388N6290M7096J0059l7128p4314r0119q2210
3279.8F3070370n4371j8143O954K941l1280p5714j02417r5352n8651j0044K9884M4193
$$ plain form
3198.8 64374733 64345970 64308128 64262619 64214569 64176369 64164055 64185188 64228333 64266502 64275337 64252327 64219330
3210.4 64219330 64205551 64225548 64270721 64318748 64348808 64348785 64313538 64244392 64154701 64073547 64035751 64060432
3222 64060432 64135201 64221947 64280357 64289368 64250999 64180351 64096062 64019066 63971985 63970188 64008179 64056252
3233.5 64056252 64076225 64046967 63978867 63905426 63858852 63849735 63864414 63878532 63873390 63843987 63797291 63746758
3245.1 63746758 63707809 63693405 63708168 63743607 63780342 63799061 63792088 63765869 63732086 63696320 63654976 63601227
3256.7 63601227 63532787 63454777 63378178 63317070 63283813 63281395 63297997 63311745 63305824 63280960 63251743 63230438
3268.3 63230438 63216507 63203594 63194447 63203308 63240696 63296986 63344082 63354141 63317013 63242699 63152580 63070370
3279.8 63070370 63015999 62997856 63004810 63007751 62976471 62900757 62798340 62702988 62644337 62634293 62664177 62708370
3291.4F2708370K4368k2476p0842q8940o2420q484L5355M0157N798m3911q2912r8919
3303F2335144r3140p2113m3983k0435j4901l3561o6674r2235r1145o2507k5296n211
3314.6F1713943j6895n4260r4528j12656r6966n6129j3855O286n298m0199p9529j05656
3326.1F1044258j10191r5448p2021n3974n1167o2214p4653p6687o9466o5834p3551
3336.7F0239052q1719p0140l5069j728m177m9999j08700j39141j28052r9228q5873
3347.3E9435226r8243j19767j29360j20815j01070p7912n6026m2683m8401p6263j12992
3357.9E8451694j35536j29829j02249p3399o0879o7707q3473r3693q9073p0522m8596
3368.6E7496738l7204m4884o9252r9167j22105j30432j22959j03405p8064n4077l7750
$$ plain form
3291.4 62708370 62732738 62710262 62639420 62550480 62488060 62479576 62514931 62555088 62560886 62516975 62434063 62335144
3303 62335144 62242004 62169891 62125908 62105473 62090572 62057011 61990337 61898102 61806957 61744450 61719154 61713943
3314.6 61713943 61697048 61642788 61548260 61435604 61338638 61282509 61268654 61274940 61269642 61229443 61149914 61044258
3326.1 61044258 60934067 60838619 60766598 60712624 60661457 60599243 60524590 60447903 60378437 60312603 60239052
3336.7 60239052 60157333 60087193 60052124 60050396 60046219 59996220 59887520 59748379 59620327 59521099 59435226
3347.3 59435226 59336983 59217216 59087856 58967041 58865971 58788059 58732033 58689350 58640949 58564686 58451694
3357.9 58451694 58316158 58186329 58084080 58010681 57949802 57882095 57798622 57704929 57615856 57545334 57496738
3368.6 57496738 57459534 57414650 57345398 57246231 57124126 56993694 56870735 56767330 56689266 56635189 56597439
3379.2E6597439l3833m6344p7271j21605j63013j79062j56891j05812n2525j9756q358
3389.8E5632969r69J6293L6712L7926L750n8895j23108j61145j61827j33339r2563
3400.4E4995804n3246k2064l235k216k2354n7183q9130r9728q3995n4097k7851j3729
3412E4466976q110n844q823k1054l7525m4651l6133k5306l4184o7024r8046r2830m4228
3424.5E3943218J5591M3026K3174j9230m7741m8530l5027k4170j6372k427J6221K3716
3436.1E3871449R170j6136k7329j2676J2783K3304Q843j6728l2902l2077k0710n131
3447.6E3761860J6670M7405P9071R4651Q2904M9859J4465o706r816j461J0323K1252
3459.2E4160477K8900L0166K3205J2062O455J4305L3321N0873N4325M2496K7122K1950
$$ plain form
3379.2 56597439 56563606 56517262 56439991 56318386 56155373 55976311 55819420 55713608 55661083 55641327 55632969
3389.8 55632969 55632000 55648293 55685005 55722931 55726681 55667786 55544678 55383533 55221706 55088367 54995804
3400.4 54995804 54942558 54920494 54917259 54915043 54892689 54835506 54746376 54646648 54562653 54508556 54480705 54466976
3412 54466976 54458866 54453022 54444199 54423145 54385620 54340969 54304836 54279530 54245346 54178322 54080276 53987446 53943218
3424.5 53943218 53958809 54001835 54025009 54005779 53958038 53909508 53874481 53850311 53833939 53831512 53847733 53871449
3436.1 53871449 53880619 53864483 53837154 53824478 53837261 53860565 53869408 53852680 53819778 53787701 53766991 53761860
3447.6 53761860 53778530 53825935 53905006 53999657 54082561 54132420 54146885 54140179 54130363 54128902 54139225 54160477
3459.2 54160477 54189377 54219543 54242748 54254810 54261265 54275570 54308891 54359764 54414089 54456585 54483707 54505657
3470.8E4505657L0422M4445N4436N9078O3385O8112O4255M1839M791k5337k4254J3813
3482.3E4900642O8848J09497J15921R0504N0159J1677j5095k4589j3840J3302M2782
3493E5349808N7651N1758L5221K3567K2522K5494K6207K9083M2919O5960Q2562P8636
3504.5E5891388N8960M5048N4138Q0913J00628R0088M6162j2211n6458o4689l2601
3515.1E6201366K4689P9807J07098R5421N3593N535k0520m917N1728J23535J69319
3525.7E6886654J57867R2461J2684l2917k2045K8537Q1204J07887J04832Q4904O1031
3536.4E7563099L8803K0428J0608J5370L5141N9532P0660N5465J8353j7067k2404J3817
3547.9E7861805P4974J26717J40396J10752N5652K686k4769j6067K2545O9206R7282
$$ plain form
3470.8 54505657 54536079 54580524 54634960 54694038 54757423 54825535 54889790 54931629 54936420 54911083 54886829 54900642
3482.3 54900642 54969490 55078987 55194908 55285412 55335571 55347248 55332153 55307564 55293724 55307026 55349808
3493 55349808 55407459 55459217 55494438 55518005 55540527 55566021 55592228 55621311 55664230 55730190 55812752 55891388
3504.5 55891388 55950348 55995396 56049534 56130447 56231075 56321163 56367325 56355114 56298656 56233967 56201366
3515.1 56201366 56226055 56305862 56412960 56508381 56561974 56567509 56546989 56542072 56593800 56717335 56886654
3525.7 56886654 57044521 57136982 57149666 57116749 57094704 57123241 57204445 57312332 57417164 57502068 57563099
3536.4 57563099 57601902 57622330 57632938 57648308 57683449 57742981 57813641 57869106 57887459 57870392 57847988 57861805
3547.9 57861805 57936779 58063496 58203892 58314644 58370296 58372982 58348213 58332146 58354691 58423897 58521179
3558.5E8521179R3537O9667N2815O0242Q1729Q9024O4579K0962r518m772K7283N8098
3570.1E9124825O6719N8239N5637P4402J06144J26365J17337Q3774M8191L3402M8271
3580.7E9943306Q5522J26964J49578J33190P3235r014p1354p6305j9455O4441J26793
3591.3F0526901J41186J19705R6813R8221J21643J42624J36429R7034M1039l391j4260
3601.9F1503944J0739N2494Q2912Q3996O0246L3317K2431K7580L2318K4662J4690K7295
3613.5F1976624P3310J29189J51691J17897N0675P2j781L5190P9060J12625J41133
3624.1F2865685J64543J56887Q8711k7161j25347j37104n4409N9112J24485J13850
3633.8F3229252O2103K0889J0056J3908J4218J4175K8423N7774Q2863Q4953O7860N3959
$$ plain form
3558.5 58521179 58614716 58684383 58737198 58797440 58879169 58968193 59032772 59053734 59044216 59039444 59066727 59124825
3570.1 59124825 59191544 59249783 59305420 59379822 59485966 59612331 59729668 59813442 59861633 59895035 59943306
3580.7 59943306 60028828 60155792 60305370 60438560 60511795 60502781 60431427 60355122 60335667 60400108 60526901
3591.3 60526901 60668087 60787792 60884605 60982826 61104469 61247093 61383522 61480556 61521595 61518204 61503944
3601.9 61503944 61514683 61567177 61650089 61734085 61794331 61827648 61850079 61877659 61909977 61934639 61949329 61976624
3613.5 61976624 62049934 62179123 62330814 62448711 62499386 62499458 62497677 62532867 62611927 62724552 62865685
3624.1 62865685 63030228 63187115 63275826 63248665 63123318 62986214 62931805 62990917 63115402 63229252
3633.8 63229252 63291355 63312244 63322300 63336208 63350426 63364601 63393024 63450798 63533661 63618614 63686474 63740433
3645.3F3740433N7411O4918M7856l143n8808p2857k7897M1344P6611N1567k743k9877
3656.9F3884815l711M9903Q3550P2311K7314k3346n4734m9816l780O2996J04393Q2985
3668.5F4232880J4061l7201k0455L8063N4512k0713j37398j86356j09539L8437J42864
3679.1F4009155J37413N5374j8669l2234K541M2831O2607O2790N0682K5558j3076n1545
3690.6F4333427o6543m5487j083L6858M6585L2440J8135K0737L1036K3148j4359n9845
3702.2F4355049p5493m5723M875L4379K2384j6220n2597p1693p5844o9115m8004r819
3713.8F3952179L7472P9227J05591J13449R9281N8159m570o6025r8457r1965o2004
3724.4F4122337l2020j2116L228J9493L0952K6817M280k6847n0728n4337l3565K872
$$ plain form
3645.3 63740433 63797844 63862762 63910618 63907475 63848667 63775810 63747913 63789257 63865868 63917435 63914692 63884815
3656.9 63884815 63881104 63931007 64014557 64086868 64114182 64090836 64036102 63986286 63982506 64045502 64149895 64232880
3668.5 64232880 64246941 64209740 64189285 64227348 64281860 64261147 64123749 63937393 63827854 63866291 64009155
3679.1 64009155 64146568 64201942 64183273 64151039 64153580 64196411 64259018 64321808 64372490 64398048 64384972 64333427
3690.6 64333427 64266884 64221397 64220314 64257172 64303757 64336197 64354332 64375069 64406105 64429253 64414894 64355049
3702.2 64355049 64279556 64233833 64238708 64273087 64295471 64279251 64226654 64154961 64079117 64010002 63961998 63952179
3713.8 63952179 63989651 64068878 64174469 64287918 64387199 64445358 64440788 64374763 64276306 64184341 64122337
3724.4 64122337 64090317 64078201 64081429 64100922 64131874 64158691 64162971 64136124 64085396 64031059 63997494 64000366
3736F4000366L5523M8118M4899M9187P4768R8450P4363j2428j10260j35803n6824O4095
3747.5F4174454J20292O0662o4308j56289j60209r8370k5818K6787N9834P4340O1326
3758.2F4072701K5947J259J6807N6099O5506J6373n1765o6628l113Q3573J11923N4810
3769.7F4383492m0276j05553j14296q7112n2826k0172J2146L3722K5512j6075o6528
3780.3F3952034r1064p4498l1845Q957L2234M2591N0930N6809M8191J9867j1932k0859
3791.9F3981415M9K5860K4536o042l6240m5479n4752j01208j77704k15820j50478j118
3803.5F3243019J28712J46221N9765l3989m9103J4763R3258J31557J21281P6160M170
3814.1F3935814p9079j27144q8409L0590J43459J50612L6011j11061j78002j29890
$$ plain form
3736 64000366 64035889 64084007 64128906 64178093 64252861 64351311 64425674 64413246 64302986 64167183 64110359 64174454
3747.5 64174454 64294746 64355408 64291100 64134811 63974602 63876232 63850414 63877201 63937035 64011375 64072701
3758.2 64072701 64098648 64099907 64116714 64172813 64238319 64254692 64202927 64136299 64133186 64216759 64328682 64383492
3769.7 64383492 64343216 64237663 64123367 64036255 63983429 63963257 63975403 64009125 64034637 64018562 63952034
3780.3 63952034 63860970 63786472 63754627 63763584 63795818 63838409 63889339 63946148 63994339 64014206 64002274 63981415
3791.9 63981415 63981464 64007324 64031860 64025818 63989578 63944099 63889347 63788139 63610435 63394615 63244137 63243019
3803.5 63243019 63371731 63517952 63577717 63543728 63494625 63509388 63602646 63734203 63855484 63931644 63935814
3814.1 63935814 63856735 63729591 63641182 63671772 63815231 63965843 64001854 63890793 63712791 63582901
3823.7F3582901k6756M9370P0102O1524M9106K3533l3207j03164j33141q6979R575
3834.3F3462864Q4576Q2882J2725o8218j07689r7549o4720l3467m390L2150P0507Q7532
3845.9F3457203O9267L5042K5024N6336R3422P3166k9911j63254k31506j81519n3837
3856.5F3149433N5908Q7262O2049M0760M3969L3035k8423j11393j39786p5234L1044
3867.1F3148624Q5606M9530k4517n5286k2126K2038K3388n398m437N2056J13537J04782
3878.7F3487797J4728q2306j02287m0619K5601K5093l0197o5049l2825K7840L6579
3889.3F3264355l6103j32076j64169j03108j632O0798M8577j0723o1402o4384j6773
3899.9F2783360N3821J06796J10226O1199r624n8640o1111k6154J7616M7097N5954
$$ plain form
3823.7 63582901 63556145 63605515 63675617 63737141 63786247 63809780 63776573 63673409 63540268 63453289 63462864
3834.3 63462864 63547440 63630322 63643047 63574829 63467140 63369591 63304871 63271404 63267014 63299164 63369671 63457203
3845.9 63457203 63526470 63561512 63586536 63642872 63736294 63809460 63779549 63616295 63384789 63203270 63149433
3856.5 63149433 63205341 63292603 63354652 63395412 63439381 63472416 63443993 63332600 63192814 63117580 63148624
3867.1 63148624 63234230 63283760 63259243 63203957 63181831 63203869 63227257 63221859 63217422 63269478 63383015 63487797
3878.7 63487797 63502525 63420219 63317932 63277313 63302914 63328007 63297810 63232761 63199936 63227776 63264355
3889.3 63264355 63228252 63096176 62932007 62828899 62827267 62888065 62936642 62925919 62864517 62800133 62783360
3899.9 62783360 62837181 62943977 63054203 63115402 63105778 63047138 62986027 62959873 62977489 63024586 63080540
3910.5F3080540M7714K6337m609l8883o8733q8100r2038p4306l1769K5906P3524Q4416
3922.1F2939999N1971j663m0379m2137j6094O752K075k5291m6898l9742r227J7650
3933.7F2797016K1004O225p007p824j423L391M540K155o840k1366k7683j0654K2552
3946.2F2774086M0367J8501k9487o3030n7290k6622l456l048j6930l2978m7226n5031
3957.8F2497856m5112j3279K5371M8382M7844L1570N089l2120o9084p9174m9381n421
3969.3F2362541J2676J00q152R792K6348K293n2674q7825q0323o2736o6109o8600l7193
3981.9F1950138m81k3346j00906j39248q5678k8854q6964k12627k24678q7494l7983
3992.5F0921879K15431K21378K10923J84082J40842Q1200N165q7261
$$ plain form
3910.5 63080540 63128254 63154591 63149982 63111099 63042366 62954266 62862228 62787922 62756153 62782059 62855583 62939999
3922.1 62939999 62991970 62990307 62949928 62907791 62891697 62898449 62900524 62875233 62828335 62788593 62779366 62797016
3933.7 62797016 62818020 62824245 62817238 62809414 62807991 62811382 62815922 62818077 62811237 62789871 62762188 62751534 62774086
3946.2 62774086 62814453 62832954 62803467 62740437 62683147 62656525 62653069 62650021 62633091 62600113 62552887 62497856
3957.8 62497856 62452744 62439465 62464836 62513218 62561062 62592632 62597721 62565601 62496517 62417343 62367962 62362541
3969.3 62362541 62375217 62375317 62367165 62376957 62403305 62405598 62352924 62265099 62184776 62122040 62055931 61987331 61950138
3981.9 61950138 61949657 61926311 61825405 61686157 61600479 61571625 61484661 61272034 61047356 60959862 60921879
3992.5 60921879 61137310 61358688 61569611 61753693 61894535 61975735 61980900 61893639
4000.2F1893639
$$ plain form
4000.2 61893639
##END=$$ End of the data block
