##TITLE=$$ Begin of the data block
##JCAMP-DX=5.00 $$ ACD/SpecManager v 10.08
##SPECTROMETER/DATA SYSTEM=Varian
##DATE=16 Apr 2013 13:34:50
##DATA TYPE=INFRARED SPECTRUM
##DATA CLASS=XYDATA
##ORIGIN=
##OWNER=
##NPOINTS=3735
##FIRSTX=399.26403809
##LASTX=4000.35498047
##MAXX=4000.35498047
##MINX=399.26403809
##MAXY=84.87736511
##MINY=23.56367302
##XFACTOR=1.0000000000
##YFACTOR=0.000000100000000
##FIRSTY=30.85453796
##DELTAX=0.96440572
##XUNITS=1/CM
##YUNITS=TRANSMITTANCE
##XYDATA=(X++(Y..Y))
399.3C08545380P7418785O7095527O8644295Q1588173R2968369Q6990814N6637726
406H39889069Q884582l9310531p0907136p8257904o6580467m9313698l8229942l5175018
413.7D70998955l1836853j7983055Q636360L9259720O0421638O3672676N0295983K8206100
421.4F71671524N660248j2057266k1856995k1839294j2949143j012916N423316J811219
429.2F14850693p028427r442788L036232K6648064M6316185M7020111K6281662l285675
436.9G44396057k3914184k6535798j6551208o978912n915604r993973r309692J710434
444.6F46907120J8216781K9054413K6492462J2196732n270004j7685547k1875229j8775711
452.3F69261017j0013962L321228J8959274L2015152L6561737K9213105J1521988j0544205
$$ y = [308545380, 385964165, 453059692, 521703987, 603292160, 696260529, 783251343, 839889069, 848773651, 809463120, 738555984, 660298080, 593717613, 544403915, 506173973, 470998955, 439162102, 421179047, 429815407, 469075127, 529496765, 593169441, 643465424, 671671524, 677331772, 665274506, 643417511, 621578217, 608629074, 607616158, 613039474, 614850693, 607822266, 598379478, 601415710, 628063774, 674379959, 721400070, 747681732, 744396057, 720481873, 693946075, 677394867, 670415955, 664500351, 654506378, 645196686, 646907120, 665123901, 694178314, 720670776, 732867508, 727597504, 709911957, 688036728, 669261017, 659247055, 662568283, 681527557, 713542709, 750104446, 779317551, 790839539, 780295334]
460G80295334k9154358l7575760l2890167j7911911o63300R921112J0119553M239120
467.7F86379623N73044L369065Q559722Q163834n33371j0582962j1147079J636200
475.5F86418076J9640731K9172745K3004456O479568p945175j1971588p577591k907410
483.2G34313812l256149o644058p706070m662094j442108k908173q798218j3241272
490.9F85655670j0517044r84268R022446J3128433J0523987N726318L304520L426361
498.6G19286423K712173j101455o114808q124160n154190L41491L853531L078919l06244
507.3G08471680k762299k263031M51889L383637N365066O562348P395172P459793N598144
516G39662399Q96225o279678j3874970j8731613j8291626j2758560n955582l267822
$$ y = [780295334, 751140976, 713565216, 680675049, 662763138, 662099838, 672020950, 682140503, 686379623, 686952667, 690321732, 698881454, 707045288, 706511917, 695928955, 684781876, 686418076, 706058807, 735231552, 758236008, 764715576, 756770401, 744798813, 737221222, 734313812, 731057663, 724413605, 716707535, 712045441, 710603333, 707695160, 698896942, 685655670, 675138626, 674154358, 683176804, 696305237, 706829224, 712555542, 715860062, 719286423, 721998596, 720897141, 714782333, 706658173, 701503983, 701845474, 705699005, 708777924, 708471680, 705709381, 703446350, 703898239, 707281876, 712646942, 719209290, 726604462, 734064255, 739662399, 740558624, 734278946, 720403976, 701672363, 683380737, 670622177, 664666595, 661398773]
523.7F61398773p378464j5226478j9533157j4425774n55878J4972000K3947602K2963943
531.4F66162567J4980469O005325O00281p6981K651825O565247R262314Q620071L990097
540.1G18761215k602081p105637o313018p02668N537720P637329L872910l329773r458466
548.7G06297531j1162491q196563l048478J046982K277527J303635N37414K024842
556.5F91080399N452575Q032990O656799O46286p299881j2850571j2983474p766877
564.2F70968246O5155O935349J0226517R309692N668182K015229N11627J098862J525268
572.9G08324127n08652m865646q729629r120255n722656j084442J934509K581863J968384
581.5F84777603R16596j082917m375381p201386o370086n63584P278824J1690979R421845
$$ y = [661398773, 654020309, 638793831, 619260674, 604834900, 604279022, 619251022, 643198624, 666162567, 681143036, 687148361, 687748642, 687671661, 690323486, 696888733, 706151047, 714771118, 718761215, 716159134, 709053497, 702740479, 702037811, 707575531, 715212860, 719085770, 715755997, 706297531, 695135040, 686938477, 683889999, 684936981, 687214508, 688518143, 689055557, 691080399, 696532974, 704565964, 711222763, 711869049, 704569168, 691718597, 678735123, 670968246, 671033401, 677968750, 688195267, 697504959, 703173141, 705188370, 705699997, 706798859, 708324127, 707815475, 702949829, 694220200, 685099945, 679377289, 678292847, 680227356, 682809219, 684777603, 685694199, 684611282, 680235901, 673034515, 666664429, 666100845, 673379669, 685070648, 694492493]
590.2F94492493K591934l033447l069611J953049P619476R716110P317200K505188
597.9G20092392k057343m938278n885391m963226k351685J122894L833695M225693
605.6G09078751K038345j346512l823242l977356j911240R60770K835693K551422K43912
614.3G06650543k679901m339294l598328r20486J871643K891082J581726r02023k634353
623F97920609k383347m29153J812057K915726K400131Q72345n65186j094665n98831
631.7G00849686M76532J563491K284241K404862J651535j74027k690658m612656m328232
640.4F97424774j287002K993011N590668M359894k09656n319672q241043q504181p779007
649F79027786p724533q205871p762452n592117k594223k31171J349259L510589P246018
$$ y = [694492493, 697084427, 694050980, 690981369, 692934418, 700553894, 710270004, 717587204, 720092392, 718035049, 713096771, 707211380, 702248154, 699896469, 701019363, 704853058, 709078751, 711117096, 709770584, 705947342, 701969986, 700058746, 701019516, 703855209, 706406631, 706650543, 703970642, 699631348, 696033020, 695112534, 696984177, 699875259, 701456985, 700554962, 697920609, 695537262, 695108109, 696920166, 699835892, 702236023, 703108368, 702543182, 701448517, 700849686, 701326218, 702889709, 705173950, 707578812, 709230347, 709056320, 706365662, 701753006, 697424774, 696137772, 699130783, 704721451, 709081345, 708871689, 703552017, 695310974, 686806793, 679027786, 671303253, 663097382, 655334930, 649742813, 647148590, 646917419, 648266678, 651777267, 659023285]
657.7F59023285J1440658J3528977J2044372Q231888M803849L158035K168808r8343
665.4G14301529l744431o529846o138305k707978J150437K836609K063217O60247L77732
674.1G02269211J170578J631927P82166q42743j799545j167527O97861K590790L385544
682.8G08718262K647400P35168j390533k571488k101974l21198J446991J819000M50821
691.5G09432449j708984l279724l572006k892838j903839r14612R0256R12094R82895
700.2F97145691m1275j620789k542419j993485m18853Q08715O57654o14776j766816
708.8F89613647j781463p62100K88314M60358l07922j329117j874313j774598j462020
717.5F81070786j528016k194671l071213l378220k557067q81348M79812K04926k048721
$$ y = [659023285, 670463943, 683992920, 696037292, 704269180, 709073029, 712231064, 714399872, 714301529, 710557098, 704027252, 697888947, 695180969, 696331406, 699168015, 701231232, 701891479, 702269211, 703439789, 705071716, 705853882, 705011139, 703211594, 702044067, 702741928, 705332718, 708718262, 711365662, 712100830, 710710297, 708138809, 706036835, 705715637, 707162628, 708981628, 709432449, 707723465, 704443741, 700871735, 697978897, 696075058, 695160446, 695250702, 696162796, 697145691, 697104416, 695483627, 692941208, 690947723, 690528870, 691337585, 691995239, 691380463, 689613647, 687832184, 687070084, 687358398, 687818756, 687510834, 686181717, 684307404, 682532806, 681070786, 679542770, 677348099, 674276886, 670898666, 668341599, 667460251, 667940063, 668144989, 666096268]
726.2F66096268n086212o870118o112747l466415j177826j333313m143524p769661
733.9F30136452r888497r616089q130569p566109r386749j3793373k0463371k9374199
741.6E21917496m0352211n1591568n8988114n7817135m6015815k6339112n176811J1334534
749.3B46971264K0799675K4929790K6946297K8683624K9802971K9105034K6046105
756.1D33284760K1025276J4820251Q413391L443489K202073O319427J4964600K4468422
763.8E28941689L0271148K9870262K4346199J7241936J1893158R449082Q894500Q533859
771.5F69441833P418976N700455M038773K851028K008209J065750k66723j793213k890396
780.2F87574692k949524j877976k31704J185150J927795K171707K382584K735596K882156
$$ y = [666096268, 661010056, 654139938, 648027191, 644560776, 643382950, 642049637, 637906113, 630136452, 620247955, 610631866, 602501297, 594935188, 585548439, 571755066, 551291695, 521917496, 481565285, 429973717, 370985603, 313168468, 267152653, 240813541, 235636730, 246971264, 267770939, 292700729, 319647026, 348330650, 378133621, 407238655, 433284760, 454310036, 469130287, 477543678, 480987167, 483189240, 489508667, 504473267, 528941689, 559212837, 589083099, 613429298, 630671234, 642564392, 652013474, 660907974, 669441833, 676860809, 682561264, 686600037, 689451065, 691459274, 692525024, 692258301, 690465088, 687574692, 684625168, 682747192, 682515488, 683700638, 685628433, 687800140, 690182724, 692918320, 695800476]
788.9F95800476K322617J027450l32565q29544o0120J405869K326126J645508p10450
797.6G02595367l702011n807647o001206m410934k217484q60061j121750k790909n207749
806.2F70475616q266754j2909851k0357704l0375709l9978981m4100152l8358802k2188034
814D53939629J35040K1608925L6332474M2224197M0878067L5296898K7797050J9635392
821.7F77847672J1870651N860748K634201J964264K407990K434158J498184K2354j476593
830.4G05063629k974853m635697o196289p005997o788864o195297o363830p844239
838.1F57058563j0033340j1773415j2548485j3133201j5114327j9718246k6788902
844.8E47948647l4445458l9507790l8616752k9824944j3992309N040321K2052765L3065910
$$ y = [695800476, 698123093, 699150543, 698817978, 697988434, 697928314, 699334183, 701660309, 703305817, 702595367, 698893356, 693085709, 687084503, 682673569, 680456085, 679596024, 678474274, 675683365, 670475616, 662208862, 649299011, 628941307, 598565598, 558586617, 514486465, 476127663, 453939629, 454074669, 475683594, 512016068, 554240265, 595118332, 630415230, 658212280, 677847672, 689718323, 695579071, 698213272, 700177536, 702585526, 705019684, 706517868, 706540222, 705063629, 702088776, 697453079, 691256790, 684250793, 677461929, 671266632, 664902802, 657058563, 647025223, 635251808, 622703323, 609570122, 594455795, 574737549, 547948647, 513503189, 473995399, 435378647, 405553703, 391561394, 396601715, 418654480, 451720390]
852.5D51720390L7219467L6558495L4058838L1599197K9372444K6732140K3274384
859.3F70535355J9154281J4747620J0406875O616745M093476L361358M103318N098571
867G38117599N060120L667450J759796M64783J46332K22854m9209p41196j261215j111908
876.7G46275406m94537p4158k02484m92707k51693O88858J634826J586075J74179j919708
886.3G46924057l452606l551178k282257m47312J074219J818924J759033J058579o2409
895G42839050j255951k017898j919556r73663K47268R51233O92139k97699j275635
903.7G36989288j517028q20237L18299R43832J97449k084809n131454p689438r020920
912.3G12184982r648590j0979156j3794937j6841202j7051316j1698875r14001J1681785
$$ y = [451720390, 488939857, 525498352, 559557190, 591156387, 620528831, 647260971, 670535355, 689689636, 704437256, 714844131, 721460876, 725554352, 728915710, 733019028, 738117599, 743177719, 746845169, 748604965, 749069748, 749216080, 749438934, 749389725, 748648529, 747387314, 746275406, 745780869, 745706711, 745504227, 745011520, 744759827, 745448685, 747083511, 748669586, 748843765, 746924057, 743471451, 739920273, 737638016, 737190704, 738264923, 740083847, 741842880, 742901459, 742839050, 741583099, 739565201, 737645645, 736671982, 736919250, 737870483, 738562622, 738264923, 736989288, 735472260, 734652023, 734970322, 735914154, 736111603, 734026794, 728895340, 721205902, 712184982, 702536392, 691557236, 677762299, 660921097, 643869781, 632170906, 631256905, 642938690]
920F42938690K1038284K3924256K0756836J4668121Q869171M668732J581039j111908
927.8G37333221l149414l567733j949540P70188K796402K811126R54667j359635k568054
936.4G32071228k075653n41840P66831R70306J45416q85849j296081r13162l16391
945.1G27924805l57285j501007l459473n322723o061401n083695k547531P09915L576660
953.8G07878265N173417N190200L900147J930847Q469j210328j279907j71356J559448
962.5G22979202K901383K920303J392059r76715k974624l652344k830811j040649R00803
971.2G19618607K252121K485122J377259p95823l150787m504242m089432k166595O8207
979.8G11094437J295776R76181l89862j785736k445297k219696j385193k60697R48716
$$ y = [642938690, 663976974, 687901230, 708658066, 723326187, 732195358, 736864090, 738445129, 737333221, 734183807, 730616074, 728666534, 729436722, 732233124, 735044250, 735998917, 734639282, 732071228, 729995575, 729453735, 730220566, 731190872, 731336288, 730450439, 729154358, 728241196, 727924805, 727567520, 726066513, 722607040, 717284317, 711222916, 706139221, 703591690, 704301605, 707878265, 713051682, 718241882, 722142029, 724072876, 724081345, 722871017, 721591110, 721419754, 722979202, 725880585, 728800888, 730192947, 729216232, 726241608, 722589264, 719758453, 718717804, 719618607, 721870728, 724355850, 725733109, 724937286, 721786499, 717282257, 713192825, 711026230, 711094437, 712390213, 713366394, 712976532, 711190796, 708745499, 706525803, 705140610, 704879913, 705828629]
988.5G05828629K046356K749176K813492K273178J521148J097031J315384K002029
996.2G21646423K530671K177886O28052j669159l596725m006577k546768n8288J885376
1004.9G16990891K055358M57230j692886k881089k357025n33371J468201K617798K503967
1013.6G18629074J356125k25983j554489k074661j582031l76816Q19015J256943O53763
1022.3G16900940n77087j567536j563110m28772J240845K482223K561798J436463k25831
1031G20259933j483078j718521r89837Q6441P79648O65893k11029j433334k409516
1039.6G13546600k602920j787186k37732J329041K151794J917496R32007j93558j035614
1048.3G14019928j540298j777802j648636r67331J41831J068573J120529J96380r74731
$$ y = [705828629, 707874985, 710624161, 713437653, 715710831, 717231979, 718329010, 719644394, 721646423, 724177094, 726354980, 726983032, 725313873, 721717148, 717710571, 715163803, 715105515, 716990891, 719046249, 719503479, 717810593, 714929504, 712572479, 712039108, 713507309, 716125107, 718629074, 719985199, 719759216, 718204727, 716130066, 714548035, 714171219, 714990234, 716247177, 716900940, 716323853, 714756317, 713193207, 712764435, 714005280, 716487503, 719049301, 720485764, 720259933, 718776855, 717058334, 716068497, 716154938, 716934586, 717600479, 717389450, 715956116, 713546600, 710943680, 709156494, 708918762, 710247803, 712399597, 714317093, 715249100, 715055542, 714019928, 712479630, 710701828, 709053192, 708085861, 708227692, 709296265, 710416794, 710613174, 709638443]
1057G09638443j378403n97686P93609J693955J363678m1962j664734k576218k302703
1065.7G04927979r55811R19266K578506L328552K803269J177215q67004k478332l082657
1074.4G08350983k636719j551437m07715L22799M36936N1803m52652o20422k09122
1083G03284454N97306J264572J276855N41230n15824j254730j284638p15484k2888
1091.7G03170853L08685O9504o38962j534729k286682k576676k171859j071396L63617
1100.4F93632355J487503J718216R45511l40195j350937j520004q31528K58560J174011
1109.1F95173492J516571J159211K31552q79059j587982j400604l45917Q51822J205215
1117.7F95924301K69241j402282k675171k821121k150345j681061k230377l883286
$$ y = [709638443, 708260040, 707662354, 708455963, 710149918, 711513596, 711471634, 709806900, 707230682, 704927979, 703972168, 704891434, 707469940, 710798492, 713601761, 714778976, 713911972, 711433640, 708350983, 705714264, 704162827, 703755112, 704077911, 704514847, 704566650, 704113998, 703493576, 703284454, 703881760, 705146332, 706423187, 706964417, 706448593, 705193863, 703909225, 703193741, 703170853, 703479538, 703549042, 702910080, 701375351, 699088669, 696511993, 694340134, 693268738, 693632355, 695119858, 696838074, 697783585, 697443390, 696092453, 694572449, 693740921, 693999481, 695173492, 696690063, 697849274, 698080826, 697201767, 695613785, 694213181, 693867264, 694719086, 695924301, 696193542, 694791260, 692116089, 689294968, 687144623, 685463562, 683233185, 679349899]
1125.5F79349899o286926r181519j2290573j4590225j4081650r021988J6442R272308
1133.2F23185768J3612290J0169487R29870q157081j1167450o242752L438568J2289467
1140.9F38058167J6198501J4677734J0123368N466537K354584R27734O51551J045379
1148.6F89503555J767884K394561K440262J697006M96293m50669n50308K44751J401291
1157.3F98944626K164459K042694J104737p8431q04977o94885O8741Q87145J178513
1166G04812622P75604n340o47660q09783m99726K4872M78287O79321N62515J55716
1175.6G05526428m05884q77761j002503o86188j02920L93982N06668J87836l55835
1184.3G03183823q23365r91516p85598k71531L63388Q31223Q42972K97165n66712j231079
$$ y = [679349899, 673062973, 663881454, 651590881, 637000656, 622919006, 613897018, 613913460, 623185768, 636798058, 646967545, 647897415, 639740334, 628572884, 622330132, 625768700, 638058167, 654256668, 668934402, 679057770, 684524307, 686878891, 687806625, 688458176, 689503555, 691271439, 693666000, 696106262, 697803268, 698299561, 697848892, 697298584, 697543335, 698944626, 701109085, 703151779, 704256516, 704178085, 703373108, 702678223, 702746964, 703634109, 704812622, 705588226, 705582886, 704935226, 704125443, 703625717, 703650589, 704128876, 704808197, 705370712, 705526428, 705120544, 704242783, 703240280, 702554092, 702451172, 702845154, 703351822, 703539658, 703183823, 702360458, 701368942, 700583344, 700311813, 700675201, 701506424, 702349396, 702646561, 702079849, 700848770]
1193.9G00848770j213226m18320P48596J627198J721801R98612j27487j054917j316299
1202.6G01814728p92313K41852J233749J609040J076965j70593j520539k269287k031021
1211.3F99192581r58633L64837J282273J420822Q45261n1804q11310j144714j018143
1220F99121170n87540q6975K30789J03302o69937k039566l528366m306793l642654
1228.6F84593430j479264J332779L457337L927154K798844J073684o8969j06812N68924
1237.3F96097107J120911R91668K77252m90722q59757p70721m60816j51290J19705
1246F95873337L93753O15616O39496M26025J75400J83487N28564R21631R14383K97470
1255.7G00969162o94428j556625j884613j613388r73053l01895R2926p629o85273j843185
$$ y = [700848770, 699635544, 699217224, 699965820, 701593018, 703314819, 704313431, 704185944, 703131027, 701814728, 701022415, 701264267, 702498016, 704107056, 705184021, 705013428, 703492889, 701223602, 699192581, 698233948, 698598785, 699881058, 701301880, 702147141, 702095337, 701284027, 700139313, 699121170, 698533630, 698446655, 698677444, 698780746, 698110809, 696071243, 692542877, 688236084, 684593430, 683114166, 684446945, 687904282, 691831436, 694630280, 695703964, 695634995, 695528183, 696097107, 697218018, 698209686, 698486938, 697996216, 697136459, 696365738, 695904922, 695753632, 695873337, 696267090, 696882706, 697522202, 697948227, 698123627, 698307114, 698835678, 699757309, 700671692, 700969162, 700274734, 698718109, 696833496, 695220108, 694247055, 693945160, 694038086, 694030457, 693345184, 691501999]
1265.3F91501999l256531m717026o088028p137069p320099n903931k557220K047424
1273F56569519O297226Q555756Q267212O290740M150162K863465K369918J946030J078415
1281.7F98388443o4163q83789r54285l60107M41360R88159J067734P33643J89590l29590
1291.3F99216995o42090o73370m71802j82419O257o9886m67376j043091j459046j361007
1301F92853165o63834K95181R36509Q60672J67617o17828r44519o19202J16043Q08182
1310.6F93191986J089249Q44116K17743m82712r40628r85031o65817j92795K10113
1319.3F92286224L96881K83509j71280q95233j632614k085953k264557k670364l939743
1328F79306870o075135p983169p970047n002747K76642N741425R117889R410019P304382
$$ y = [691501999, 688245468, 683528442, 677440414, 670303345, 662983246, 657079315, 654522095, 656569519, 662866745, 671422501, 679689713, 685980453, 690130615, 692994080, 695363998, 697310028, 698388443, 698324280, 697440491, 696486206, 696126099, 696567459, 697555618, 698623352, 699356995, 699546585, 699216995, 698574905, 697901535, 697429733, 697247314, 697253571, 697183685, 696716309, 695673218, 694214172, 692853165, 692189331, 692484512, 693421021, 694281693, 694449310, 693831482, 692886963, 692267761, 692383804, 693191986, 694281235, 695125351, 695343094, 694860382, 693919754, 692934723, 692268906, 692076111, 692286224, 692683105, 692966614, 692795334, 691900101, 690267487, 688181534, 685916977, 683246613, 679306870, 673231735, 665248566, 657278519, 652275772, 652552414, 658293839, 667411728, 676821747, 684126129]
1336.7F84126129M386292J978302N36041j52893m33655m84848l73383k10723j58005
1345.3F89213257l02124n76782q04673q07266n00946M5853O03485Q64105O14853j05591
1355F88244171j018982j805801k309952k548828k536774k155075j252365J09634J547928
1363.7F76273956K556000K848816K529983J932984J314697P13501Q1711m99115p84683
1372.3F86967850n69763P8125P91397J124572Q43735O6681q23364j403656j428833
1381F85646744r40705k29721L26767M78516K44522j10168k67716q4457L21960O85959
1390.7F86071701Q00400O39801L15323m6768l67585n77469n73349k83813K05231O21414
1400.3F86804886O70166K77786l19366p45545p67364m34189K5024L99323N84106N36270
$$ y = [684126129, 688512421, 690490723, 691026764, 690873871, 690440216, 689955368, 689581985, 689371262, 689213257, 688911133, 688334351, 687529678, 686722412, 686221466, 686267319, 686870804, 687734909, 688349762, 688244171, 687225189, 685419388, 683109436, 680560608, 678023834, 675868759, 674616394, 674726028, 676273956, 678829956, 681678772, 684208755, 686141739, 687456436, 688169937, 688251648, 687752533, 686967850, 686398087, 686476212, 687267609, 688392181, 689235916, 689302597, 688479233, 687075577, 685646744, 684706039, 684476318, 684803085, 685281601, 685526123, 685415955, 685148239, 685063782, 685385742, 686071701, 686872101, 687511902, 687827225, 687780457, 687412872, 686835403, 686262054, 685978241, 686183472, 686804886, 687475052, 687752838, 687433472, 686687927, 685920563, 685486374, 685511398, 685910721, 686494827, 687031097]
1409.9F87031097K36435k43454o74667p77588m69665k671K11411l3417n42831r05381
1419.6F83829269q73108n51147k32620r7122j02921j47171k61459o03104j269073k153321
1429.2F77538223k971725l395004l156891k138977m77524J368332K747192L176193
1437F72689819K677842J765975J039505P37839O64520N07508J99737m9591l7384J74485
1446.6F80370255K96478Q0871m57611j066284j458359j493072j212692p60346k80533
1455.3F74018707J26343L88565M34036K03171k83203q69217j315613j463318j356277
1464F69883194j189346j114121j123428j152115j240845j505203j912231k228013k400512
1472.6F56017380l056031n352630r881935j5397187j8752975j6665497q213577L968735
$$ y = [687031097, 687267532, 687024078, 686349411, 685571823, 685102158, 685099487, 685310898, 685277481, 684734650, 683829269, 682956161, 682405014, 682172394, 682075272, 681972351, 681825180, 681563721, 680960617, 679691544, 677538223, 674566498, 671171494, 668014603, 665875626, 665398102, 666766434, 669513626, 672689819, 675367661, 677133636, 678173141, 678910980, 679575500, 680083008, 680282745, 680233154, 680195770, 680370255, 680666733, 680747604, 680289993, 679223709, 677765350, 676272278, 675059586, 674299240, 674018707, 674145050, 674533615, 674967651, 675170822, 674887619, 674018402, 672702789, 671239471, 669883194, 668693848, 667579727, 666456299, 665304184, 664063339, 662558136, 660645905, 658417892, 656017380, 652961349, 647608719, 637726784, 622329597, 603576622, 586911125, 578697548, 582666283]
1480.3E82666283J5014534K0793991K0272369J5562668R954071N720062L308869K035751
1488.1F75328598J193466N36881O3858l06702p06100j093522j239624j004714n71671
1496.7F72200470l39279n70755j178589j851807k336731k549972k464981k012482j202774
1505.4F57693100l36227L4103n08270j823197l221435l991165m028626m017715m977341
1514.1F34823227p502251j1209640j4717179j6173667j4171334q704719j659623L716889
1521.8E64401703M461441j18828p494926j2976265j2402382m752312P154808J8383217
1529.5E56656456K4804687K5214463K1377029J6311684J2264023R737549P943191N964432
1537.2F80273514L617172J452408J26190k07977J1673J74179o180l35007m09774m5853
$$ y = [582666283, 597680817, 618474808, 638747177, 654309845, 664263916, 669983978, 673292847, 675328598, 676522064, 677058945, 677122803, 676816101, 676110001, 675016479, 673776855, 672772141, 672200470, 671861191, 671290436, 670111847, 668260040, 665923309, 663373337, 660908356, 658895874, 657693100, 657356873, 657390976, 656882706, 655059509, 651838074, 647846909, 643818283, 639800568, 634823227, 627320976, 616111336, 601394157, 585220490, 571049156, 562344437, 560684814, 564401703, 568863144, 568744316, 561249390, 548273125, 535870743, 531118431, 538273239, 556656456, 581461143, 606675606, 628052635, 644364319, 656628342, 666365891, 674309082, 680273514, 683890686, 685343094, 685469284, 685261307, 685272980, 685447159, 685440979, 685105972, 684696198, 684650345]
1546.9F84650345N19943Q00247M56085l94058j212921j430435r11408j23748J86538
1555.6F82540588l85513j493301k238541j882553m88815J081085J835174J401902K28042
1564.2F80598068q87604j430587j409073j100846o88018j80970L74146P42722O37054
1572.9F76654892K4109p44553j147461q89587j43356N71518P57370K80609n53284j227570
1582.6F73582687j373520j008300m89579k34222m22974r13162j400909j663742j680069
1591.2F64396210j566773j445846j377335j375122j437302j536178j609421j604691
1599F52443542j554718j594162j876297k441864l154983l757629l998223l746490l041954
1607.6F27277222k065583j062736k52380K33345L56025J47476k98271q04443j123009
$$ y = [684650345, 685170288, 685970535, 686426620, 686032562, 684819641, 683389206, 682477798, 682354050, 682540588, 682155075, 680661774, 678423233, 676540680, 676051865, 677132950, 678968124, 680370026, 680598068, 679710464, 678279877, 676870804, 675769958, 675081940, 674900970, 675275116, 676017838, 676654892, 676679001, 675934448, 674786987, 673897400, 673754044, 674325562, 675082932, 675363541, 674810257, 673582687, 672209167, 671200867, 670711288, 670477066, 670054092, 669140930, 667740021, 666076279, 664396210, 662829437, 661383591, 660006256, 658631134, 657193832, 655657654, 654048233, 652443542, 650888824, 649294662, 647418365, 644976501, 641821518, 638063889, 634065666, 630319176, 627277222, 625211639, 624148903, 623896523, 624129868, 624485893, 624633369, 624335098, 623530655, 622407646]
1616.3F22407646j032944m92706K92397R76638J293717J207809Q78792N04456J96609
1625F26232414j8043j35079j44081m8485J18409L17916N24712P10144Q25310Q32558
1634.6F29215775P55538O63987N88226M82483L27186K60697N29404J208839J985664
1643.3F36017799K314339J896057J010056K91443J26800K90604K39410k28348o75201
1652F41282959m46396O12106J910325K612533K381058J613617R98001Q83179J082840
1660.7F52930222J210327J109466R40171R17892J049042J136017R98916O63910L40881
1669.4F61296844K35978L72162N62515N58624K68402j32522l17383r4757L77197O63910
1679F63790970M04892l53699j149979j447372j044769k20642M85687O54449K46506
$$ y = [622407646, 621374702, 620881996, 621174393, 622151031, 623444748, 624652557, 625531349, 626035805, 626232414, 626214371, 626079292, 625935211, 625886726, 626005135, 626323051, 626847763, 627557907, 628383217, 629215775, 629971313, 630635300, 631223526, 631706009, 632033195, 632293892, 632823296, 634032135, 636017799, 638332138, 640228195, 641238251, 641529694, 641656494, 641947098, 642186508, 641958160, 641282959, 640836563, 641448669, 643358994, 645971527, 648352585, 649966202, 650964203, 651847382, 652930222, 654140549, 655250015, 656190186, 657108078, 658157120, 659293137, 660292053, 660955963, 661296844, 661532822, 661904984, 662467499, 663026123, 663294525, 663162003, 662844620, 662749863, 663127060, 663790970, 664195862, 663842163, 662692184, 661244812, 660200043, 659979401, 660465088, 661119537, 661366043]
1687.7F61366043m12674q75397q70208m78745p6446o2561n57328j287536j770020j658325
1697.3F53316803r80225q8043O09970R01184Q28705N78003L28522J81122J54342J99738
1707F56030121K21786J26572j01013l50189m37165k44598J58157N35202O57654M96521
1716.6F57093048K54288J86462L71475O49643Q01316P74994P15637P55386Q18634O88706
1726.3F63109589K95944j10092j51215K87933Q88062J163025R10492L75595l2044j47323
1735.9F66589966j32675j88446k60468j02539L81165R32388J129989P86362J27640
1744.6F69263382m29153o52390o42471o39420p33948p93457o42624k73284J43280M36859
1754.2F65036774N96618P36466R07211R73511P05643L1051q03528j342239j250305
$$ y = [661366043, 660953369, 660077972, 659207764, 658729019, 658652573, 658590012, 658032684, 656745148, 654975128, 653316803, 652336578, 652248535, 652858505, 653759689, 654588394, 655166397, 655494919, 655676041, 655830383, 656030121, 656251907, 656378479, 656277466, 655927277, 655490112, 655245514, 655403671, 655938873, 656596527, 657093048, 657347336, 657533798, 657905273, 658554916, 659356232, 660131226, 660846863, 661602249, 662420883, 663109589, 663405533, 663295441, 663144226, 663432159, 664320221, 665483246, 666393738, 666769333, 666737289, 666589966, 666457291, 666268845, 666008377, 665905838, 666287003, 667219391, 668349380, 669135742, 669263382, 668834229, 668181839, 667539368, 666899948, 666166000, 665372543, 664729919, 664456635, 664599915, 665036774, 665633392, 666369858, 667277069, 668250580, 668956223, 668987274, 668183746, 666841507, 665591202]
1762.9F65591202n86395K30484P36541P51190M47236J38092J6403O8664J84479K92587
1772.5F67870483L82691M36630L98178K26593l1433k51923l29208k55127j16424k2049
1782.2F68308411k9450j19934k21329k55508j97983j12762j22605l13034o35528r12171
1791.8F65388107r59396p37534l93753j52816j52436l60031o23855q01621q48770q13370
1801.5F59544525p68432p48215p42340p34406p40204p97729r13162j008530r39941
1810.2F52151566n90363K0599P09687J220474J378097J195069Q57086N97992N58395
1818.8F58098602P06940Q74634Q70819O10885J70823k62528n13534n20707l53775j49688
1828.5F59532471k9297n3940k22702m78973p16782q12225o84052l52478O5079M24881
$$ y = [665591202, 665004807, 665235291, 665971832, 666723022, 667170258, 667308350, 667324753, 667393417, 667577896, 667870483, 668253174, 668689804, 669087982, 669314575, 669283142, 669031219, 668702011, 668446884, 668330460, 668308411, 668278961, 668159027, 667937698, 667682190, 667484207, 667371445, 667248840, 666935806, 666300278, 665388107, 664428711, 663691177, 663297424, 663144608, 662992172, 662632141, 662008286, 661206665, 660357895, 659544525, 658776093, 658027878, 657285538, 656551132, 655810928, 655013199, 654100037, 653091507, 652151566, 651561203, 651581802, 652291489, 653511963, 654890060, 656085129, 656942215, 657540207, 658098602, 658805542, 659680176, 660550995, 661161880, 661332703, 661070175, 660556641, 660035934, 659682159, 659532471, 659503174, 659449234, 659226532, 658747559, 658030777, 657218552, 656534500, 656182022, 656247101, 656671982]
1838.1F56671982O37741O98089O52009N58853M79126M74243N76248P44171Q59680Q02994
1847.8F63155136N53360K24304j2588n4550O1874K03629K50244J76468N1956k4109
1857.4F64585724L81R7046J83106J78222N7373j40304l50189n23987o35300o47964
1867.1F62804108n02014j65482K83356O43386P02363M10690m6158l68118l68576j17035
1876.7F63276520J31225J53733p3090l85132n85556n87158m32968k25296m9362M9438
1886.3F61272354N0354m4861k04086l66287m63715m53949l37219j56860J1444R0255
1896F59397430M8981o7444j62353j71814j28479j32065k46277m17328n18951m75693
1905.6F57126007l37372k25601k13318k73056l43857m20074n48096p25097q39997p43942
$$ y = [656671982, 657309723, 658007812, 658659821, 659218674, 659697800, 660172043, 660748291, 661492462, 662352142, 663155136, 663708496, 663932800, 663920212, 663865662, 663927536, 664131165, 664381409, 664557877, 664609833, 664585724, 664586105, 664683151, 664866257, 665044479, 665101852, 664961548, 664611359, 664087372, 663452072, 662804108, 662302094, 662136612, 662419968, 663063354, 663765717, 664176407, 664130249, 663762131, 663393555, 663276520, 663407745, 663561478, 663488388, 663103256, 662517700, 661930542, 661497574, 661272278, 661222916, 661272354, 661322708, 661277847, 661073761, 660707474, 660243759, 659789810, 659452591, 659295731, 659307175, 659397430, 659446411, 659378967, 659216614, 659044800, 658916321, 658784256, 658537979, 658120651, 657601700, 657126007, 656788635, 656563034, 656349716, 656076660, 655732803, 655312729, 654764633, 654039536, 653199539, 652455597]
1915.3F52455597l98636N7297L98254M82025L36151J01777q4076j62278j37329l9367
1924.9F53009415Q6364J70594J32446p3090m17785q00553j095352j204376j102600
1933.6F48705063q52280n77545l97034l44162l39050k51083r232L33099O40107Q00705
1943.2F47708588P99560O96335N56335M10691K75726J84479J72882K28424K65427J70746
1952.9F51469193j09711n14679q94699j099015j063232q40988n62363l53012k61841
1961.6F45769653k43606k00882n8594J88370M74167P03888Q00094P34787N45349L29361
1971.2F49042587K06986K51388M28315O01501O22101M37622J32217j34964k36053j36032
1980.8F51215668J14135M16642O49109O85806M54864J2589m44641o88401o25381l75366
$$ y = [652455597, 652056961, 652114258, 652512512, 652994537, 653330688, 653432465, 653348389, 653186111, 653048782, 653009415, 653095779, 653266373, 653398819, 653325729, 652907944, 652107391, 651012039, 649807663, 648705063, 647852783, 647275238, 646878204, 646534042, 646194992, 645943909, 645934677, 646267776, 646907883, 647708588, 648508148, 649204483, 649760818, 650171509, 650447235, 650631714, 650804596, 651033020, 651298447, 651469193, 651359482, 650844803, 649950104, 648851089, 647787857, 646946869, 646384506, 646031494, 645769653, 645526047, 645325165, 645266571, 645454941, 645929108, 646632996, 647433090, 648167877, 648713226, 649042587, 649249573, 649500961, 649929276, 650530777, 651152878, 651590500, 651722717, 651587753, 651351700, 651215668, 651329803, 651746445, 652395554, 653081360, 653536224, 653548813, 653104172, 652415771, 651790390, 651415024]
1990.5F51415024j72425j68533l13110m17633l35465p8201K18430M24575N03769M87671
2000.1F51564102M01917K36282j4343k94800m95148n16205l40194n0812K09656L14789
2009.8F51015244K22244K212k00195k56424j44272L2273J23291N4626j13525k39640
2019.4F50495834k20108o8817J06430J95618J58768K8839j34888k84424l82690l94669
2029.1F49499893k95181j03226J03302K15531J60141l9826k65732l69873k74048k7694
2038.7F48603287K20718L18527K10114l5629k80610m09088l80630k24304q316J85775
2048.4F48199844K72065J88522n6076l55988n51223n26276k96860K29K03476K36359
2058F47314072J37176J373j01852j64413k13318k65427l13873l39051l29284k75955
$$ y = [651415024, 651242599, 651074066, 650760956, 650343323, 650007858, 649929657, 650148087, 650572662, 651076431, 651564102, 651966019, 652202301, 652187958, 651893158, 651398010, 650881805, 650541611, 650490799, 650700455, 651015244, 651237488, 651239700, 651039505, 650783081, 650638809, 650671082, 650794373, 650848999, 650735474, 650495834, 650275726, 650206909, 650313339, 650508957, 650667725, 650696564, 650561676, 650277252, 649894562, 649499893, 649204712, 649101486, 649204788, 649420319, 649580460, 649540634, 649274902, 648905029, 648630981, 648603287, 648824005, 649142532, 649352646, 649317017, 649036407, 648627319, 648246689, 648022385, 648014069, 648199844, 648471909, 648660431, 648604355, 648248367, 647697144, 647170868, 646874008, 646874237, 647077713, 647314072, 647451248, 647452621, 647350769, 647186356, 646973038, 646707611, 646393738, 646054687, 645725403, 645449448]
2067.6F45449448j69373p553J78909L18909L35236K02636k2278k28500l25241k97623
2077.3F45434570k01187j03912l6621O790K7237j373j01014k37198l11965k34070j1521
2087.9F44229736K26593L19748K11182M883j16654m9896J39465K72904K17743J52k25296
2098.5F45230560l18985k75421k09808k29340l21808l67431k65656m5547J46560J78223
2108.1F43521347N3024r2315j14975M425J46637J62201r92k63443m89273n86777n53436
2118.7F41786423m42047l05405j77383q3619n2032r0103j54953j63193m4327J91117
2128.4F40464478M36248N46952M43191J71433j15204k59476j96762J0605K31705L56063
2138F42089233L49198K45285J11236J5641J3351J20850K81448L67661K49557r3613
$$ y = [645449448, 645280075, 645272522, 645451431, 645770340, 646105576, 646308212, 646285934, 646057434, 645732193, 645434570, 645233383, 645129471, 645092850, 645099640, 645126877, 645125504, 645024490, 644787292, 644475327, 644241257, 644229736, 644456329, 644776077, 644987259, 644992142, 644875488, 644825592, 644965057, 645237961, 645455704, 645455856, 645230560, 644911575, 644636154, 644426346, 644197006, 643875198, 643507767, 643242111, 643196564, 643343124, 643521347, 643574371, 643482056, 643367081, 643371506, 643518143, 643680344, 643679352, 643415909, 642926636, 642339859, 641786423, 641344376, 641038971, 640861588, 640777969, 640725937, 640635834, 640480881, 640317688, 640273361, 640464478, 640900726, 641447678, 641890869, 642062302, 641947098, 641687622, 641490860, 641501465, 641733170, 642089233, 642438431, 642683716, 642794952, 642810593, 642823944, 642944794, 643226242, 643593903, 643843460, 643749847]
2147.7F43749847n18570p94448p58896m39530k9449K57034L19290K00653J3352j51062
2157.3F41848221k50015k75727k31628j38016l7918J9608J0757m7531j10092j31302
2167F40656357q7204J6708J43051K32773K36817J48544J4038j05667j81580k30941
2176.6F40842896k78321l12881k93312j96419n3024P3318J44234J69945J73797J47324
2186.3F40417557N5771j06202k76565l64876l31917k26707j37177j09787j22490j31759
2195.9F38665848j26267j25885j33705j17454n2681K8190N3635q431j00059j23520
2205.5F37959671m8447M6769N0048o4392k06833k68783k39411k14920k86445m28162
2215.2F36299095n07469m02374j15547K21672M42390M47807K53907k9374k54440l08723
$$ y = [643749847, 643231277, 642436829, 641677933, 641238403, 641208954, 641465988, 641785278, 641985931, 641999283, 641848221, 641598206, 641322479, 641090851, 640952835, 640914917, 640934525, 640945282, 640897751, 640787659, 640656357, 640569153, 640585861, 640728912, 640961685, 641198502, 641347046, 641361084, 641255417, 641073837, 640842896, 640564575, 640251694, 639958382, 639761963, 639708939, 639782257, 639926491, 640096436, 640270233, 640417557, 640473328, 640367126, 640090561, 639725685, 639393768, 639167061, 639029884, 638920097, 638797607, 638665848, 638539581, 638413696, 638279991, 638162537, 638109856, 638138046, 638191681, 638183250, 638083191, 637959671, 637911224, 637957993, 638008041, 637943649, 637736816, 637468033, 637228622, 637013702, 636727257, 636299095, 635791626, 635389252, 635273705, 635495377, 635937767, 636385574, 636639481, 636610107, 636355667, 636046944]
2224.8F36046944j76812M6425K20986K64740K06794J38360J05514O7024m0321k00691
2234.5F36678963l07122k64091r3651P6790J33247P7134J220k5482k9449q7166k21176
2245.1F35939217l54271l79372k61421p5798N5771O5498j7624j07727j41220j22070
2254.7F34600983j02539j22910j74179k12631k11716j89476j80931j86424j61515p1640
2264.4F32987022M5815R3307J908j90468l61099m11835l50685k64054k15950j87835
2274F31146126j24703j5258Q6441J23748J01242P4349Q1024J02081R2697M1199j6784
2284.6F31692162m1619l0250j5030k7962p7400j52779k36168l03421l28216l00865
2294.3F30178452k41967j86157j40266p0191N6572K08702K87590K03400l4752l05557
$$ y = [636046944, 635870132, 635916557, 636137543, 636402283, 636609077, 636747437, 636852951, 636919975, 636879654, 636678963, 636371841, 636107750, 636014099, 636090889, 636224136, 636301270, 636302490, 636277008, 636247559, 636160393, 635939217, 635584946, 635205574, 634944153, 634868355, 634924126, 634989624, 634972000, 634864273, 634723053, 634600983, 634498444, 634375534, 634201355, 633988724, 633777008, 633587532, 633406601, 633220177, 633058662, 632987022, 633032837, 633126144, 633128052, 632937584, 632576485, 632164650, 631813965, 631549911, 631333961, 631146126, 631021423, 631006165, 631092606, 631216354, 631317596, 631391945, 631472969, 631575050, 631667747, 631708946, 631692162, 631650543, 631620293, 631605263, 631577301, 631499901, 631347122, 631110954, 630807533, 630479317, 630178452, 629936485, 629750328, 629610062, 629539871, 629596443, 629805145, 630092735, 630296135, 630261383, 629955826]
2303.9F29955826m58260m20913k41280m1084O4621K4070j44119l70407n62172o38084
2313.5F27168198n61600l63350j36185K060l4103k43797n22004p03315o60897m01001
2323.2F23544006o9923J45988J56327J9417j30692k05421k10686j90239j51329o6681
2332.8F22840767N3368J25618O2675j25237l18031m00619l81317l78953m78515o13022
2342.5F20386734o09436l56712P8048N04151P69005Q47816P84111N76363J58882m80461
2352.1F22658501j187668j668244j666336j149597l56331L30048N84259L07579l17459
2360.8F17534752r09157j087837p08504K1782O55899Q08258M33045j45379m81262l31955
2370.4F15789642K06185Q28857J265412J415557J313744J028137O29578K31781l586
$$ y = [629955826, 629497566, 629076653, 628835373, 628794289, 628858910, 628882980, 628738861, 628368454, 627806282, 627168198, 626606598, 626243248, 626107063, 626109123, 626075020, 625831223, 625309219, 624605904, 623945007, 623544006, 623474083, 623620071, 623776398, 623795815, 623665123, 623459702, 623249016, 623058777, 622907448, 622840767, 622894135, 623019753, 623082428, 622957191, 622639160, 622238541, 621857224, 621478271, 620999756, 620386734, 619777298, 619420586, 619498634, 620002785, 620771790, 621619606, 622403717, 622980080, 623138962, 622658501, 621470833, 619802589, 618136253, 616986656, 616630325, 616960373, 617544632, 617852211, 617534752, 616625595, 615537758, 614829254, 614851036, 615506935, 616315193, 616748238, 616602859, 616121597, 615789642, 615995827, 616824684, 618090096, 619505653, 620819397, 621847534, 622477112, 622708893, 622705307]
2379.1F22705307M2572L25623O27517O97823M39834j1978l95622n11475l48777o2485
2388.8F23508339J58310K17438J41944K3537o8474j21612j53122j67732j45722p6980
2398.4F23315926Q888N4321K2087o6757j45073j54076q4190K3346J11275J39503R8114
2409F23323364N570j00251j77421k00844j77879j35346r0179l6621L2043R2316R4261
2419.6F22629013J2055j13602j92719j62658m3412P9117J34659J24702J02005J00556
2429.3F22669716R4490L2234r8419k40593l08304k54974j11656L4980R8801M3716j00402
2439.9F21859589k57912l48091l26920k07100m7378Q2207J41029J31111Q6937M7340
2449.5F21160812L0938K5825j106q1444k15301l60795m51316m35295l13530j41526
$$ y = [622705307, 622747879, 623073502, 623701019, 624398842, 624838676, 624826698, 624431076, 623919601, 623570824, 623508339, 623666649, 623884087, 624026031, 624049568, 623981094, 623859482, 623706360, 623538628, 623392906, 623315926, 623324814, 623379135, 623401222, 623334465, 623189392, 623035316, 622951126, 622974472, 623085747, 623225250, 623323364, 623328934, 623228683, 623051262, 622850418, 622672539, 622537193, 622447014, 622410393, 622442436, 622534752, 622629013, 622641068, 622527466, 622334747, 622172089, 622128677, 622207794, 622342453, 622467155, 622569160, 622669716, 622764206, 622796440, 622698021, 622457428, 622149124, 621894150, 621782494, 621817474, 621916275, 621959991, 621859589, 621601677, 621253586, 620926666, 620719566, 620672188, 620754395, 620895424, 621026535, 621113472, 621160812, 621191750, 621217575, 621216469, 621135025, 620919724, 620558929, 620107613, 619672318, 619358788, 619217262]
2459.2F19217262r53M7836l891j12572k08702k41165k09198j62659j58615k05688k45934
2469.8F17715721j99356m0436J69831L28941L77464L31612K42538J31073j5258j84556
2479.4F18857574l01971k83356j36070J0605R880j55067l38288l64609k03552n646
2489.1F17089500M7722p6866k34947k54517j04217Q8081J71814J14403P477m6501l1739
2499.7F16770210p095k0065n4512o5499m5509l7346q1940j65481k24495k06146j18485
2510.3F15743637k2850J6670j8387r2887j44539j24817l5248O6338R4184n455k03323
2520.9F15273323l91006m52424l51753j63383j1482L2501k747l4828k1019q01m2381
2531.5F13834000j50948k37923j96418r690K13700L24516K56462P5378r2964j75399
$$ y = [619217262, 619216309, 619264145, 619260254, 619147682, 618938980, 618697815, 618488617, 618325958, 618167343, 617961655, 617715721, 617516365, 617475929, 617645760, 617974701, 618352165, 618683777, 618926315, 619057388, 619042130, 618857574, 618555603, 618272247, 618136177, 618146782, 618156662, 618001595, 617663307, 617298698, 617095146, 617089500, 617137222, 617060356, 616825409, 616570892, 616466675, 616554756, 616726570, 616840973, 616848450, 616801949, 616770210, 616763115, 616743050, 616688538, 616623039, 616577530, 616540184, 616458244, 616292763, 616068268, 615862122, 615743637, 615720787, 615737457, 615719070, 615626183, 615481644, 615356827, 615321579, 615387917, 615482101, 615476646, 615273323, 614882317, 614429893, 614078140, 613914757, 613903275, 613935776, 613933029, 613898201, 613877182, 613876381, 613834000, 613683052, 613445129, 613248711, 613239021, 613452721, 613777237, 614033699, 614109077, 614016113, 613840714]
2541.1F13840714j94893k11907k39754k30407j43433j3008O5193J8845j26229k62832
2550.8F12502289k86598j80321k2545P3242L4409j27831l28369m57115m41132k88849
2560.4F10477180r0713L7498L4142n9128j24359n3787J61934M14238N40847M32511
2570.1F11770363J09253k84081n63049o10237m39072j69678N4589J53274J36490P1984
2579.7F10229836K1324O10j7815p0495j64261k61040l01437k49520j30958k1553J3504
2590.3F09048195k1744n4474j5640Q3580J50261R4490p9422k64931l43971k84843j57166
2600.9F08154335o0158l7269n8670p2251o0005m9477p5569j42173k11869k30675j63841
2611.5F06992378k4948J25694K13852J97487R7161k5444j17531j68953k00539k20909
$$ y = [613840714, 613645821, 613433914, 613194160, 612963753, 612820320, 612807312, 612872505, 612891350, 612765121, 612502289, 612215691, 612035370, 612012825, 612086067, 612120476, 611992645, 611664276, 611207161, 610766029, 610477180, 610386467, 610423965, 610458107, 610398979, 610274620, 610220833, 610382767, 610797005, 611337852, 611770363, 611879616, 611595535, 611032486, 610422249, 609983177, 609813499, 609868088, 610021362, 610157852, 610229836, 610251160, 610251770, 610233955, 610163460, 609999199, 609738159, 609436722, 609187202, 609056244, 609034691, 609048195, 609026451, 608971977, 608956337, 609039917, 609190178, 609284668, 609205246, 608940315, 608596344, 608311501, 608154335, 608094177, 608056908, 607998238, 607925987, 607865982, 607816505, 607740936, 607598763, 607386894, 607156219, 606992378, 606967430, 607093124, 607306976, 607504463, 607601624, 607576180, 607458649, 607289696, 607089157, 606868248]
2621.2F06868248k10228j47667n1155K2774K6397l4217j11275j62888j90696k20261
2630.8F05789032k52380k47422j63383j0376J40495K07253J59034L4943r2354j68686
2640.5F05396156j80816j42479p5226j412M9744N0659l586q1863j35231j38206j14098
2651.1F04623642j17302j83067k91977l81928m01573l49884k73361k22511k07177j90658
2660.7F02004204j21079K2888K05613L46222L65371K40021L0251j47591j95236r9449
2670.4F02651215N7144J56135J28022r613j78528l05786l65029l65372l18336k19383
2680F01230469o8131J03226K26250K37388J29051l2272j44310j41830m4937N7640P9269
2690.6F01631813j221j33857k48604l11012l32489l38097l35465l17154k80723k36092
$$ y = [606868248, 606658020, 606510353, 606459198, 606481972, 606508369, 606474152, 606362877, 606199989, 606009293, 605789032, 605536652, 605289230, 605125847, 605115471, 605255966, 605463219, 605622253, 605657196, 605564842, 605396156, 605215340, 605072861, 604997635, 604996223, 605045967, 605096626, 605093040, 605011177, 604875946, 604737740, 604623642, 604506340, 604323273, 604031296, 603649368, 603247795, 602897911, 602624550, 602402039, 602194862, 602004204, 601883125, 601906013, 602111626, 602457848, 602823219, 603063240, 603093491, 602945900, 602750664, 602651215, 602708359, 602864494, 602992516, 602982903, 602804375, 602498589, 602133560, 601768188, 601449852, 601230469, 601162338, 601265564, 601491814, 601729202, 601858253, 601825981, 601681671, 601539841, 601494904, 601552544, 601631813, 601630592, 601496735, 601248131, 600937119, 600604630, 600266533, 599931068, 599613914, 599333191, 599097099]
2700.3E99097099j88331j29052n0849K6359N6687M844j17264k53105l40042l50647
2709.9E97755699k99721k30636j89896k06070k64702l01971k39830o0921J43662K22816
2719.5E96328430R2735j62925l34473k54593N1041L70521M72947K84309p0343l79906
2729.2E96397743m98962m11873j93977N9852K66800L55301K73628L1357k70348m76417
2738.8E95533104m71649k66457J2474K16370K81372K51770K12288J94702J58348N3101
2748.5E96175423j03493k20833k12822p9918Q3847J67427J29090J3046j03111j72730
2758.1E95675926j99013k03971j95389j64871j08414m4479o180j5602o4545j13411
2767.8E94560051j16730n9013K5711P0648L1738o7787j45798j30348k9068O7444O2447
$$ y = [599097099, 598908768, 598779716, 598728867, 598755226, 598811913, 598816757, 598699493, 598446388, 598106346, 597755699, 597455978, 597225342, 597035446, 596829376, 596564674, 596262703, 596022873, 595961952, 596105614, 596328430, 596421165, 596258240, 595923767, 595669174, 595720215, 596090736, 596563683, 596847992, 596777649, 596397743, 595898781, 595486908, 595292931, 595352783, 595619583, 595974884, 596248512, 596279869, 596009521, 595533104, 595061455, 594794998, 594807472, 595023842, 595305214, 595556984, 595769272, 595963974, 596122322, 596175423, 596071930, 595851097, 595638275, 595558357, 595642204, 595809631, 595938721, 595951767, 595848656, 595675926, 595476913, 595272942, 595077553, 594912682, 594804268, 594759789, 594753609, 594738007, 594673462, 594560051, 594443321, 594384308, 594410019, 594480667, 594512405, 594444618, 594298820, 594168472, 594139404, 594206848, 594269295]
2778.4E94269295n8747k09503k74086k05498o5193K9946M348j12724k11983j88484
2788E92977371k8267J77002K95143K53945R5253o4507j35116j25389j18065j75057
2797.7E93152313k66800l03917k36892j20430o9084j44654k88276l69606l02353j19744
2807.3E90930557O0044J31454P5874m4860j45302j66779r4108M6348J90392K52037
2816.9E91235657J64299p0000l63350n87921o55136n64728l89900k17552j01471n2300
2826.6E88397598n9547j01967j47667j59874j24016p3204p8087j88598l77083n38139
2836.2E86549416n57747m03099j52550N6381J22490M2152j03950k17361k47384k11372
2845.9E84876976j71471j87606k78092m02298m78134m31671k56882l8147R3537N3520
$$ y = [594269295, 594210548, 594001045, 593726959, 593521461, 593456268, 593486214, 593490562, 593377838, 593165855, 592977371, 592949104, 593126106, 593421249, 593675194, 593770447, 593705940, 593570824, 593445435, 593327370, 593152313, 592885513, 592581596, 592344704, 592224274, 592155190, 592010536, 591722260, 591352654, 591050301, 590930557, 590990601, 591122055, 591197929, 591153069, 591007767, 590840988, 590746880, 590793228, 590983620, 591235657, 591399956, 591329956, 590966606, 590378685, 589723549, 589158821, 588768921, 588551369, 588449898, 588397598, 588338051, 588236084, 588088417, 587928543, 587804527, 587731323, 587653236, 587464638, 587087555, 586549416, 585991669, 585588570, 585436020, 585492401, 585614891, 585657043, 585553093, 585335732, 585088348, 584876976, 584705505, 584517899, 584239807, 583837509, 583359375, 582927704, 582670822, 582632675, 582726212, 582779732]
2855.5E82779732j27907l19977l88222k97660j27297Q965O3285Q0491J29203K16256
2865.2E82016869K71453K19307O2600j11962k09770k10114j68647j42708j23177m8599
2874.8E81555252J16272L16849M34265L80211J71242q2665k58140k99035k33459j35765
2884.4E81965027p4845q2168j46484k20948k47535j96076r4414k0446m4861j68572
2894.1E80668678l15284l90664l58810k65808j93062j92146k56081l39928l92608l68805
2903.7E77595482k38457j4419K18620L23906K02102j11961m46129o05430n23148l11127
2913.4E76089439j64489k01340l78876n48019n82047m65202k78053j23940o1645r1668
2923E73194160j73454k53105k84653k52037j80626j22757j14326j36452j23710k1744
$$ y = [582779732, 582651825, 582331848, 581943626, 581645966, 581518669, 581527634, 581590919, 581671410, 581800613, 582016869, 582288322, 582507629, 582570229, 582458267, 582248497, 582038383, 581869736, 581727028, 581603851, 581555252, 581671524, 581988373, 582422638, 582802849, 582974091, 582891426, 582633286, 582334251, 582100792, 581965027, 581890182, 581808014, 581661530, 581440582, 581193047, 580996971, 580902557, 580882111, 580837250, 580668678, 580353394, 579962730, 579603920, 579338112, 579145050, 578952904, 578696823, 578356895, 577964287, 577595482, 577357025, 577342606, 577561226, 577885132, 578087234, 577975273, 577529144, 576923714, 576400566, 576089439, 575924950, 575723610, 575344734, 574796715, 574214668, 573749466, 573471413, 573347473, 573285828, 573194160, 573020706, 572767601, 572482948, 572230911, 572050285, 571927528, 571813202, 571676750, 571553040, 571531296]
2932.7E71531296J55144L20968L83949L23639K10991J46370J72692K41279K58713J75590
2942.3E73920631K8954q8882j11199m6043L3683M2229o7291k83394n36804p22885p43561
2952.9E71425438n64613k48719P0000K65999K95982K01798N7983q0871j83144k18392
2962.6E71021461j63192m0741O7634Q2169R460m3830L0288K23465L99437M11224K37084
2973.2E72234459n074j68876k00043j53427j10092j03226j20163j53465k22969l49045
2982.8E70648079n11894o59104p42302p44133o71844n37415l52745j37291Q1902K77710
2992.5E66650963M20494M67262L70560J22108k07061m83666n92613n20210l54805k07787
3002.1E65665245j33133j17760j34430j82495k72445l84636m67072m81758m41704l86848
$$ y = [571531296, 571686440, 572007408, 572391357, 572714996, 572925987, 573072357, 573245049, 573486328, 573745041, 573920631, 573949585, 573860703, 573749504, 573703461, 573737144, 573779373, 573712082, 573428688, 572891884, 572168999, 571425438, 570860825, 570612106, 570682106, 570948105, 571244087, 571445885, 571503868, 571422997, 571239853, 571021461, 570858269, 570817528, 570885162, 570967331, 570976791, 570932961, 570963249, 571186714, 571586151, 571997375, 572234459, 572229385, 572060509, 571860466, 571707039, 571596947, 571493721, 571373558, 571220093, 570997124, 570648079, 570136185, 569477081, 568734779, 567990646, 567318802, 566781387, 566428642, 566291351, 566373253, 566650963, 567071457, 567538719, 567909279, 568031387, 567824326, 567340660, 566748047, 566227837, 565873032, 565665245, 565532112, 565414352, 565279922, 565097427, 564824982, 564440346, 563973274, 563491516, 563049812, 562662964]
3011.7E62662964l22151j96038M1199L50876N91507O11992L76739J0643k88772l98827
3021.4E63440132l51715k79655k84119l50075l81584l10402j73759p8354r4109j83754
3031E60952606k35367j64299Q202J72234K13699R1934j45683m04244n94291o64139
3040.7E59230652o13670m98620m21028n00831q20275j370353k019463k539558k692109
3049.4E47754745k345504j561966n86472K71225P91321R31702P94754N26046K38190
3058E46814041P935j02310o1303P8736J75895R2659j71241m38767m72450j65062L62549
3068.6E46120682Q47816J078415J028443Q35227O63109N77698N22347L92036J25275
3077.3E52191048k43492o02570q33969q99124q87413r78432j319962j890716k449532
$$ y = [562662964, 562340813, 562144775, 562185974, 562536850, 563128357, 563740349, 564117088, 564127731, 563838959, 563440132, 563088417, 562808762, 562524643, 562174568, 561792984, 561482582, 561308823, 561230469, 561136360, 560952606, 560717239, 560552940, 560561142, 560733376, 560947075, 561039009, 560893326, 560489082, 559894791, 559230652, 558616982, 558118362, 557697334, 557196503, 556376228, 555005875, 552986412, 550446854, 547754745, 545409241, 543847275, 543260803, 543532028, 544323349, 545255051, 546049805, 546575851, 546814041, 546821976, 546719666, 546658363, 546737099, 546912994, 547005653, 546834412, 546395645, 545923195, 545758133, 546120682, 546968498, 548046913, 549075356, 549910583, 550573692, 551151390, 551673737, 552065773, 552191048, 551947556, 551344986, 550511017, 549611893, 548724480, 547746048, 546426086, 544535370, 542085838]
3086E42085838k635078k166939j027527M98810J953011K920189L212318K920875K324982
3094.7E50086479J721382J280327J006928Q11042O16723M16793K45781J20240K0790
3103.4E56326485o9466j25008j04293j5679N5618J6251j28059k49634k03705K6283
3113E55528793K93007M02107K74506m272k77825m47502n07049m78249l57361j46027
3122.6E54280128P9728J79863O6299j89819l87764l63961j41563Q5144J25237l9215
3132.3E53694077k41967k84424j06239J72844L58086L34396J35002j10626k90260l80898
3141.9E53279991m24614m44526l96843k13967R0141L71666M34151J93024k21214n37529
3151.6E52130280n54505l04756k5749M5776j30691l86582n10063m28505k40822r5176
$$ y = [542085838, 539450760, 537283821, 536256294, 536755104, 538708115, 541628304, 544840622, 547761497, 550086479, 551807861, 553088188, 554095116, 554906158, 555522881, 555939674, 556185455, 556305695, 556326485, 556257019, 556132011, 556027718, 556012039, 556067657, 556083908, 555955849, 555706215, 555502510, 555528793, 555821800, 556223907, 556498413, 556494141, 556216316, 555768814, 555261765, 554783516, 554426155, 554280128, 554359856, 554539719, 554606018, 554416199, 554028435, 553664474, 553522911, 553608055, 553733292, 553694077, 553452110, 553167686, 553061447, 553234291, 553592377, 553926773, 554061775, 553951149, 553660889, 553279991, 552855377, 552410851, 552014008, 551800041, 551890182, 552261848, 552695999, 552889023, 552667809, 552130280, 551575775, 551271019, 551245270, 551291046, 551160355, 550773773, 550263710, 549835205, 549594383, 549499207]
3161.2E49499207m7989l9864O332Q3008R9030k4986k65732n01595o05964n36995l53737
3171.8E47310715j54457r079O0882N5886k7009j82495l69186n09377n35507m45251
3181.5E45195122l05977k00157j51596j15853l7346P6561J42861P0076j54343m39987
3191.1E44079361o53191p07550o10237m34799k61917j43433j03645j55258k95525m88968
3200.8E40224838o64825p45354o88476n10636k76832o5728N9433O8474l0708j95961
3210.4E37174225l62740m69398m83780m20723l32871k83584l11165m01840m94080n14221
3220E33099823m30717k83432j59722j26877j75743k30484k21977j56555j09444j51443
3229.7E31053429k74659l98750m51584m39644m40139n16014o40107p07321o23131l93066
$$ y = [549499207, 549451218, 549411354, 549417686, 549500694, 549599724, 549574738, 549309006, 548807411, 548201447, 547664452, 547310715, 547156258, 547147179, 547208061, 547263947, 547236938, 547054443, 546685257, 546175880, 545640373, 545195122, 544889145, 544688988, 544537392, 544421539, 544384193, 544460754, 544603615, 544673691, 544519348, 544079361, 543426170, 542718620, 542108383, 541673584, 541411667, 541268234, 541164589, 541009331, 540713806, 540224838, 539560013, 538814659, 538126183, 537615547, 537338715, 537272987, 537332420, 537400894, 537370186, 537174225, 536811485, 536342087, 535858307, 535437584, 535104713, 534821129, 534509964, 534108124, 533614044, 533099823, 532669106, 532385674, 532225952, 532099075, 531923332, 531692848, 531470871, 531314316, 531204872, 531053429, 530778770, 530380020, 529928436, 529488792, 529048653, 528532639, 527892532, 527185211, 526562080, 526169014]
3239.3E26169014j32446J1406l9292k43873m78440o20918o22063n19371l92303l00598
3249E22831116k50435k08092j40304n1804J1635q545j40228l49884n45769o25000n39513
3259.6E19983177l40881j54762r6436j81046l13377l67660k93923j53808n5886n8593
3269.2E17966805j32981k16408k85720l67470m74358n48858m93737k69966L1052K28233
3278.9E15436592J80779j02768m67797p24182p66449o17561l81088j65863m0093k8953
3288.5E12322617j23787k84958m48609n51490n75409n61219n70602o21948o57158n85518
3298.2E07341919l74794j05019P3471N0126j56441m14353n80291o04439n44548m93088
3307.8E04192543m96445n39436n94635o62270p53517q38356q36906o87332m30870k16637
$$ y = [526169014, 526036568, 526047974, 526008682, 525764809, 525286369, 524665451, 524043388, 523524017, 523131714, 522831116, 522580681, 522372589, 522232285, 522180481, 522192116, 522183571, 522043343, 521693459, 521147690, 520522690, 519983177, 519642296, 519487534, 519391098, 519210052, 518896675, 518529015, 518235092, 518081284, 518025398, 517966805, 517833824, 517617416, 517331696, 516964226, 516489868, 515941010, 515447273, 515177307, 515208359, 515436592, 515617371, 515514603, 515046806, 514322624, 513556175, 512938614, 512557526, 512391663, 512351570, 512322617, 512198830, 511913872, 511465263, 510913773, 510338364, 509777145, 509206543, 508584595, 507927437, 507341919, 506967125, 506862106, 506935577, 506985703, 506829262, 506414909, 505834618, 505230179, 504685631, 504192543, 503696098, 503156662, 502562027, 501899757, 501146240, 500307884, 499470978, 498783646, 498352776, 498136139]
3317.4D98136139j97601m02527o99845q97255q89473p29713n69763n32646o27861p65648
3327.1D91823807q38928q01239o86226n74112n32990n78842o76041p76176q57582r29108
3336.7D84572563r90143j000366r07135p21207n54122n52254p63588j067810j257706
3345.4D76758232j210022r87854p72667o99234p60307q61473r42612j024361j135139
3354.1D68364563j225395j187020r68322o59790m46549m65507p01523j011009j233750
3362.8D60465698j294937j218490j078148r41124q41713p84989p58133p49244p61490
3371.4D52037430q12302r18007j071052j233406j348114j360894j239051r92585o91223
3380.1D42370796m54292l95203n41839q04253j028862j110573j060371r67217q96911
$$ y = [498136139, 497938538, 497536011, 496836166, 495938911, 495049438, 494319725, 493749962, 493217316, 492589455, 491823807, 490984879, 490183640, 489497414, 488923302, 488390312, 487811470, 487135429, 486359253, 485501671, 484572563, 483582420, 482582054, 481674919, 480953712, 480399590, 479847336, 479083748, 478015938, 476758232, 475548210, 474560356, 473787689, 473088455, 472328148, 471466675, 470524063, 469499702, 468364563, 467139168, 465952148, 464983826, 464324036, 463877487, 463411980, 462710457, 461699448, 460465698, 459170761, 457952271, 456874123, 455932999, 455091286, 454306297, 453548164, 452798920, 452037430, 451225128, 450307121, 449236069, 448002663, 446654549, 445293655, 444054604, 443062019, 442370796, 441916504, 441521301, 440979462, 440175209, 439146347, 438035774, 436975403, 436008186, 435111275]
3388.8D35111275q34503p25861n70145m49638m60014o06118p77511q29125o99730m57801
3398.4D28700829k45133j72729k56310m27399n92498o92101p19147p05986o90956o90918
3408.1D23507652o94275o76460o25038n51491m77981m10271l30772k21634j03875m3106
3417.7D19372749j03645k80418m78020n72395n12658l68118k63214k57416k87857k40822
3427.4D16008186q2969Q7852J38283M0436r4490j35994p8583n1003j68113l88603n33829
3438D14741173m56467j82152J14441K67182K42080J23558J1444m8103m9324J2856J39923
3448.6D14916611K97126M12941M31405L58276K49557J54496Q5525L9177K9030P8506
3458.2D17052650J84479L06816M05197M78898N51986O19698O23627N00335K58217O49
$$ y = [435111275, 434276772, 433550911, 432980766, 432531128, 432071114, 431464996, 430687485, 429858360, 429158630, 428700829, 428455696, 428282967, 428026657, 427599258, 427006760, 426314659, 425595512, 424889526, 424198570, 423507652, 422813377, 422136917, 421511879, 420960388, 420482407, 420072136, 419741364, 419519730, 419415855, 419372749, 419269104, 418988686, 418510666, 417938271, 417425613, 417057495, 416794281, 416536865, 416249008, 416008186, 415925217, 416013069, 416151352, 416191788, 416097298, 415961304, 415882721, 415831718, 415663605, 415275002, 414741173, 414284706, 414102554, 414216995, 414484177, 414726257, 414849815, 414861259, 414813156, 414763832, 414776688, 414916611, 415213737, 415626678, 416058083, 416416359, 416665916, 416820412, 416905937, 416945114, 416974144, 417052650, 417237129, 417543945, 417949142, 418428040, 418980026, 419599724, 420223351, 420723686, 420981903, 420982552]
3467.9D20982552j36872q2283J25466L70369N35965N67092M86107L64685K72828K38494
3477.5D23724403K41394K44599K36168K37388K68708L17649L44391L29361L02162L15285
3487.2D26561508L88184M84085N47943N58434N35850N00450M40865L39088K25945J88980
3496.8D30771332L03764N45464P77282Q42858O90498M19083K02484J57127K65847M12445
3506.5D35388184M87442M67109M06342L63884L43475K99759K02828R0026N1079J55716
3516.1D38255844L88603O49071Q17719Q35914P34558N93529M71077L64800K37312Q0414
3525.7D43428841m3488l3951J61248M77485P56035Q51097P36313N20439L57857L31573
3535.4D47543449M08860M94270N17769M77028M09012L39469K68097J97831J66893K36091
$$ y = [420982552, 420845680, 420763397, 420888863, 421259232, 421795197, 422362289, 422848396, 423213081, 423485909, 423724403, 423965797, 424210396, 424446564, 424683952, 424952660, 425270309, 425614700, 425944061, 426246223, 426561508, 426949692, 427433777, 427981720, 428540154, 429076004, 429576454, 430017319, 430356407, 430582352, 430771332, 431075096, 431620560, 432397842, 433240700, 433931198, 434350281, 434552765, 434709892, 434975739, 435388184, 435875626, 436342735, 436749077, 437112961, 437456436, 437756195, 437959023, 438049049, 438100128, 438255844, 438644447, 439293518, 440111237, 440947151, 441681709, 442275238, 442746315, 443111115, 443348427, 443428841, 443385353, 443351402, 443512650, 443990135, 444746170, 445597267, 446333580, 446854019, 447211876, 447543449, 447952309, 448446579, 448964348, 449441376, 449850388, 450189857, 450457954, 450655785, 450822678, 451058769]
3545D51058769M32778O99424R02291R10797P00531L89671J68076J53389K99263M42047
3554.7D56157036M55513L74412L55797N13344P88155R98039J017341Q98018P98340
3563.4D62355995P94296P85866O14128K68212m9477q7662K14882O58760R55010R64966
3573D67474976P83844O10237N58357N92728O14318N81437N42030N72891P04613Q93860
3582.6D73929291J046333J066399R15184O53572M25949L69644N06020P23304Q82149
3591.3D80517845R44138R85069J069183J135788J039849P25174L32794J10016J95465
3600D87055321N06668Q35457J032715J087303J041526Q95463O35032L36228J72157
3608.7D93597870K68097N50041P86934Q11691O93321O64750Q66165J181564J333046
$$ y = [451058769, 451491547, 452190971, 453093262, 454004059, 454704590, 455094261, 455262337, 455415726, 455714989, 456157036, 456612549, 456986961, 457342758, 457856102, 458644257, 459642296, 460659637, 461557655, 462355995, 463150291, 463936157, 464550285, 464818497, 464769020, 464681358, 464896240, 465555000, 466510010, 467474976, 468258820, 468869057, 469427414, 470020142, 470634460, 471215897, 471757927, 472330818, 473035431, 473929291, 474975624, 476042023, 476957207, 477610779, 478036728, 478406372, 478912392, 479635696, 480517845, 481461983, 482447052, 483516235, 484652023, 485691872, 486417046, 486749840, 486859856, 487055321, 487561989, 488397446, 489430161, 490517464, 491558990, 492454453, 493089485, 493425713, 493597870, 493865967, 494416008, 495202942, 496014633, 496707954, 497372704, 498238869, 499420433, 500753479]
3617.4E00753479J140137O78215J99928o3515k5825K74162P31468J177407J375541
3626E06240997J122780M33808l70827q34236o96259j00670N24826Q16422P28264M80995
3635.7E08346100L06854K64435K74048K70767K77557L51715N10292P35169J002121
3644.4E12339058J241379J270370Q60710k5177j038398j574593j221848j49879R60007
3653E12661629J428909J088944L42941k30065l22227k7580L51677N62362N20478L07807
3662.7E16684875J22071J71470M97895Q53004Q30078K39754o09474j084862p88231
3671.4E16916580J9989O04172M19388l76129j073761j075707m11682L58925P01027
3680E16082802N42145K21519J02196K67410N37453O88896O24580L89901J06163r5101
$$ y = [500753479, 501893616, 502571831, 502771759, 502708244, 502682419, 502956581, 503688049, 504865456, 506240997, 507363777, 507797585, 507426758, 506592522, 505896263, 505795593, 506320419, 507136841, 507865105, 508346100, 508652954, 508917389, 509191437, 509462204, 509739761, 510091476, 510601768, 511336937, 512339058, 513580437, 514850807, 515711517, 515686340, 514647942, 513073349, 511851501, 511701622, 512661629, 514090538, 515179482, 515522423, 515292358, 514970131, 514942551, 515294228, 515856590, 516377068, 516684875, 516806946, 516978416, 517476311, 518329315, 519159393, 519399147, 518789673, 517704811, 516916580, 516936569, 517540741, 517960129, 517584000, 516510239, 515434532, 515022850, 515381775, 516082802, 516624947, 516846466, 516948662, 517216072, 517753525, 518442421, 519067001, 519456902, 519563065, 519467964]
3689.7E19467964j25923j869J42021J37367o8207l38668m48838k83050N1613L06282
3699.3E18838692K99453O0616k04773k84233j13030K01073M77753N90019N20401L25394
3709E20711365O4697k33650n39055p73544q20771o09131j95312K38724M94461M86679
3718.6E18824463K86941M9782j02539j44920j31912j31607j72387k18506j83830J2551
3728.3E18088036L61404P10945Q23631N41115o4277p10297j101799j139069r31930
3736.9E16577759o26412k48527K41623P51610R88616O82869q3427q07953r24148k99073
3746.6E16252937O03371J077156P47604j44348r72709j219826q04787m2457O31027
3755.3E16127968R03587O94428J57051l85323n96618l48855J51482M98924M25415L8796
$$ y = [519467964, 519342041, 519340172, 519482193, 519619560, 519551353, 519212685, 518763847, 518480797, 518532410, 518838692, 519138145, 519198761, 518993988, 518709755, 518596725, 518797798, 519275551, 519865570, 520385971, 520711365, 520776062, 520542412, 520003357, 519229813, 518409042, 517799911, 517604599, 517843323, 518337784, 518824463, 519111404, 519161186, 519058647, 518913727, 518781815, 518650208, 518477821, 518259315, 518075485, 518088036, 518449440, 519160385, 519984016, 520525131, 520460854, 519750557, 518648758, 517509689, 516577759, 515951347, 515702820, 515944443, 516696053, 517684669, 518367538, 518284111, 517476158, 516552010, 516252937, 516856308, 517933464, 518681068, 518536720, 517564011, 516344185, 515539398, 515496941, 516127968, 517031555, 517725983, 517883034, 517497711, 516901093, 516552238, 516703720, 517202644, 517628059, 517666855]
3764.9E17666855k80876k51084M8828K76680J81618j63345m68826n28565l77846j84784
3774.5E15918655m9820M2725J10283R8419l7079k07863k38380o5994J43242J44081
3784.2E15858269j11847l92571m17099j54419J55602K82059K48718K49824L45078L35159
3793.8E16398773O027n36422q75817o97097j61820K03667L6773m71725p55882m47808
3803.5E12698669K47193P44743O29654J0643o08864p59773l29590M19426J048012J179619
3813.1E15279732O96068j70060r29565j148033p83348k32582J5907j66817m50363m12140
3822.8E11698799Q39M08707L99399m0283n19944o49528m01535o2256J22032J85661
3832.4E11141891L20626N73311P33375N39475k6055o72989j029853r32656n16739p1945
$$ y = [517666855, 517385979, 517134895, 517183723, 517460403, 517642021, 517478676, 517009850, 516481285, 516103439, 515918655, 515868835, 515911560, 516021843, 516120262, 516083183, 515875320, 515636940, 515570946, 515714188, 515858269, 515746422, 515353851, 514936752, 514782333, 514937935, 515219994, 515468712, 515718536, 516063614, 516398773, 516404800, 515868378, 514992561, 514295464, 514133644, 514337311, 514374084, 513902359, 513146477, 512698669, 512945862, 513690605, 514320259, 514330902, 513722038, 512962265, 512632675, 513052101, 514100113, 515279732, 515975800, 515805740, 514876175, 513728142, 512944794, 512712212, 512728119, 512561302, 512110939, 511698799, 511699638, 512108345, 512507744, 512467461, 511947517, 511297989, 510896454, 510834198, 510956230, 511141891, 511462517, 512035828, 512769203, 513308678, 513282623, 512609634, 511579781, 510647125, 510130386, 510058441]
3842.1E10058441J78566J89819O0845o4087p9041M5357K45362L75366K76413j01509
3851.7E11185532n97916q83980o86645m6273O33469Q60024M66194k17324o31790m84619
3861.3E09596672J53L33442K47231p9613k76070k00119n3024q8234k99110m58107m30794
3871.9E08292427l42407l76244m78782l85209K4300M85306N79491K06031k65197l81127
3881.6E07358589j09558J34735j3618m26750o15464k96058K64740N16128K00462l94859
3891.2E06618347p57866o57348k95792k0294L1509j9302k0104L0671K6664q4572k42004
3901.8E04609909l53470l85628l56102k69279j08910J05439K83775L23563K05955K5406
3911.5E04080658q8577q2321j9303j4648j27640l05367m21180l75405j67312J08642
$$ y = [510058441, 510237007, 510426826, 510487671, 510423584, 510344543, 510389900, 510635262, 511010628, 511287041, 511185532, 510587616, 509703636, 509016991, 508970718, 509604187, 510464211, 510930405, 510713081, 510081291, 509596672, 509596825, 509930267, 510177498, 510097885, 509821815, 509621696, 509568672, 509480438, 509181328, 508723221, 508292427, 507950020, 507573776, 507094994, 506709785, 506734085, 507219391, 507798882, 508004913, 507739716, 507358589, 507249031, 507383766, 507370148, 506943398, 506327934, 506031876, 506296616, 506812744, 507013206, 506618347, 505860481, 505203133, 504907341, 504887047, 504918556, 504899254, 504879150, 504909821, 504936485, 504851913, 504609909, 504256439, 503870811, 503514709, 503245430, 503136520, 503241959, 503525734, 503849297, 504055252, 504080658, 503992081, 503909760, 503890457, 503875809, 503748169, 503442802, 503021622, 502646217, 502478905, 502587547]
3921.1E02587547L29323M07486L18489R7542j70021l71475m22707l31421j99890j40915
3930.8E02103958j75247k20070j82686n8327P4616J40305J22947M5471p1220j92680
3940.4E01587067k39754j29013J19934L45154L59726J21193k30217n10636o39648o39038
3950.1E00144768n29480k99797J14K04277J45645j53618m55894n09109k76604L8528
3959.7D98308830J78376K2125l58391p58247r41468p72857l43399M2152J06316j18790
3969.3D95364647l03040j80168J27182K38037j9149l86887n03502l55339k43797l06130
3979D93431854k86598N6763M65660L98636k08016p07741n40313r5063l22608j366997
3988.6D90825577k076454j422577k12174n00450k778244m492454k917939k59094m742622
$$ y = [502587547, 502916870, 503324356, 503642845, 503740387, 503570366, 503198891, 502776184, 502444763, 502244873, 502103958, 501928711, 501708641, 501525955, 501467628, 501542244, 501682549, 501805496, 501850967, 501779747, 501587067, 501347313, 501218300, 501338234, 501683388, 502043114, 502164307, 501934090, 501423454, 500783806, 500144768, 499615288, 499315491, 499315605, 499519882, 499665527, 499511909, 499056015, 498546906, 498270302, 498308830, 498487206, 498509331, 498150940, 497392693, 496451225, 495678368, 495334969, 495377121, 495483437, 495364647, 495061607, 494881439, 495008621, 495246658, 495227509, 494840622, 494337120, 493981781, 493737984, 493431854, 493145256, 493202019, 493667679, 494066315, 493858299, 493150558, 492610245, 492515182, 492192574, 490825577, 488749123, 487326546, 487114372, 486613922, 483835678, 479343224, 476425285, 476166191, 471423569]
3997.3D71423569k4227677n6963386q8927613
4000.2C01304893
$$ y = [471423569, 447195892, 390232506, 301304893]
##END=$$ End of the data block
