##TITLE=$$ Begin of the data block
##JCAMP-DX=5.00 $$ ACD/SpecManager v 10.08
##SPECTROMETER/DATA SYSTEM=Varian
##DATE=16 Apr 2013 13:14:20
##DATA TYPE=INFRARED SPECTRUM
##DATA CLASS=XYDATA
##ORIGIN=
##OWNER=
##NPOINTS=3735
##FIRSTX=399.26403809
##LASTX=4000.35498047
##MAXX=4000.35498047
##MINX=399.26403809
##MAXY=195.38169861
##MINY=25.63498688
##XFACTOR=1.0000000000
##YFACTOR=0.000001000000000
##FIRSTY=195.38169861
##DELTAX=0.96440572
##XUNITS=1/CM
##YUNITS=TRANSMITTANCE
##XYDATA=(X++(Y..Y))
399.3A95381699l6443375l2398560k2646560k2646561r209763N858536N858528J975823
407H5729767o865128j2528557j4287685j1944660m513374O827026J6531536J8138599
414.7G7087524J0650765L44299m789642k290787L344216N861320L026047k496033o601463
423.4H4136246p149178m608406q58818K000572K425133J48216l529587o559082p572444
432.1E8432652o508645l964981m04922L705547P365193R351421R301231Q083596O731857
440.7I2092949N219902K761337o85608l768966n000321m403343l369110k814644k051819
449.4G7980377R880K749337L658920P94616m720878r101051r109280m946087L738K201489
459.1E9521061Q48900j808098k677837m50432L401424N849125M769142P89047l009063
$$ y = [195381699, 158938324, 126539764, 103893204, 81246643, 72036880, 77895416, 83753944, 85729767, 78864639, 66336082, 52048397, 40103737, 35590363, 42417389, 58948925, 77087524, 87738289, 88082588, 83292946, 81002159, 84346375, 90207695, 93233742, 90737709, 84136246, 76987068, 72378662, 71519844, 73520416, 75945549, 76093765, 72564178, 66005096, 58432652, 51924007, 47959026, 47554104, 51259651, 58624844, 67976265, 77277496, 85361092, 92092949, 97312851, 100074188, 99388580, 95619614, 90619293, 86215950, 82846840, 80032196, 77980377, 77990257, 80739594, 84398514, 85193130, 80472252, 71371201, 62261921, 57315834, 57319572, 59521061, 60369961, 58561863, 55884026, 55433594, 58835018, 64684143, 69453285, 70242332, 67233269]
467.7F7233269l512886k35440M194760O316337M844445J571334n94215l85445Q99262
476.4H0331421Q69713j772187o212913j0114990j1116188q398236l526474L03238O87210
485.1D1050594j633487l059212n17193N123058R430916Q697907L785404o53065p95673
493.8F1429249K837322O489952P165878M989815J971482n12909k414772l777474l920059
502.5G4258484k314629K24297J920914J730903L36685o88423m97101M06655R63104
511.1G6340889O82678k1911l79647j2260P17789R71153J40800j503761k863144k872429
520.8G1200157j454193M00513J522102J484375O72417l27934j165810j635498j542710
529.5F9153419r26551k53853l5088j74812l952P96593J485740Q93502j085465k924782
$$ y = [67233269, 63720383, 63484943, 67679703, 73996040, 78840485, 80411819, 79817604, 79432159, 80331421, 81201134, 79428947, 73216034, 63101044, 51984856, 43586620, 40060146, 40363384, 41050594, 39417107, 36357895, 35840702, 40963760, 50394676, 59092583, 62877987, 62224922, 61429249, 64266571, 70756523, 77922401, 82912216, 84883698, 84370789, 81956017, 78178543, 74258484, 71943855, 72168152, 74089066, 75819969, 76156654, 75468231, 74971130, 75377785, 76340889, 77023567, 77001656, 76622009, 76609749, 77327538, 78298691, 78439491, 76935730, 74072586, 71200157, 69745964, 70146477, 71668579, 73152954, 73825371, 73497437, 72331627, 70696129, 69153419, 68226868, 67973015, 67937927, 67763115, 67759163, 68555756, 70041496, 70934998, 69849533, 66924751]
539.1F6924751k790619n11947K011764K592415R30206j108596j399742L42948K391312
547.8F9382492K796166J251541p61727j509926n99647Q34854J330086M14291j117256
556.5G2020874k032753j711288n23095O09963R66156M92996k55638n90248k34413M27704
566.1F9170258O42036m0489j272675k131263j929513q41934L18905R28234J045021
574.8F5888580J042862R09813J78124j366127l118584m090759l959221l459992l522152
583.5D8502544m055496l837837j763451J852421N332024P006782O496353M722298K893074
592.1F7148712J621651Q89191N16670M28161N23552N58281L24005q8455l31932j59202
601.8G1430634L02108O61896O32179K55722j95716m86413n61782m90494l52936k28783
$$ y = [66924751, 64134132, 63622185, 65633949, 68226364, 69156570, 68047974, 66648232, 66991180, 69382492, 72178658, 73430199, 72668472, 71158546, 70558899, 71393753, 72723839, 73138130, 72020874, 69988121, 68276833, 67753738, 68363701, 69329857, 69822853, 69567215, 68976967, 68742554, 69170258, 69812294, 69771805, 68499130, 66367867, 64438354, 63596420, 63915325, 64843559, 65888580, 66931442, 67841255, 68019379, 66653252, 63534668, 59443909, 55484688, 52024696, 48502544, 44447048, 40609211, 38845760, 40698181, 46030205, 53036987, 59533340, 64255638, 67148712, 68770363, 69659554, 70176224, 70604385, 71127937, 71686218, 72010223, 71921768, 71589836, 71430634, 71732742, 72394638, 73026817, 73282539, 73086823, 72600410, 72038628, 71548134, 71195198, 70966415]
611.4G0966415k48207n53421j128235j669075j715599j016555J87065J277641J724411
620.1F7824440J478424R27628M85008K45491L5973k65534n35614n42252k25776K02148
629.8F9629936M38812L47748M8943k03232k08984O6406M92165Q36624Q65684M70696
639.4G2784798k15615q19297r22684l77922N14786J181816J216697O98685O7307l22464
649G3806107m81896o08726p07192n26634O7474P69814J039612O62017J130l90343l55850
659.7G3275513k21260l15003n54970o17790m28154k90939m72664p82341p29721j10397
669.3F8752274O87637J044372P34971J28150k25280j20362K09450M41681M97139N06599
678.9G2656631N39460M76585J88912k15508m15764k01332K50183M85985K16034l71582
$$ y = [70966415, 70718208, 70164787, 69036552, 67367477, 65651878, 64635323, 64822388, 66100029, 67824440, 69302864, 70230492, 70715500, 70960991, 70996964, 70731430, 70195816, 69653564, 69427788, 69629936, 70068748, 70416496, 70465439, 70262207, 70053223, 70119629, 70611794, 71448418, 72314102, 72784798, 72569183, 71749886, 70827202, 70449280, 70964066, 72145882, 73362579, 74061264, 74128571, 73806107, 73324211, 72715485, 72008293, 71481659, 71549133, 72318947, 73358559, 74020576, 74021706, 73631363, 73275513, 73054253, 72739250, 72184280, 71566490, 71138336, 70847397, 70374733, 69592392, 68862671, 68752274, 69439911, 70484283, 71219254, 71347404, 71122124, 71001762, 71211212, 71652893, 72150032, 72656631, 73196091, 73672676, 73861588, 73646080, 73230316, 73028984, 73279167, 73765152, 73981186, 73609604]
688.6G3609604p74834o68655k04689J89064K56546J00502n5069j73546l85857p00286
698.2G1192780q63610n97038O0615P20208R70451P11784J78566k95814m95262l76961
707.9G1205719l7086L32862N25101M39797J47132k01080n08644p38602p94296n06943
717.5F9863960J52703Q72017J137657O87942j83761q48603r00230m81827o5750L7178
727.2G0271286q5213j45736l21K38083L63655K82738O0173j74057l22777l53737k87094
737.8F9847000j74904q0269n1048r0813j37970q3000J46523M68757O32676M08043j38390
748.4G0746605n89928n12398R4758P22404Q07793K86537l55126n94505l89801j44287
758G0072052k07382n06165o92299n60905k31781N9128K33902L79570N46966O45584
$$ y = [73609604, 72834770, 72166115, 71961426, 72150490, 72407036, 72507538, 72452469, 72278923, 71893066, 71192780, 70329170, 69732132, 69792747, 70512955, 71483406, 72195190, 72373756, 72077942, 71582680, 71205719, 71168633, 71501495, 72026596, 72466393, 72613525, 72412445, 71903801, 71165199, 70370903, 69863960, 70016663, 70888680, 72026337, 72714279, 72530518, 71681915, 70781685, 70299858, 70234108, 70271286, 70186073, 70040337, 70040016, 70278099, 70641754, 70924492, 70984665, 70810608, 70487831, 70134094, 69847000, 69672096, 69591827, 69540779, 69449966, 69311996, 69228996, 69375519, 69844276, 70476952, 70884995, 70746605, 70156677, 69644279, 69739037, 70461441, 71269234, 71555771, 71200645, 70606140, 70216339, 70072052, 69864670, 69358505, 68666206, 68105301, 67873520, 67932648, 68166550, 68546120, 69093086, 69738670]
767.7F9738670N63584L29704J01624M806K2667M8614J2887o0830j06132r5284o9381
778.3G0490929r8809k16819l85132n25421n89760n95490n83610n52941m59098k83661
787.9F6200188p7149Q9607J99112K74704K96502J82151j05072m49424o41678n67436
797.6F5401505l08709l5568J71959L48991N05593N33867L11393j17477n22354o81046
807.2F5608154n82420m19952l91282n17395o52900o53694n25643m14093m54792o44085
816.9F0351898q80169j153732j664269k643043l958794m917160m622627k755337q2035
825.5C7674732J910439K121494P79823o65825p09045R68273L259785M608284M292709
834.2E4240669K869774J445767N80471p2548j104454k468621l375000l067554j606732
$$ y = [69738670, 70302254, 70631958, 70733582, 70738388, 70761055, 70809669, 70822556, 70761726, 70655594, 70560310, 70490929, 70392120, 70175301, 69790169, 69264748, 68674988, 68079498, 67495888, 66942947, 66483849, 66200188, 66123039, 66212646, 66411758, 66686462, 66982964, 67165115, 67060043, 66610619, 65968941, 65401505, 65092796, 65057228, 65229187, 65578178, 66083771, 66617638, 66929031, 66811554, 66289200, 65608154, 65025734, 64605782, 64214500, 63697105, 63044205, 62390511, 61864868, 61450775, 60995983, 60351898, 59471729, 58317997, 56653728, 54010685, 50051891, 45134731, 40512104, 37756767, 37674732, 39585171, 41706665, 42486488, 41820663, 41111618, 42079891, 45339676, 49947960, 54240669, 57110443, 58556210, 59136681, 59064133, 57959679, 55491058, 52116058, 49048504, 47441772]
842.9D7441772J98872J587570K446842L098683L637276L680419K836026J293647j95121
851.6F6025986r49471r14833n82474m44255n91320p91005q22090o69922m63306l33973
861.2E9463337l65223o02699j033772j551067j993591k272828k459743k719120l132118
869.9D3333176l575634l781098l522972k762005j620645k44553J278622K849617M237573
878.6C6192081N096402N164943M478817L382019K320801J607369J327110J385708J589168
887.3F2544418J715874J617096J320923J021339R05587R70169J031913R31786O96579
895.9G2755684M75799L52921K76199J75400P7950N3833P5897J0063k26730n42588p47619
906.5G2736809p40082n80330l91395k42669j53595j58248k93374n14900o83517o78849
$$ y = [47441772, 47640644, 49228214, 51675056, 54773739, 58411015, 62091434, 64927460, 66221107, 66025986, 65076515, 64161682, 63579208, 63134953, 62543633, 61752628, 60930538, 60260616, 59797310, 59463337, 59098114, 58495415, 57461643, 55910576, 53916985, 51644157, 49184414, 46465294, 43333176, 39757542, 35976444, 32453472, 29691467, 28070822, 27826269, 29104891, 31954508, 36192081, 41288483, 46453426, 50932243, 54314262, 56635063, 58242432, 59569542, 60955250, 62544418, 64260292, 65877388, 67198311, 68219650, 69125237, 70095406, 71127319, 72059105, 72755684, 73231483, 73584404, 73860603, 74036003, 74113953, 74167786, 74243683, 74253746, 74027016, 73484428, 72736809, 71996727, 71416397, 71025002, 70782333, 70628738, 70470490, 70177116, 69662216, 68978699, 68299850]
916.2F8299850n18920l39356k63870l22106m83284p15339r78646j198841j310348j337891
925.8F0831249j386963j520721j680283j783382j895435k222134k857414l540516l728554
934.5D0215847k973614j264332R69666L145008M808334N722046N818981N184239M076919
943.2F5703094K875504J907654J293403R48540P27196N46158L89358K49344J12503
951.9G4752754p973p1090o7154n5534j09208k20916k94495k47398j05156K8549Q6922
962.5G3689301R3536R4765P4936j9219j73798k74528k16949l9635R0759M5555j31027
973.1G3233696k71744k64648j58669q8913j18782j77833j51573j0956J55945K30247
982.7G2376770J68831L2387p5867r7321o0867n3329j40190k96082m05342l51204j33659
$$ y = [68299850, 67780930, 67441574, 67177704, 66855598, 66372314, 65656975, 64678329, 63479488, 62169140, 60831249, 59444286, 57923565, 56243282, 54459900, 52564465, 50342331, 47484917, 43944401, 40215847, 37242233, 35977901, 36947567, 40092575, 44900909, 50622955, 56441936, 61626175, 65703094, 68578598, 70486252, 71779655, 72728195, 73455391, 74001549, 74390907, 74640251, 74752754, 74744781, 74673691, 74606537, 74551003, 74441795, 74220879, 73926384, 73678986, 73573830, 73602379, 73689301, 73782837, 73877602, 73952538, 73933319, 73759521, 73484993, 73268044, 73228409, 73319168, 73364723, 73233696, 72961952, 72697304, 72538635, 72449722, 72330940, 72153107, 72001534, 71990578, 72146523, 72376770, 72545601, 72577988, 72502121, 72404800, 72343933, 72290604, 72150414, 71854332, 71448990, 71097786, 70964127]
993.3G0964127R0728J10161j59065n63309p98538o50665j89133K72682M35707K64832
1003F9777527n005j09833m249J30317J06667o6681k17812k20962j34430j16524k34772
1013.6F8904243l96919m70695m32656l68461l43224l15422j97616K2346K53853L95210
1023.2F7050659M25781L94768L42026K61818J45660K9770k8084j6006J0116j4877r3040
1033.8F8508591j60973j59309r5520l3432k7474p4264j29418j62422j86729k32048
1043.5F7247002k92328l12142k35199o9748J02616J93512J84562J30463Q2092K0264
1053.1F7051094j13754l16826m73824m37912j74903J78382M12384M08112K12021l2272
1062.8F6712502k08031k86217k95372k63946j98426r7290L1044J61247K47826K31934
$$ y = [70964127, 71054855, 71165016, 71005951, 70442642, 69644104, 68993439, 68804306, 69076988, 69512695, 69777527, 69772522, 69662689, 69658440, 69788757, 69895424, 69828743, 69610931, 69389969, 69255539, 69139015, 68904243, 68507324, 68036629, 67603973, 67235512, 66892288, 66576866, 66379250, 66401596, 66655449, 67050659, 67476440, 67871208, 68213234, 68475052, 68620712, 68650482, 68622398, 68606392, 68616508, 68601631, 68508591, 68347618, 68188309, 68092789, 68059357, 68031883, 67957619, 67828201, 67665779, 67479050, 67247002, 66954674, 66642532, 66407333, 66337585, 66440201, 66633713, 66818275, 66948738, 67030830, 67051094, 66937340, 66620514, 66146690, 65708778, 65533875, 65712257, 66124641, 66532753, 66744774, 66712502, 66504471, 66218254, 65922882, 65658936, 65460510, 65363220, 65394264, 65555511, 65803337, 66035271]
1072.4F6035271P2075k10671n17822p20261p37587n84274l45738j12972O8058K01500
1082.1F3147579L12336M11190M76155M64866L52837J69250q255j04416j01593m6837
1091.7F5073112o263j3352n2810p9857m9607N5420K01081L01170K67090Q6807j42502
1102.3F5640289k81578k65869j55357o4842n2811q8288j16142j26694j46629j79214
1112F4162865j84849j30356m0203J7807n447j02124k24094l18966l46527k83714j41308
1122.6F2403084K1702J24199J24774O0044J1257K9419R4597J46606J45142R5600K6878
1133.2F3283302m0069r8118j42052j64226j64303j54152j47526j46599j44260j40743
1142.8F1941254j53546k04242k89616l65303l64014k43118k7008J94031L16604K93499
$$ y = [66035271, 66107346, 65896675, 65378853, 64658592, 63921005, 63336731, 62990993, 62878021, 62946079, 63147579, 63459915, 63871105, 64347260, 64812126, 65164963, 65334213, 65325958, 65221542, 65119949, 65073112, 65066849, 65053497, 65000687, 64920830, 64871223, 64926643, 65127724, 65428894, 65695984, 65782791, 65640289, 65358711, 65092842, 64937485, 64872643, 64819832, 64731544, 64615402, 64488708, 64342079, 64162865, 63978016, 63847660, 63807457, 63825264, 63819817, 63717693, 63493599, 63174633, 62828106, 62544392, 62403084, 62424786, 62548985, 62673759, 62733803, 62745060, 62774479, 62869076, 63015682, 63160824, 63256424, 63283302, 63243233, 63145115, 63003063, 62838837, 62674534, 62520382, 62372856, 62226257, 62081997, 61941254, 61787708, 61583466, 61293850, 60928547, 60564533, 60321415, 60294407, 60488438, 60805042, 61098541]
1152.5F1098541J65776L1192k8072j442N0919N1719l2158j67930k87434l41129l29815
1163.1F0210167k92221k66041k61528k67826k77065k97840l48713m45473n94280p86232
1172.7E6372948r88316j144699j208168j193897j212101j438317k020042k956383m000496
1181.4D0210529m644073m252644k378130Q67214M644030P663624Q849983P966156N726235
1190.1F4652924L285896J511230N88204J95495l6666k35192l40858l18146k39288j92383
1199.7F8871216j82045j57730j09513r0484j40465k22855k62039k29812j69548j36490
1209.4F7170235j39626j53274j64162j79581j94847j83548j36925r3063r7305j35811
1219F5692093j38336o6567J7418M021j34705k90420l16361j77162J4267J11023O9939
$$ y = [61098541, 61264317, 61295509, 61267437, 61265995, 61316914, 61368633, 61336475, 61168545, 60881111, 60539982, 60210167, 59917946, 59651905, 59390377, 59122551, 58845486, 58547646, 58198933, 57753460, 57159180, 56372948, 55384632, 54239933, 53031765, 51837868, 50625767, 49187450, 47167408, 44211025, 40210529, 35566456, 31313812, 28935682, 29802896, 34446926, 42110550, 50960533, 58926689, 64652924, 67938820, 69450050, 70038254, 70233749, 70197083, 69961891, 69621033, 69302887, 69063599, 68871216, 68689171, 68531441, 68421928, 68331444, 68190979, 67968124, 67706085, 67476273, 67306725, 67170235, 67030609, 66877335, 66713173, 66533592, 66338745, 66155197, 66018272, 65925209, 65827904, 65692093, 65553757, 65487190, 65504608, 65508629, 65373924, 65083504, 64767143, 64589981, 64604248, 64715271, 64785210]
1229.6F4785210l0129q8516p9071n0110n6282j09291j83006k39804k44877j78253n7907
1240.2F3467964N1480P7816O340j01986j71116j88027k06630k69669l41942l40408
1249.9F1983822k30549p6355J6789L871o6627j18172j30138j45748k02843k73327k82410
1260.5F0478313j88640l6724P5741Q7177K2499n3524j33766k99542o21776j018792
1270.1E8310966j241531j057114m83024J72329N43705N15522L04657K39239M57695
1278.8E7762444Q16368J059242J045032Q16979N05951K15721n554j39183j88473j91719
1288.4F1696808k08763k75948l80852m85691n64235o06018n95536n09315l43395j39817
1298.1E7587238J7285L6403j30329m43424p87670j076382j378380j890922k671856
$$ y = [64785210, 64755081, 64666565, 64587494, 64537384, 64481102, 64371811, 64188805, 63949001, 63704124, 63525871, 63467964, 63519444, 63597260, 63603600, 63501614, 63330498, 63142471, 62935841, 62666172, 62324230, 61983822, 61753273, 61676918, 61693707, 61697578, 61630951, 61512779, 61382641, 61236893, 61034050, 60760723, 60478313, 60289673, 60252949, 60328690, 60415867, 60438366, 60384842, 60251076, 59951534, 59329758, 58310966, 57069435, 56012321, 55529297, 55701626, 56245331, 56760853, 57065510, 57304749, 57762444, 58578812, 59638054, 60683086, 61500065, 62006016, 62221737, 62216183, 62077000, 61888527, 61696808, 61488045, 61212097, 60831245, 60345554, 59781319, 59175301, 58579765, 58070450, 57727055, 57587238, 57604523, 57640926, 57510597, 57067173, 56279503, 55203121, 53824741, 51933819, 49261963]
1306.8D9261963l348763l205375j767597N70785K583839L088238J963879L41339l07007
1315.4D9181301O17680K414180L770138L854275K829426J478782M71848k9243k22207
1324.1F4366180l11256l38020k64046j05732M7855J17505J00776N9242N5558J03122
1333.8F3831184J62564J78447J24344K2492p5272j26930j25774r4857o4796n6896p8240
1344.4F3696266j20701j60976j69499j29154m8965M1508J11488J42769J29398P2960
1354F3565094j5289j11241j85814k22545k25659k08198j73920j16020l5782M3221Q7234
1364.6F2401081Q0456L6747j9089p7782j45885k20501k74151k75947k27074j64627
1374.3F1113228j22166r1694l5503O1787J62139K04030J63349P8132J2078j416K2416
$$ y = [49261963, 45913200, 42707825, 40940228, 41511013, 44094852, 47183090, 49146969, 49488308, 49181301, 49798981, 52213161, 55983299, 59837574, 62667000, 64145782, 64617630, 64588387, 64366180, 64054924, 63716904, 63452858, 63347126, 63394981, 63512486, 63613262, 63672504, 63728062, 63831184, 63993748, 64172195, 64296539, 64319031, 64243759, 64116829, 63991055, 63896198, 63831402, 63774506, 63696266, 63575565, 63414589, 63245090, 63115936, 63066971, 63108479, 63219967, 63362736, 63492134, 63565094, 63549805, 63438564, 63252750, 63030205, 62804546, 62596348, 62422428, 62306408, 62270626, 62313847, 62401081, 62481537, 62518284, 62499195, 62421413, 62275528, 62055027, 61780876, 61504929, 61277855, 61113228, 60991062, 60899368, 60863865, 60925652, 61087791, 61291821, 61455170, 61533302, 61545380, 61543964, 61566380]
1384.9F1566380M8641N9334O1195O5330O6731M3961k1203j18625k01412k09919j20827
1395.5F1239586J9390J18286J10355J4142q6533j21399r3716o2748p4596j17783j42868
1406.1F0802116j15600m6929J8700L6209j2070j02481j77472j80748j04454n107L9711
1416.7F0151875J560p3673j16856j09196r5165j19236j61682j53820o1321N8471R7931
1427.3E9418888M612j57318k57774k17625p8537M0207N2162k6230j06792j20335p4230
1437.9E8477028k8736k9793p0240j09367j18222j01597q4178q4431j02959j28460j51218
1448.5E7467827j71543j97884k33848k65503k67361k30724j86215j86077k51900l42266
1458.2E5134506l86223l55766k98157k85270l33573l86955l84697l37463l25970m29146
$$ y = [61566380, 61615021, 61674355, 61735550, 61800880, 61867611, 61911572, 61890369, 61771744, 61570332, 61360413, 61239586, 61258976, 61377262, 61487617, 61501759, 61415226, 61293827, 61200111, 61137363, 61062767, 60944984, 60802116, 60686516, 60639587, 60658287, 60694496, 60682426, 60579945, 60402473, 60221725, 60117271, 60112164, 60151875, 60153435, 60079762, 59962906, 59853710, 59758545, 59639309, 59477627, 59323807, 59262486, 59320957, 59418888, 59423500, 59266182, 59008408, 58790783, 58712246, 58752453, 58804615, 58778385, 58671593, 58551258, 58477028, 58448292, 58418499, 58348259, 58238892, 58120670, 58019073, 57934895, 57850464, 57747505, 57619045, 57467827, 57296284, 57098400, 56864552, 56599049, 56331688, 56100964, 55914749, 55728672, 55476772, 55134506, 54748283, 54392517, 54094360, 53809090, 53475517, 53088562, 52703865, 52366402, 52040432, 51611286]
1467.8E1611286o69018j025409j476658j988186k452328k673096k461975j781906p94533
1476.5C6288177K54796J211940K076466K893070L595032L977543L843963L186226K224057
1485.2E9551270J265220N17578J1639l31467n85270p69745q86470r63414j044803j138737
1494.8E5625801j187565j098881q09867l28190K72705Q81817J373596J630283J583836
1503.5E7943535J266571Q19771M23046J83552P8712J0387q1375j60148j48804l4264
1513.1F0300983R7634J36783N3803p5295j43814j06392j281J00044J50230J39664P7190
1523.7F0729549k3262j37123k25784k53223k11632j30059n5435k0378k2465k9216n596
1534.3E9615376N6549J28963J67084J44546P4662J091l4668k4186J831j907n6007j33038
$$ y = [51611286, 50942268, 49916859, 48440201, 46452015, 43999687, 41326591, 38864616, 37082710, 36288177, 36542973, 37754913, 39831379, 42724449, 46319481, 50297024, 54140987, 57327213, 59551270, 60816490, 61334068, 61345707, 61014240, 60428970, 59659225, 58772755, 57809341, 56764538, 55625801, 54438236, 53339355, 52529488, 52201298, 52474003, 53355820, 54729416, 56359699, 57943535, 59210106, 60029877, 60452923, 60636475, 60715187, 60725574, 60644199, 60484051, 60335247, 60300983, 60398617, 60535400, 60589203, 60513908, 60370094, 60263702, 60262421, 60362465, 60512695, 60652359, 60729549, 60706287, 60569164, 60343380, 60090157, 59878525, 59748466, 59693031, 59672653, 59650188, 59620972, 59615376, 59671925, 59800888, 59967972, 60112518, 60187180, 60188271, 60153603, 60129417, 60131248, 60129341, 60073334, 59940296]
1545.9E9940296j76166j51913q9325n7766r4734j58642j68777j00365k7138m9499j75270
1556.5E8690701k88121k52266n1693J83300K91798K22096O1306n8854p5264k4753J1669
1567.1E8709919j7284j01761j91029k38888k41504k39746k78405l51932l93837l36559
1576.8E6318974j92719p0644r2659k90520n83134q55793j047275j147774j121838q69972
1586.4E0046646l06839N05837J317226J811340J811360J393345Q16490L37288O4316
1595.1E7797009m7608r6481j36219j60469j50853j20079j04847j25572j62697j75708
1604.7E6516476j44383r0454n9219p9197j37070j89293j98574j64238j21910j13403
1614.4E5218735j51623k08073k35748k10350j54877j21208j40602j88786k06142j58768
$$ y = [59940296, 59764130, 59612217, 59522892, 59465126, 59370392, 59211750, 59042973, 58942608, 58915470, 58865971, 58690701, 58402580, 58150314, 58098621, 58281921, 58573719, 58795815, 58857121, 58798267, 58723003, 58698250, 58709919, 58692635, 58590874, 58399845, 58160957, 57919453, 57679707, 57401302, 57049370, 56655533, 56318974, 56126255, 56055611, 55962952, 55672432, 55089298, 54233505, 53186230, 52038456, 50916618, 50046646, 49739807, 50245644, 51562870, 53374210, 55185570, 56578915, 57395405, 57732693, 57797009, 57749401, 57652920, 57516701, 57356232, 57205379, 57085300, 56980453, 56854881, 56692184, 56516476, 56372093, 56281639, 56222420, 56143223, 56006153, 55816860, 55618286, 55454048, 55332138, 55218735, 55067112, 54859039, 54623291, 54412941, 54258064, 54136856, 53996254, 53807468, 53601326, 53442558]
1624E3442558p8010l0525m4716p5009n0899L7227J13648R0236l6113j68640j97815
1634.6E3001942j01734M0855J28662J21708N5935n257k2281M482M5860O2424K7523
1645.3E3360119m8103j12652j09867l2597O3076J06674P9880L0266J7811N4260R8537
1655.9E3507404J06434P4936L8052K9335N5710J02733J53797K00837K42870K80880
1665.5E4792988L12378L27003L09902K56672J86890J34281J14815J06689P1682K209
1675.1E6615509n8472n2974K8541J25881J53107P0503q0207k06082k29824j41243l4
1685.8E6224705J07517J27113P0694M28k6951r060N623k8763j05065j68552j70830
1696.4E6026859j13880l9020J9138N7800Q5625R3010N8792j1986p2197o9977m657O3835
$$ y = [53442558, 53364548, 53334023, 53289307, 53214298, 53163399, 53200626, 53314274, 53404510, 53368397, 53199757, 53001942, 52900208, 52941063, 53069725, 53191433, 53247368, 53242111, 53219830, 53224312, 53270172, 53332596, 53360119, 53312016, 53199364, 53089497, 53056900, 53119976, 53226650, 53306530, 53336796, 53354607, 53408867, 53507404, 53613838, 53688774, 53726826, 53756161, 53811871, 53914604, 54068401, 54269238, 54512108, 54792988, 55105366, 55432369, 55742271, 55998943, 56185833, 56320114, 56434929, 56541618, 56613300, 56615509, 56557037, 56504063, 56532604, 56658485, 56811592, 56882095, 56801888, 56595806, 56365982, 56224739, 56224705, 56332222, 56459335, 56530029, 56530457, 56503506, 56494446, 56500069, 56471306, 56366241, 56197689, 56026859, 55912979, 55873959, 55893097, 55950897, 56036522, 56129532, 56188324, 56176338, 56104141, 56034164, 56029507, 56093342]
1707.9E6093342P0495J1174n0568m4128M0081J41445J83731J39137M6147k7646l9611
1718.5E6563599O75M6818N6190K2617k2129l7593j0273L4381N4261K7538k9106p7286
1730.1E6629692r2052q1360p2338p8266q1189m9991K0626R0172R8602K2087r3853j62819
1741.7E6149311j29360j8448Q6845J19843Q3038L0686O122M673m383l1860n6282n5325
1753.3E6184860l5785k5181l7968o1520p6091p9090q1315q3751p0633l1132J7971M1920
1764.8E5662285K3395j5251l0910j801M9580P6374N0789j0407o0611o4343k6192J7334
1776.4E5670242L3238J9748Q36l609J167n706l3604o7528q3076p2376n1999m5593n9505
1788.9E5302235p5844o8752k9595K1946N2189M3362J2817j007K2457O0318O5674J7216
$$ y = [56093342, 56163837, 56175011, 56124443, 56080315, 56120396, 56261841, 56445572, 56584709, 56630856, 56603210, 56563599, 56564274, 56611092, 56667282, 56689899, 56667770, 56630177, 56619904, 56654285, 56708546, 56736084, 56706978, 56629692, 56537640, 56456280, 56383942, 56305676, 56224487, 56174496, 56195122, 56285294, 56383896, 56405983, 56312130, 56149311, 56019951, 56001503, 56088348, 56208191, 56291229, 56321915, 56328037, 56332710, 56328327, 56296467, 56240185, 56184860, 56149075, 56123894, 56085926, 56024406, 55948315, 55869225, 55787910, 55704159, 55633526, 55602394, 55620365, 55662285, 55685680, 55670429, 55639519, 55637718, 55687298, 55763672, 55814461, 55804054, 55743443, 55679100, 55652908, 55670242, 55703480, 55723228, 55724064, 55720455, 55721622, 55715916, 55682312, 55614784, 55531708, 55459332, 55407333, 55361740, 55302235, 55226391, 55157639, 55128044, 55149990, 55202179, 55245541, 55258358, 55257351, 55279808, 55340126, 55405800, 55423016]
1800.5E5423016n3368r0324p0630k6294p157k7496n6698n9933l6876j5003j2116j7582
1812.1E4949539j1272R426K8007K9522J3874r399l0697m0878l1670n779J5243N352
1823.7E4921268l7685q4042j00200q4290o4480o0352n5378j7906N2006J08196R8499
1834.3E4675636J8212q1208j36123j21556o2084k441K6119J7063j9607o6819j04560
1844.9E4142632j15784r7103o5861n2055p6836j34331j94786k29114k34631k35435
1854.5E2706696k52823k72957k47933j37653M3747K24541L24348L11909K19711J06407
1864.2E3025993R777o5109j21685j49612j32263p1480M471O2217R0824J05294J24382
1874.8E2882809J48704J62464J53767J28532J04065R1584Q8234Q4915P7388O6609N0812
$$ y = [55423016, 55369648, 55279324, 55208694, 55182400, 55175243, 55147747, 55091049, 55031116, 54994240, 54979237, 54967121, 54949539, 54938267, 54947693, 54975700, 55005222, 55019096, 55009697, 54979000, 54938122, 54906452, 54900673, 54915916, 54921268, 54883583, 54799541, 54699341, 54615051, 54550571, 54490219, 54434841, 54416935, 54468941, 54577137, 54675636, 54693848, 54612640, 54476517, 54354961, 54292877, 54290436, 54316555, 54333618, 54314011, 54247192, 54142632, 54026848, 53929745, 53863884, 53811829, 53734993, 53600662, 53405876, 53176762, 52942131, 52706696, 52453873, 52180916, 51932983, 51795330, 51839077, 52063618, 52387966, 52699875, 52919586, 53025993, 53035770, 52970661, 52848976, 52699364, 52567101, 52495621, 52500092, 52562309, 52653133, 52758427, 52882809, 53031513, 53193977, 53347744, 53476276, 53580341, 53671925, 53760159, 53845074, 53922462, 53989071, 54039883]
1885.4E4039883K4116j3580m7066n3982k5783J9958N2750N5309L5496J2344n111k1508
1896.9E4072826m0321n3738n2066l9811l4481m7054o7734p6328o4049m0558j9714n245
1908.5E3531727N237P683n836k9328l6609m170N8213J07563J05384N3791r410n0385
1920.1E3733860o7043p7042q6819q3492n8147k6631j7368l8437o5002o4297l1323N036
1931.7E3123295J1360j7586n4996o7555m2591N478M9236O7299N4482K1251j5224m1222
1943.2E3093227n2337n1678m3915l2326k1053j7284k7077m8653p0575p9369o8882m3804
1954.8E2536274j5717L174N211q144k4731k8889j5796n4l978l2853o2595n8784j2112
1967.3E2281006M6673P0800L9757k2430o9740p3609m1946n158J1643M043j5568l0120
$$ y = [54039883, 54063999, 54050419, 54003353, 53949371, 53923588, 53943546, 53996296, 54051605, 54087101, 54099445, 54094334, 54072826, 54032505, 53978767, 53926701, 53886890, 53852409, 53805355, 53737621, 53661293, 53597244, 53556686, 53536972, 53531727, 53536964, 53544647, 53538811, 53509483, 53472874, 53468704, 53526917, 53634480, 53739864, 53793655, 53784245, 53733860, 53666817, 53589775, 53502956, 53419464, 53361317, 53334686, 53317318, 53278881, 53213879, 53149582, 53118259, 53123295, 53134655, 53117069, 53062073, 52994518, 52951927, 52957405, 53006641, 53073940, 53128422, 53149673, 53134449, 53093227, 53040890, 52989212, 52945297, 52912971, 52891918, 52874634, 52847557, 52798904, 52728329, 52648960, 52580078, 52536274, 52520557, 52523731, 52528942, 52520798, 52496067, 52467178, 52451382, 52451328, 52447350, 52414497, 52351902, 52293118, 52281006, 52327679, 52398479, 52438236, 52415806, 52346066, 52272457, 52230511, 52225353, 52236996, 52241039, 52225471, 52195351]
1978.9E2195351k8477j0773J1055K0436Q419j8696m5391o0753o4579n9715m3068j0365
1990.5E1893444K9495N2368L8090o630n0354o4895n1197l4069l2795m0680l5118n448
2002.1E1692211L2948N1490L3875j0357n3478o9073m9366q888K5734L3966J3924j9463
2013.6E1673523m7688n9635n2486k8286M780K9804K8679j576m1244o2973n6889l8299
2025.2E1347710k9457l7148n0644n7041n1823l5083o775K7458N1204M8996K5509M864
2036.8E1237770M116J2024L426k5055m4522k6298J9260M6604J9989n0014j16756j38501
2048.4E0942043j06350m0229K8511O8599N7179n409q5732j32774j15212m7119K4048
2059E0587555N6213M1397L643k3735j9935J3344N3180O8692M3140r865n4813o4888
$$ y = [52195351, 52166874, 52156101, 52167156, 52187592, 52196011, 52177315, 52131924, 52071171, 52006592, 51946877, 51903809, 51893444, 51922939, 51975307, 52013397, 52006767, 51956413, 51891518, 51840321, 51806252, 51773457, 51732777, 51697659, 51692211, 51725159, 51776649, 51810524, 51800167, 51746689, 51677616, 51628250, 51619362, 51645096, 51679062, 51692986, 51673523, 51625835, 51566200, 51513714, 51485428, 51490208, 51520012, 51548691, 51547115, 51505871, 51442898, 51386009, 51347710, 51318253, 51281105, 51230461, 51173420, 51121597, 51086514, 51079739, 51107197, 51158401, 51207397, 51232906, 51237770, 51241886, 51253910, 51257336, 51232281, 51187759, 51161461, 51180721, 51227325, 51247314, 51197300, 51080544, 50942043, 50835693, 50795464, 50823975, 50892574, 50949753, 50944344, 50858612, 50725838, 50610626, 50563507, 50587555, 50643768, 50685165, 50688808, 50665073, 50645138, 50658482, 50711662, 50780354, 50823494, 50813629, 50758816, 50693928]
2070.5E0693928m5716k6454k7562m1256m5333l2044j5999j4152k3960k6547j0376J4149
2082.1E0398678K5181J1383j8902m7756o1947n7427l6743q152J3180J1764j3607m2270
2093.7E0173382m5376j2489L5904O5540N9162K9408K132r632j2653j8437k8068l4539
2105.2E0204334l5488l7044m3827m9977m4205k3239K991K0603K4311J9505J3389N917
2116.8E0057270r476l6441o6884q2874p0282l3279N333K2720J6617N989P866J5995
2128.4D9832554P061l0304p7229r9624q0380l3211J3443M0265M3300K5799n444l5160
2140D9601070m2934k0649J4427L2967K2831Q70p050N627K2487K5486J2215r312l4492
2152.5D9623543o2302q4408q3831n0919K136M6978N9639L4737j5530o8214r5825p7424
$$ y = [50693928, 50648212, 50621758, 50594196, 50552940, 50507607, 50475563, 50459564, 50445412, 50421452, 50394905, 50384529, 50398678, 50423859, 50435242, 50416340, 50368584, 50306637, 50249210, 50212467, 50204315, 50217495, 50229259, 50215652, 50173382, 50128006, 50115517, 50151421, 50216961, 50276123, 50305531, 50307663, 50298031, 50285378, 50266941, 50238873, 50204334, 50168846, 50131802, 50087975, 50037998, 49993793, 49970554, 49973545, 49994148, 50018459, 50037964, 50051353, 50057270, 50047794, 50011353, 49944469, 49861595, 49791313, 49758034, 49763367, 49786087, 49802704, 49808693, 49816559, 49832554, 49839615, 49809311, 49732082, 49632458, 49552078, 49518867, 49532310, 49572575, 49615875, 49641674, 49636230, 49601070, 49558136, 49537487, 49551914, 49584881, 49607712, 49608582, 49601532, 49607159, 49629646, 49655132, 49667347, 49658035, 49623543, 49561241, 49476833, 49393002, 49342083, 49344219, 49391197, 49450836, 49485573, 49470043, 49401829, 49306004, 49228580]
2164.1D9228580j6887M8988P1934L2776l7808q3473p0656j3904M3365O7909N6813K7881
2175.6D9355518O26j3405j1478p82L181j2222m2401o5742o3583l9929j7864j5797l0323
2188.2D9045799m4056m6241m0665l4195k4422m150K4204M4773M1931J6320j4790l2589
2199.8D8931919l0750j6937m689m169j7079l4732m2385k9931k464K1137K4124P489
2211.3D8801533j1471j7433j1315n016m440k690P798K0271J6975j0948n0121p5783
2222.9D8657360p5619o0283m8409m4449l5690j1757J7223K6898M665l3539n5500m2228
2234.5D8298672m479K9938M2145L4805K2434J4988J3531J7033K5356L3371K8026o48
2246D8555172m3751p3639o6810k7069J5243K9369Q988k7115n4382o0486m8145k9255
$$ y = [49228580, 49211693, 49260681, 49332615, 49365391, 49327583, 49244110, 49173454, 49159550, 49202915, 49270824, 49327637, 49355518, 49356144, 49342739, 49331261, 49330479, 49333660, 49321438, 49279037, 49213295, 49149712, 49109783, 49091919, 49076122, 49045799, 49001743, 48955502, 48914837, 48880642, 48856220, 48852070, 48876274, 48921047, 48962978, 48979298, 48964508, 48931919, 48901169, 48884232, 48879543, 48875374, 48858295, 48823563, 48781178, 48751247, 48748783, 48769920, 48794044, 48801533, 48790062, 48772629, 48761314, 48756298, 48751858, 48749168, 48756966, 48777237, 48794212, 48783264, 48733143, 48657360, 48581741, 48521458, 48473049, 48428600, 48392910, 48381153, 48398376, 48425274, 48429939, 48396400, 48340900, 48298672, 48294193, 48324131, 48366276, 48401081, 48423515, 48438503, 48452034, 48469067, 48494423, 48527794, 48555820, 48555172, 48511421, 48437782, 48370972, 48343903, 48359146, 48388515, 48397503, 48370388, 48316006, 48255520, 48207375, 48178120]
2257.6D8178120j8944k9404n8986q5198p6530k1645N0308Q5861N2212k9575r8229j02752
2269.2D7845238m3457L3115P6778P2709M4101K3526K3246K9320J9962j1520m8916o6730
2280.8D7997372n3715k5131j0468k4715n0877n4542k0363K6748M1451K697o2893j05064
2292.3D7660500r7485n8792k7203j9321j8841l113K6844M7074L7502K167l6751n9216
2303.9D7453365n9303m3499k3796j2535j5526k5829k8252j6117k995j0616m1641o9626
2315.5D7103630o2397j5491M1603P2902O4942K8961j6277n5012p2968o1771l4138k4894
2327.1D6969090o0402j21975j52211j09531j4805O5323Q2771M7531J996l0774n8517
2337.7D6618496q5491q9237m7863J7723N1181K0222l9722n5096J1162J19427J86870
$$ y = [48178120, 48159176, 48129772, 48070786, 47985588, 47909058, 47887413, 47937721, 48023582, 48075794, 48046219, 47947990, 47845238, 47801781, 47834896, 47911674, 47984383, 48028484, 48052010, 48075256, 48104576, 48124538, 48113018, 48064102, 47997372, 47943657, 47918526, 47908058, 47883343, 47832466, 47777924, 47757561, 47784309, 47825760, 47828457, 47765564, 47660500, 47563015, 47504223, 47477020, 47457699, 47438858, 47435745, 47462589, 47509663, 47547165, 47549332, 47512581, 47453365, 47394062, 47350563, 47326767, 47314232, 47298706, 47272877, 47244625, 47228508, 47225513, 47214897, 47173256, 47103630, 47041233, 47025742, 47067345, 47140247, 47205189, 47234150, 47217873, 47162861, 47089893, 47028122, 46993984, 46969090, 46908688, 46786713, 46634502, 46524971, 46510166, 46575489, 46658260, 46705791, 46707787, 46677013, 46618496, 46533005, 46443768, 46395905, 46413628, 46464809, 46485031, 46445309, 46390213, 46401375, 46520802, 46707672]
2348.3D6707672J55842L2982j20995k26547k23221j05202N9315J56025J04729o6414
2357.9D6474186k30728k63943j47163K5966J38733J41846O4495l7971j24413j63177
2367.6D5877831j22616K693J57032K42630J97990O0437o1306q3744j7968N5226P0076
2378.2D6378281K9918j4770k6379j1253l09j2104l8346n7086n2617k4646J4911M9969
2389.7D6235569O8527O7448N0739K3651j0383m5712o9881o8951m1191m585J3843m27
2401.3D6218647l6327o6029o6727l7128M585L5847M4243L0815L628k9065n9387p6259
2412.9D5966843o6952k6970K9575P2903P6519L7689j9615o2599p2308n2868k3159j503
2424.5D5857555M319j358p737o137K487Q636M761m921q141q50L334j4034n1342p9247
$$ y = [46707672, 46863514, 46896496, 46775501, 46548954, 46325733, 46220531, 46279846, 46435871, 46540600, 46474186, 46243458, 45979515, 45832352, 45858318, 45997051, 46138897, 46203392, 46165421, 46041008, 45877831, 45755215, 45757908, 45914940, 46157570, 46355560, 46415997, 46354691, 46270947, 46252979, 46308205, 46378281, 46408199, 46393429, 46367050, 46355797, 46355488, 46343384, 46305038, 46247952, 46195335, 46170689, 46185600, 46235569, 46304096, 46371544, 46422283, 46445934, 46435551, 46389839, 46319958, 46251007, 46209816, 46205231, 46219074, 46218647, 46182320, 46116291, 46049564, 46012436, 46017021, 46052868, 46097111, 46127926, 46131554, 46102489, 46043102, 45966843, 45899891, 45872921, 45902496, 45975399, 46051918, 46089607, 46069992, 46007393, 45935085, 45882217, 45859058, 45857555, 45861874, 45860516, 45852779, 45846642, 45849129, 45857765, 45862526, 45857605, 45849464, 45848614, 45851948, 45837914, 45786572, 45707325]
2438D5707325o5403r590M8801O3877K6230k7988n1682l0739O283K0050j217l5144n2899
2450.5D5597904m8588l9268m0447m8066m6630l1403j5026j1086j5056q080K0008N5260
2462.1D5369522P0152M9778O352l0659l8010j4980J6785K8156K926m7520q7948q4796
2473.6D5239758l5714K5284N6137M3190R392j2497j1326n68L391j778j0139k1175l8876
2486.2D5245079n9429o8279n4856k6382j755P710O527M398L998K948L087R101J7010
2498.7D5089157J2299j3035m3835n1372k3079K0309M2862K7641r586l9795m8347m1664
2510.3D4921555l2040k3499j3652k636M913N474n00j2294l0941n4207p1919p1510n0171
2522.8D4568573j9756K533Q072N41j1509k2739l0930l3710k9209k0733j6556k2270
$$ y = [45707325, 45641922, 45632332, 45681133, 45745010, 45771240, 45743252, 45691570, 45660831, 45667114, 45687164, 45685947, 45650803, 45597904, 45549316, 45510048, 45469601, 45421535, 45374905, 45343502, 45328476, 45317390, 45302334, 45294254, 45314262, 45369522, 45439674, 45489452, 45495804, 45465145, 45427135, 45412155, 45428940, 45457096, 45460022, 45412502, 45324554, 45239758, 45204044, 45229328, 45285465, 45328655, 45338047, 45325550, 45314224, 45313656, 45317047, 45315269, 45305130, 45283955, 45245079, 45185650, 45117371, 45062515, 45036133, 45034378, 45042088, 45048615, 45053013, 45057011, 45059959, 45063046, 45072147, 45089157, 45101456, 45088421, 45044586, 44993214, 44970135, 44990444, 45033306, 45060947, 45051361, 45011566, 44963219, 44921555, 44889515, 44866016, 44852364, 44849728, 44854641, 44860115, 44859615, 44847321, 44816380, 44762173, 44690254, 44618744, 44568573, 44548817, 44551350, 44559422, 44559963, 44548454, 44525715, 44494785, 44461075, 44431866, 44411133, 44394577, 44372307]
2534.4D4372307l3577l8696k9232q053J3530K5540K6012J9409J0628J435q481j8222
2546D4332600k4823k5032j8810j0586p065j2416k4662l6538m0592l4740k3632j4874
2557.5D4058830j2764j4862j3721l460J3927K8466L0036J8307N009L662J5106K3258
2569.1D4151794Q278l2737p7675r4498o7696j2752L5988N3413M1622K2377J3131J1901
2580.7D4053146N360j1478k7348k8007j4309l205r163k7549l9757l4222j9367j3828
2592.2D3830273k5688m3751m9385l4294o279J9405L1315K6340Q114j5011l2325l5695
2603.8D3673019k5028q804K880O737P469J1837K0595K6413J9471l605l4867n8990o4808
2616.4D3572319n4161l8887k7622j7136Q66K4841L8998K8072m585l7235m9404l9395
$$ y = [44372307, 44338730, 44300034, 44270802, 44262749, 44276279, 44301819, 44327831, 44347240, 44357868, 44359303, 44350822, 44332600, 44307777, 44282745, 44263935, 44253349, 44246284, 44233868, 44209206, 44172668, 44132076, 44097336, 44073704, 44058830, 44046066, 44031204, 44017483, 44014023, 44027950, 44056416, 44086452, 44104759, 44109768, 44113430, 44128536, 44151794, 44160072, 44127335, 44049660, 43955162, 43887466, 43874714, 43910702, 43964115, 44005737, 44028114, 44041245, 44053146, 44058506, 44047028, 44019680, 43991673, 43977364, 43974159, 43964996, 43937447, 43897690, 43863468, 43844101, 43830273, 43804585, 43760834, 43711449, 43677155, 43670876, 43690281, 43721596, 43747936, 43756050, 43741039, 43708714, 43673019, 43647991, 43639187, 43642067, 43648804, 43656273, 43668110, 43688705, 43715118, 43734589, 43730984, 43696117, 43637127, 43572319, 43518158, 43479271, 43451649, 43434513, 43435379, 43460220, 43499218, 43527290, 43522705, 43485470, 43436066, 43396671]
2627.9D3396671k1366q396k346P63K285J347M5K178N730K281j2481l0068l6144k6184
2641.4D3274315j0483j804j869l453l166o542j8955l6435m9408n3211n0518m3770l1665
2654D2963036j5091k304j618r857j4755j1704j2447l0235n7648o7169l9677J0277M3812
2666.5D2754620L4202p957m6307n2551k6650J1330M2099N7632N6996M0447J1314j9836
2678.1D2855339l8429l6553k0877p935r823k2564k9003j5324J3550L4836K6867r930
2689.6D2740154n0510o4617m1451K003L5316L8014J3038j7860l0823j5865J7532M7531
2701.2D2672462N4581L2665r265n4883q8691r9461q1444l7849J5121N2594N5317K3990
2712.8D2535137k0553n2643n9746m7741l2200k5642l0255l8490l9127k5295j359J7518
$$ y = [43396671, 43375305, 43366909, 43364563, 43365326, 43367611, 43368958, 43369003, 43371181, 43376911, 43379192, 43366711, 43336643, 43300499, 43274315, 43263832, 43262028, 43260159, 43256706, 43253540, 43246998, 43228043, 43191608, 43142200, 43088989, 43038471, 42994701, 42963036, 42947945, 42945641, 42944023, 42934166, 42919411, 42907707, 42895260, 42865025, 42807377, 42740208, 42700531, 42710808, 42754620, 42788822, 42780865, 42734558, 42682007, 42655357, 42666687, 42708786, 42766418, 42823414, 42863861, 42875175, 42855339, 42816910, 42780357, 42759480, 42751545, 42741722, 42719158, 42690155, 42674831, 42688381, 42723217, 42750084, 42740154, 42689644, 42625027, 42583576, 42585579, 42620895, 42658909, 42671947, 42654087, 42623264, 42607399, 42624931, 42672462, 42727043, 42759708, 42750443, 42695560, 42606869, 42507408, 42425964, 42388115, 42403236, 42455830, 42511147, 42535137, 42514584, 42461941, 42402195, 42354454, 42322254, 42296612, 42266357, 42227867, 42188740, 42163445, 42162086, 42179604]
2724.4D2179604J5918p694l6613m7501k9732N852L6549M6386L6774K0138O073n974
2735.9D2219780k1679m2061o0047o5929n5787l3973j0201N776P656m269k1305k9201
2747.5D1888760j7723Q464L0079K7638q66l6942n6301m8008k0069J0323K9106K9579
2759.1D1844040J0475k3472n8967p7931p0213m4197k2007k0100l3375l8898j6739L0579
2770.7D1479195P7560R4761P1510K4452j4980k3849l765K3052L3466K1046l113k4239
2782.2D1755096l6468m2511m4533m0699l1181k3991k9609m7596o1764n2033j3073L8658
2793.8D1370296P6935Q4591O2927K7138m745k0474j8131p004k838j6605m4163o7326
2805.4D1440601o9049m8623k2258q793j5244l4828n4676o2511m9630j5690K5143M7581
$$ y = [42179604, 42195522, 42187828, 42151215, 42103714, 42073982, 42079834, 42116383, 42162769, 42199543, 42219681, 42225754, 42219780, 42198101, 42156040, 42095993, 42030064, 41974277, 41940304, 41930103, 41935879, 41943535, 41939266, 41917961, 41888760, 41871037, 41879501, 41909580, 41937218, 41936352, 41899410, 41843109, 41795101, 41775032, 41785355, 41814461, 41844040, 41854515, 41831043, 41772076, 41694145, 41623932, 41579735, 41557728, 41537628, 41504253, 41465355, 41448616, 41479195, 41556755, 41651516, 41723026, 41747478, 41732498, 41708649, 41704884, 41727936, 41761402, 41782448, 41779335, 41755096, 41718628, 41676117, 41631584, 41590885, 41559704, 41535713, 41506104, 41458508, 41396744, 41344711, 41331638, 41370296, 41447231, 41531822, 41594749, 41621887, 41617142, 41596668, 41578537, 41571533, 41568695, 41552090, 41507927, 41440601, 41371552, 41322929, 41300671, 41291878, 41276634, 41241806, 41187130, 41124619, 41074989, 41059299, 41084442, 41132023]
2816.9D1132023L4508l468l2951k8515j53J5450o127m8912p0728m5773J0155N6210
2828.5D1011719O4472L9612N749j8757l1723l9105m4304m6928m6822m4193l7006k1557
2840.1D0791157J461K2842K9957J7681n653k4201k7828k0981j7616k6634m1844m7565
2851.7D0650776l5786j5766m497p225j1254k388J4431J7582n615l8941m9812k3552
2863.2D0487953J8879M0917K6256q869l7785n0880n7217o3823o2695m2721q411K0477
2874.8D0262081K9057K1507J2573Q381J591j4683l4470m3659l5759j8238m360k121
2886.4D0181900j2348l2089n4501o7181n8319k9617j68Q473p340l0460m2130m0703
2897.9C9815517l8299m0810l7636j4442K6775O4465P4848N0648L982m4605p7160q3896
$$ y = [41132023, 41166531, 41163063, 41130112, 41101597, 41101444, 41116894, 41110767, 41061855, 40991127, 40945354, 40955509, 41011719, 41076191, 41115803, 41121552, 41102795, 41071072, 41031967, 40987663, 40940735, 40893913, 40849720, 40812714, 40791157, 40792618, 40815460, 40845417, 40863098, 40857445, 40833244, 40805416, 40784435, 40766819, 40740185, 40698341, 40650776, 40614990, 40599224, 40594727, 40587502, 40576248, 40573860, 40588291, 40605873, 40600258, 40561317, 40511505, 40487953, 40506832, 40547749, 40574005, 40565136, 40527351, 40476471, 40419254, 40355431, 40292736, 40250015, 40241604, 40262081, 40291138, 40312645, 40325218, 40333599, 40335190, 40320507, 40286037, 40242378, 40206619, 40188381, 40184021, 40181900, 40169552, 40137463, 40082962, 40015781, 39957462, 39927845, 39927677, 39936150, 39928810, 39898350, 39856220, 39815517, 39777218, 39736408, 39698772, 39684330, 39711105, 39775570, 39850418, 39901066, 39905048, 39860443, 39783283, 39699387]
2909.5C9699387o5770l5045r445L81j430k289L280P233j244k0191l3165k4406N348
2922.1C9522644L8429N4112M3098J1601k4277m8462n3181m3365l2715l2940m4044n5004
2933.6C9335896n4982m3850l1074k5082k5348k4983j9695j2585j1036k0534m0696o4929
2945.2C8961102q1547p7938m8939m212L3444M3014K2488p809k1080o450K3132M4025
2956.8C8879230M3984L1395K4670L2856M7336N0991L4546L788k7645m9992o1489o3320
2968.3C8946350n4489l4226q968P363L410j8009l9715m4521l0400j2253p873k0767
2979.9C8685902l6690l5942j1234K4185M4494L0285j4595o0962p1896l0506M3278J02806
2991.5C8669125J08268N6935j5667o4560o8848m0733p443J2734J7898J3447J846j6700
$$ y = [39699387, 39633617, 39598572, 39589127, 39589508, 39588078, 39585789, 39589069, 39596302, 39595058, 39574867, 39541702, 39517296, 39522644, 39561073, 39615185, 39658283, 39669884, 39645607, 39597145, 39543964, 39500599, 39467884, 39434944, 39390900, 39335896, 39280914, 39237064, 39205990, 39180908, 39155560, 39130577, 39110882, 39098297, 39087261, 39066727, 39026031, 38961102, 38879555, 38801617, 38752678, 38748466, 38781910, 38824924, 38847412, 38839603, 38818523, 38812073, 38835205, 38879230, 38923214, 38954609, 38979279, 39012135, 39059471, 39110462, 39145008, 39148796, 39121151, 39071159, 39009670, 38946350, 38891861, 38857635, 38848667, 38856030, 38859440, 38841431, 38801716, 38757195, 38726795, 38714542, 38706669, 38685902, 38649212, 38613270, 38602036, 38626221, 38670715, 38701000, 38686405, 38625443, 38553547, 38523041, 38566319, 38669125, 38777393, 38834328, 38818661, 38754101, 38685253, 38644520, 38637077, 38649811, 38667709, 38681156, 38683002, 38666302]
3003.1C8666302l7918n2979n5462m7500l6736k8286k0889j0777J320Q526L113j5843
3014.6C8372871l9302n2617m5852k2839j121r65k9946p5828j14003j24309j04275o9351
3026.2C7692463m1813l6674n4043q1276j03909j17267j30280j56265j97689k40097
3035.9C6533150k63806k64431k60898k79339l26302l77140l93387l53080k65068j54412
3045.5C3595287l5717R7042K53041M19311N55401O16764N87185M90528L73326K74330
3055.1C7226498K06550J61366J24313Q7067M9461J5881r308k5738l9986o2538r8530
3065.7C7635036j40071j70914j83132j89118k14111k72942l52558m17961m35234l91342
3075.4C4867653k96711j74179m6719P0378J73618K71355L74572M80961N65216N89939
$$ y = [38666302, 38628384, 38575405, 38519943, 38472443, 38435707, 38407421, 38386532, 38375755, 38377075, 38385601, 38388714, 38372871, 38333569, 38280952, 38235100, 38212261, 38211140, 38210175, 38180229, 38104401, 37990398, 37866089, 37761814, 37692463, 37650650, 37613976, 37559933, 37478657, 37374748, 37257481, 37127201, 36970936, 36773247, 36533150, 36269344, 36004913, 35744015, 35464676, 35138374, 34761234, 34367847, 34014767, 33749699, 33595287, 33559570, 33656612, 33909653, 34328964, 34884365, 35501129, 36088314, 36578842, 36952168, 37226498, 37433048, 37594414, 37718727, 37805794, 37855255, 37871136, 37861828, 37836090, 37796104, 37733566, 37635036, 37494965, 37324051, 37140919, 36951801, 36737690, 36464748, 36112190, 35694229, 35258995, 34867653, 34570942, 34396763, 34350044, 34420422, 34594040, 34865395, 35239967, 35720928, 36286144, 36876083]
3085C6876083N32898M08635K63942J47980Q1696N0781K5791r152m3525n3726k8897
3095.6C8252506J4508M4033L8257L987l1796m6299l6911j5606O214K4056L4279L0262
3107.2C8317490R967j4911k5246j3721M879P415j2809l8098m4906k8294n909J083j2741
3119.8C8144199l5793n2730n4848m0318j1486K3434M8542M7115J4073l7411q3740j05587
3131.3C7855450r7069o4823k1950J6216L6251L2448J1185j2257k4421k2748j4839r327
3142.9C7684116q335p480k163P335J4855J2069n008l0285m8168m4224j9817M051K533
3155.4C7559479k8664o5323p4699m7646j0017K29l0632p8156j02302q3878m0031n673
3167C6992687j293j7513k8149j6369J0479K9186K2553m749l0278l4042j6834M73k999
$$ y = [36876083, 37408981, 37817616, 38081558, 38229538, 38311234, 38362015, 38387806, 38378654, 38335129, 38281403, 38252506, 38267014, 38311047, 38349304, 38353291, 38321495, 38275196, 38238285, 38222679, 38228893, 38252949, 38287228, 38317490, 38327457, 38312546, 38287300, 38273579, 38278458, 38285873, 38273064, 38234966, 38190060, 38161766, 38155857, 38156940, 38144199, 38108406, 38055676, 38000828, 37960510, 37949024, 37972458, 38021000, 38068115, 38082188, 38044777, 37961037, 37855450, 37758381, 37693558, 37671608, 37687824, 37724075, 37756523, 37767708, 37755451, 37731030, 37708282, 37693443, 37684116, 37675781, 37668301, 37666138, 37673473, 37688328, 37700397, 37695389, 37665104, 37616936, 37572712, 37552895, 37556946, 37559479, 37530815, 37465492, 37390793, 37343147, 37333130, 37333359, 37302727, 37224571, 37122269, 37038391, 36998360, 36992687, 36991394, 36973881, 36945732, 36929363, 36939842, 36969028, 36991581, 36986832, 36956554, 36922512, 36905678, 36906151, 36903152]
3179.5C6903152k7412n1834n5344l8120k0218j9310l1719l7933k5479l681N817q644
3191.1C6589275l8318o3500p0457n7942l2371k678K0065K3857L632l1200o0582o8184
3202.7C6211597n3485k9355j0078k834q335k4243m5170o2175o7482o2359n7247o0841
3214.3C5727993o8249o2420k9457K5402P6615R3616O1203q144p9239j14319r7530m7131
3225.8C5478340k781L823k7119o6612q4069p3032n2349m4003n1792o0520n4455l3443
3237.4C4931988j1959l445p774j3550j1063k510P48j0407l4263n9853p4978p2963n4596
3249.9C4575375k6871j213J1516P969l879j1219r346p210j7517m0726o1806o4754m9099
3262.5C4301220k9194j7830j4007q553J350P809K625j1971k6214l4058l7975m2447
$$ y = [36903152, 36875740, 36823906, 36768562, 36730442, 36710224, 36690914, 36659195, 36621262, 36595783, 36592102, 36597919, 36589275, 36550957, 36487457, 36417000, 36359058, 36326687, 36324009, 36344074, 36367931, 36371563, 36340363, 36279781, 36211597, 36158112, 36128757, 36118679, 36115845, 36107510, 36083267, 36038097, 35975922, 35908440, 35846081, 35788834, 35727993, 35659744, 35597324, 35567867, 35593269, 35669884, 35763500, 35824703, 35816559, 35737320, 35623001, 35525471, 35478340, 35475559, 35479382, 35452263, 35385651, 35301582, 35228550, 35176201, 35132198, 35080406, 35019886, 34965431, 34931988, 34920029, 34916584, 34908810, 34895260, 34884197, 34881687, 34882435, 34872028, 34837765, 34777912, 34702934, 34629971, 34575375, 34548504, 34547291, 34558807, 34566776, 34562897, 34551678, 34542332, 34535122, 34517605, 34476879, 34415073, 34350319, 34301220, 34272026, 34254196, 34240189, 34231636, 34232986, 34240795, 34243420, 34231449, 34205235, 34171177, 34133202, 34090755]
3274C4090755m6787m6917m1649l3214k2190o867R133J3179o160m3072p3654p6432n3894
3286.6C3662231l0246k6387l9943n1674m8153l3760k1015j5843j6437k2457l6267n3299
3298.2C3266750n7865l7876l345J7261M284l1425n9399o1913n0449m8477o2351p5398
3309.7C2799797o9668m7157k6413k2099l2455m5620n1605m7322l5213k3815k6638n1762
3321.3C2320030q8302j08532r1839m7955j1455r333l5477o0783o6269o1079o6599q8404
3332.9C1584003j09489j10596r0946o6013m8691l8744l0128k2717k2390l1350m4229
3343.5C0968710n5542o7108q4362j05421j18397j12196q8593o1714m5932m5632n6553
3354.1C0127260p2857r0402j04550j10426j07576j02671j02918j06499j02263q1775
$$ y = [34090755, 34043968, 33997051, 33955402, 33922188, 33899998, 33893131, 33902264, 33915443, 33909283, 33866211, 33792557, 33716125, 33662231, 33631985, 33605598, 33565655, 33513981, 33465828, 33432068, 33411053, 33395210, 33378773, 33356316, 33320049, 33266750, 33208885, 33171009, 33167664, 33184925, 33189209, 33157784, 33098385, 33036472, 32986023, 32937546, 32875195, 32799797, 32730129, 32682972, 32656559, 32634460, 32602005, 32556385, 32504780, 32457458, 32422245, 32398430, 32371792, 32320030, 32231728, 32123196, 32031357, 31983402, 31971947, 31962614, 31927137, 31866354, 31800085, 31739006, 31672407, 31584003, 31474514, 31363918, 31272972, 31206959, 31158268, 31119524, 31089396, 31066679, 31044289, 31012939, 30968710, 30913168, 30846060, 30761698, 30656277, 30537880, 30425684, 30337091, 30275377, 30229445, 30183813, 30127260, 30054403, 29964001, 29859451, 29749025, 29641449, 29538778, 29435860, 29329361, 29227098, 29145323]
3363.7B9145323n1214k8771k9524n2744q3660j05501j09323r5990p3339n2992m5553
3374.3B8416712n4251p1417q4474q7015q3983q4711r1515r7290r4112q1783o6386n1979
3385.9B7467796l7338k1498j0114j2308l0987n7436p7252q0675o7158m1978j2345J2003
3397.5B7030710J8336k530m5364q8816j09289j00275p7007o0003n4432m7989k9722
3408.1B6433619o943N28j6600m3767n6206m4680k4919k0024l6459n9610p0938o5411
3419.7B5988590n0710l4399j6577L563J9653K0948L737k2347m1248m3259l0712j3284
3431.2B5783955Q5N003K92j3111l1090m4912m3737k1498J6662N4104P1093N7558K0582
3443.8B5854986j9728m3933m5399l1672j5850o225l193k388P42Q819K1201L2953L6306
$$ y = [29145323, 29094109, 29065338, 29035814, 28983070, 28899410, 28793909, 28684586, 28588596, 28515257, 28462265, 28416712, 28362461, 28291044, 28206570, 28119555, 28035572, 27950861, 27859346, 27762056, 27667944, 27586161, 27519775, 27467796, 27430458, 27408960, 27398846, 27386538, 27355551, 27298115, 27220863, 27140188, 27073030, 27031052, 27018707, 27030710, 27049046, 27046516, 27001152, 26912336, 26803047, 26702772, 26625765, 26565762, 26511330, 26463341, 26433619, 26426676, 26427204, 26410604, 26366837, 26310631, 26265951, 26241032, 26221008, 26184549, 26124939, 26054001, 25988590, 25937880, 25903481, 25886904, 25890467, 25910120, 25931068, 25934805, 25912458, 25871210, 25827951, 25797239, 25783955, 25784040, 25789043, 25789335, 25776224, 25745134, 25700222, 25656485, 25634987, 25651649, 25705753, 25776846, 25834404, 25854986, 25835258, 25791325, 25745926, 25714254, 25698404, 25692179, 25688986, 25686598, 25687340, 25696159, 25717360, 25750313, 25786619]
3456.3B5786619K6947J1116M248J8885N0855P8160P7184M3110m574l6892l7805j4240
3467.9B6003613J3649K9899L2019K6317J7924P904k781r071m538J1866L2785M6869
3479.5B6206455M7220L6744K6899K9877M9129P4248Q6013P0395L1584q095k4660j1757
3491B6614052J4555L0401K4235M736q507n13K9901P0124R9577R8888O2043M783m1162
3503.6B7003113m9032j7554K8914O1674O9792O1889N0022L6713J9215K330p8K1132
3515.1B7288130N6345Q0210P1090K9991j7469l7960j4212M0697R0147R9018O0124j60
3526.7B7745951m3118m7052j8835K0500N6053Q3105R6403Q5675M8463L645j7564M31
3538.3B8013657M0647O9260O8601N1739M4130N5617P4270Q5020Q5793Q1880O9500L4937
$$ y = [25786619, 25813566, 25824682, 25828930, 25847815, 25898670, 25976830, 26054014, 26097124, 26092550, 26055658, 26017853, 26003613, 26017262, 26047161, 26079180, 26105497, 26123421, 26131325, 26128544, 26119473, 26114935, 26126801, 26159586, 26206455, 26253675, 26290419, 26317318, 26347195, 26396324, 26470572, 26556585, 26626980, 26658564, 26650469, 26625809, 26614052, 26628607, 26659008, 26683243, 26687979, 26679472, 26678959, 26708860, 26778984, 26878561, 26977449, 27039492, 27044275, 27003113, 26954081, 26936527, 26965441, 27027115, 27096907, 27158796, 27208818, 27245531, 27264746, 27267076, 27266998, 27288130, 27344475, 27424685, 27495775, 27525766, 27508297, 27470337, 27456125, 27496822, 27586969, 27685987, 27746111, 27745951, 27702833, 27655781, 27636946, 27657446, 27713499, 27796604, 27893007, 27978682, 28027145, 28030790, 28013226, 28013657, 28054304, 28123564, 28192165, 28243904, 28288034, 28343651, 28417921, 28502941, 28588734, 28670614, 28740114, 28775051]
3549.9B8775051k5034q6101j07678o6906J7079R4785J24317J01872N9175L3009L5885
3560.5B8955454N2643O1046N4827M6501N0028O3335O9937N8293L6293K3677L0045M3394
3572B9545473M3766K6457Q459J0220L3548O0566P3025O9221O1505O1653P2336Q9762
3583.6C0155991J07040J12217R0141L7293k2904m6879n037Q6710J72684K00260J60839
3594.2C1048355R0464L2921N188m263j1034j5549o952K0992O2088J02659J29076J31291
3605.8C1585236J06393O4633K8391J6935K8261M0724L8605L2997M9253R0462J21563
3616.4C2203453J00552K7290m7455o7428k3564M3438Q8875J01780R5611P4902K8858
3627C2626312l9203r2022q4439j1936P5890J17077R1823L4523l128M082M2950Q2016
$$ y = [28775051, 28750017, 28663916, 28556238, 28489332, 28506411, 28601196, 28725513, 28827385, 28886560, 28919569, 28955454, 29008097, 29069143, 29123970, 29170471, 29220499, 29283834, 29353771, 29412064, 29448357, 29472034, 29502079, 29545473, 29589239, 29615696, 29624155, 29634375, 29667923, 29728489, 29801514, 29870735, 29932240, 29993893, 30066229, 30155991, 30263031, 30375248, 30465389, 30502682, 30479778, 30432899, 30427862, 30514572, 30687256, 30887516, 31048355, 31138819, 31171740, 31176928, 31172665, 31161631, 31146082, 31139130, 31160122, 31222210, 31324869, 31453945, 31585236, 31691629, 31756262, 31784653, 31801588, 31829849, 31870573, 31909178, 31942175, 31991428, 32081890, 32203453, 32304005, 32331295, 32283840, 32216412, 32192848, 32236286, 32325161, 32426941, 32522552, 32597454, 32626312, 32587109, 32495087, 32410648, 32398712, 32474602, 32591679, 32683502, 32718025, 32714897, 32718979, 32761929, 32843945]
3638.6C2843945R7755Q8222P0893O8924R0923J17840J12957N2498m8332j40896j76976
3649.2C3177753j42753o5594P145L8773K4246r209k3006K201N0022Q3668Q0646N2136
3660.8C3276028K6706J9703K4788L3035M7509P0038Q1642N3562j5289q3306j02814
3671.4C3431602p1643l5977l5526n5294m3827K1847J02600J35673J00685L6984k548
3682C3584576m040O100L448m867M741L6366O3976N7579J4729l6526o4541o1398m4097
3694.5C3556046l1983k5253q434K5634N8644N9627J8509l7010o4613n0011k1458j7856
3706.1C3461842m4838p0244o3332l0346m078k975j1219k075K7908N6866O4766N2391
3717.7C3434666L1337O848j9798l8319l3146n169K0935K1385L304o72K8771P1484Q5701
$$ y = [32843945, 32941700, 33029922, 33100815, 33169739, 33260662, 33378502, 33491459, 33543957, 33495625, 33354729, 33177753, 33035000, 32969406, 32976551, 33015324, 33039570, 33030361, 33007355, 33009556, 33059578, 33143246, 33223892, 33276028, 33302734, 33322437, 33347225, 33380260, 33427769, 33497807, 33579449, 33633011, 33617722, 33534416, 33431602, 33359959, 33323982, 33288456, 33233162, 33189335, 33211182, 33313782, 33449455, 33550140, 33587124, 33584576, 33580536, 33586636, 33590084, 33585217, 33589958, 33626324, 33690300, 33747879, 33762608, 33726082, 33661541, 33600143, 33556046, 33524063, 33498810, 33490376, 33516010, 33574654, 33634281, 33652790, 33615780, 33551167, 33501156, 33479698, 33461842, 33417004, 33346760, 33283428, 33253082, 33249004, 33246029, 33234810, 33232735, 33260643, 33317509, 33382275, 33434666, 33466003, 33472851, 33453053, 33414734, 33381588, 33376419, 33397354, 33418739, 33422043, 33421371, 33450142, 33521626, 33607327]
3730.2C3607327M9701j8822q0421j04286q4919m1760p892p172k8316k6562L0094J09295
3741.8C3396267J27624L9052r2499j36940l4523J21231J63593K4777j84670k81399
3751.4C3142513j88114K735J35395J38058N8281k1053o6357r1087j01212p7366j1814
3762C2919979O1199R1778O5937J7693j1219j2356o741j0956j9264j8230n428J2420
3773.6C3084812L2658N6022P2987O3137J7037m3538p7495o2229j7746J0166p759n7953
3785.2C3070099r7183r0775m1119J6369M4270L4809J3378J0693K8557L7685J3210k9552
3796.7C3010441m4708o936N2460P1461K2152n7629j02039q2333k8160J0727J2737o164
3808.3C2852009j8147o061L1620Q0196J07895Q2005M295p3326q7677k9770L7765M2031
$$ y = [33607327, 33657028, 33638206, 33557785, 33453499, 33368580, 33326820, 33318928, 33311756, 33283440, 33256878, 33286972, 33396267, 33523891, 33562943, 33470444, 33333504, 33298981, 33420212, 33583805, 33608582, 33423912, 33142513, 32954399, 32957134, 33092529, 33230587, 33288868, 33267815, 33201458, 33110371, 33009159, 32931793, 32919979, 32981178, 33072956, 33138893, 33156586, 33145367, 33133011, 33126270, 33115314, 33096050, 33077820, 33072392, 33084812, 33117470, 33173492, 33246479, 33309616, 33326653, 33283115, 33205620, 33143391, 33125645, 33135811, 33128052, 33070099, 32972916, 32882141, 32841022, 32857391, 32901661, 32936470, 32949848, 32960541, 32989098, 33026783, 33039993, 33010441, 32965733, 32958797, 33011257, 33082718, 33104870, 33047241, 32945202, 32862869, 32834709, 32845436, 32858173, 32852009, 32833862, 32827801, 32859421, 32939617, 33047512, 33129517, 33133812, 33060486, 32972809, 32943039, 32980804, 33022835]
3819.9C3022835k2736q9706r3666l9448J1257J2760j9840l8601k1851N764O867k6474
3831.4C2707161o6315p6923m5223R624N1182N2742J8677j8097k4933J41K8286L2021
3843C2668343J4171J026J0224L4427N8415Q1177J08688J26018R3243j5003j65306k72591
3854.6C2742832k65095j47369K075R7267J10306P5489L9150J5618o787l0052l4790
3865.2C2598644j0776J3813o722p8773j45470j36532m4258O1405J01780O7276J6411
3875.8C2436798J885J4747J1196j8860l3149N905P1621R0828K3456q7997j57833j41689
3887.4C2216908p4803k8198l6221p0099p5038k4901N7455J23169J36726R9305M3960
3898C2368263Q980Q698K3727K0493j5206o2847q6605p0412l1841q43J0658J4172K2217
$$ y = [33022835, 33000099, 32910393, 32816727, 32777279, 32788536, 32801296, 32781456, 32742855, 32721004, 32726768, 32733635, 32707161, 32640846, 32563923, 32518700, 32528324, 32579506, 32632248, 32650925, 32632828, 32607895, 32608036, 32636322, 32668343, 32682514, 32683540, 32693764, 32728191, 32786606, 32867783, 32976471, 33102489, 33195732, 33180729, 33015423, 32742832, 32477737, 32330368, 32332443, 32429710, 32540016, 32615505, 32654655, 32670273, 32663486, 32633434, 32598644, 32587868, 32601681, 32594959, 32516186, 32370716, 32234184, 32189926, 32251331, 32353111, 32420387, 32436798, 32438683, 32453430, 32464626, 32445766, 32412617, 32418522, 32490143, 32580971, 32604427, 32516430, 32358597, 32216908, 32142105, 32113907, 32077686, 32007587, 31932549, 31907648, 31965103, 32088272, 32224998, 32324303, 32368263, 32377243, 32385941, 32409668, 32430161, 32414955, 32352108, 32265503, 32195091, 32163250, 32162407, 32173065, 32187237, 32209454]
3910.5C2209454K8976J9295o699k6832j9875Q160K6432J1078k8168n6023m6718j0605
3922.1C2108475J4583l32m6962q4948p7589k6096K9417M4168P674m7253p3828n0772
3933.7C1796537K892M7581N6850L4853P299l353L495Q533o849l9152o2901n4674j8904
3946.2C1772207J3943J7242n422k6526k4675l603J7565K5346J8813L086j3888j9733
3957.8C1774355n163K1057L3289J5795j5345k9949k4086k8240o5127j09703j10155
3968.4C1456728m9303L0109O9947N4350J2664k4370n0621o7997o8245m5757j4788O167
3980C1308884J9964L9339N1550K2550m9097j09842j12085q1488q0515j06470q4455
3990.6C0818335K920L7994q7690k64364k40912l0252j67120N58767M34555O7762
$$ y = [32209454, 32238430, 32257725, 32251026, 32224194, 32204319, 32212479, 32238911, 32249989, 32221821, 32165798, 32119080, 32108475, 32123058, 32122726, 32075764, 31990816, 31913227, 31887131, 31916548, 31960716, 31968390, 31921137, 31847309, 31796537, 31799429, 31847010, 31903860, 31938713, 31946012, 31942659, 31946154, 31954687, 31947838, 31908686, 31845785, 31791111, 31772207, 31786150, 31803392, 31797970, 31771444, 31746769, 31743166, 31760731, 31786077, 31804890, 31807976, 31794088, 31774355, 31769192, 31790249, 31823538, 31839333, 31823988, 31794039, 31769953, 31741713, 31676586, 31566883, 31456728, 31407425, 31437534, 31507481, 31561831, 31574495, 31550125, 31499504, 31431507, 31363262, 31317505, 31302717, 31308884, 31328848, 31368187, 31419737, 31442287, 31393190, 31283348, 31171263, 31089775, 31009260, 30902790, 30818335, 30821255, 30859249, 30771559, 30507195, 30266283, 30236031, 30068911, 30627678, 31062233, 31129995]
4000.2C1129995
$$ y = [31129995]
##END=$$ End of the data block
