##TITLE=$$ Begin of the data block
##JCAMP-DX=5.00 $$ ACD/SpecManager v 10.08
##SPECTROMETER/DATA SYSTEM=Varian
##DATE=16 Apr 2013 13:04:04
##DATA TYPE=INFRARED SPECTRUM
##DATA CLASS=XYDATA
##ORIGIN=
##OWNER=
##NPOINTS=3735
##FIRSTX=399.26403809
##LASTX=4000.35498047
##MAXX=4000.35498047
##MINX=399.26403809
##MAXY=103.90718842
##MINY=4.79324389
##XFACTOR=1.0000000000
##YFACTOR=0.000001000000000
##FIRSTY=4.79324389
##DELTAX=0.96440572
##XUNITS=1/CM
##YUNITS=TRANSMITTANCE
##XYDATA=(X++(Y..Y))
399.3D793244L909550P998004J1670473J2976172J1174167P289864L421841J363983
407F4597298J502479K671349L072960J738174n09376j556206R1308L508423N567818
415.7H0684227L489754k343964q089836r340904m838032K325706P090313O290390Q08609
424.3G6076263n386756q153386n795299J09943N874645Q107857O009659J977081k46872
433G8573135J271622M858864O639145M074859j650711o698776p986496n598244k108070
441.7G1375328M1260L08975l68454j037361j383270j244171j28464K387298N862610
450.4G5813751Q847786R652802P340851K251998m033172r143326j0835075q280663
458.1G1614952k924606K125732M156281K797172J01525j361550o13083J313195K726310
$$ y = [4793244, 8702794, 16700798, 28371271, 41347443, 52521610, 59811474, 63233315, 64597298, 66099777, 68771126, 71844086, 73582260, 73072884, 71516678, 71607986, 75116409, 80684227, 84173981, 81830017, 73740181, 64399277, 59561245, 61886951, 68977264, 75267654, 76076263, 70689507, 62536121, 56740822, 56850765, 62725410, 70833267, 76842926, 78820007, 78573135, 79844757, 84703621, 91342766, 95417625, 93766914, 87068138, 79081642, 73483398, 71375328, 71416588, 71725563, 71357109, 70319748, 68936478, 67692307, 67563843, 69951141, 75813751, 84661537, 94314339, 101655190, 103907188, 99874016, 90730690, 79895615, 71614952, 68690346, 70816078, 74972359, 77769531, 77871056, 76509506, 75896423, 77209618, 79935928]
466.8G9935928K816895J947983Q36143j70448j008392j480568j299744n91164q6403
475.5H0900230n46623j945823l360703l785210l040420j810295p96677K7924J210815
484.1F6853218K910942M397789M639885L397873J573814L45169J2566j22200p01980
492.8H3307076j362893j110283L36915J875366K005775N07576j139206j223526L63007
501.5H3559807J962181J867744N0629j944458k689323k212937j628448j699646k066063
510.2G5199486j873520q86131K34092O58013J73889p83753j662590k153564k112564
518.9F6793358j421303j36665J269554K027984J596932J37733j518943k404061k028892
527.5F4315697o78040P78061J440544R91493o2614p61704m44511P53204K108986K989891
$$ y = [79935928, 82752823, 84700806, 85536949, 85366501, 84358109, 82877541, 81577797, 80986633, 80900230, 80353607, 78407784, 75047081, 71261871, 68221451, 66411156, 65614479, 65642403, 66853218, 69764160, 74161949, 78801834, 82199707, 83773521, 84118690, 84131256, 84009056, 83307076, 81944183, 80833900, 81170815, 83046181, 85051956, 85559532, 84420326, 83196800, 83559807, 85521988, 87389732, 87440361, 85495903, 82806580, 80593643, 78965195, 77265549, 75199486, 73325966, 72439835, 72673927, 73331940, 73505829, 72722076, 71059486, 68905922, 66793358, 65372055, 65235390, 66504944, 68532928, 70129860, 70267593, 68748650, 66344589, 64315697, 63637657, 64415718, 65856262, 66847755, 66785141, 66023437, 65578926, 66332130, 68441116, 71431007]
537.2G1431007L271508L113632K502067J245949n08789j968208k194748j062721L97728
545.9G6227425Q16970k39410j825684k491394j619064Q0719J321983J408142O84197
554.5G4363884l738j38909J66748N23651P26052Q27713Q85856P89803M04549j75560
564.2G8370049o16730o42670l31550q1788k57919q62358j549568j950188j978126j838501
573.8F8260651j766632j771309j612408j004673J37905J588097K872646L477829L111595
582.5G3293701J901322L86558p52281j092949p17720j08025K30713J09696k91321o43532
592.1G2316162p27386n26146j51284K65625O17310Q22113Q41896P12715N28809L64220
601.8G5064034K04299k5634l46726o47484p44880n51491j85104J11801J90284J41213
$$ y = [71431007, 74702515, 77816147, 80318214, 81564163, 81055374, 79087166, 76892418, 75829697, 76227425, 77044395, 76804985, 74979301, 72487907, 70868843, 70949562, 72271545, 73679687, 74363884, 74360146, 74221237, 74387985, 74911636, 75637688, 76465401, 77351257, 78141060, 78545609, 78370049, 77753319, 77110649, 76779099, 76697311, 76439392, 75577034, 74027466, 72077278, 70099152, 68260651, 66494019, 64722710, 63110302, 62105629, 62243534, 63831631, 66704277, 70182106, 73293701, 75195023, 75581581, 74829300, 73736351, 73018631, 72910606, 73141319, 73251015, 72959694, 72316162, 71588776, 71062630, 70911346, 71176971, 71794281, 72616394, 73458290, 74171005, 74699814, 75064034, 75268333, 75242699, 74895973, 74248489, 73503609, 72952118, 72767014, 72878815, 73069099, 73210312]
611.4G3210312K03781N04829Q90000J044090Q06534L63380R3369J96686M82109N48431
621.1G8343521J93588l65066o93466n64087j65741J12846R3796j4374J43540O65756
630.7G7750313J241813J410599R78180J96739m54422o70936n40375l99422m92401p56737
640.4G8263351r18953p81700m11674n2696J24199J59469J89621K28607J25534k22427
650G6703331o44951p67998l68278L53561R17076J013726P84874O05293O07048N06180
659.7G9709862l1693q90030j481300j309898n31899J33217R7832n13672j017594q84506
669.3G3280319k43660L32131M68048L27705L18146N59196P45720N31952m1069n75310
678.9G5703178p49847o46477o01646p74635r35257p13791l6774P24754J058297P60292
$$ y = [73210312, 73414093, 73918922, 74808922, 75853012, 76659546, 77022926, 77116295, 77312981, 77795090, 78343521, 78537109, 78172043, 77478577, 76914490, 76748749, 76861595, 76955391, 76941017, 77084557, 77750313, 78992126, 80402725, 81380905, 81577644, 81123222, 80452286, 79911911, 79512489, 79020088, 78263351, 77344398, 76562698, 76151024, 76098328, 76222527, 76381996, 76571617, 76800224, 76925758, 76703331, 76058380, 75290382, 74922104, 75275665, 76192741, 77206467, 77991341, 78596634, 79203682, 79709862, 79678169, 78788139, 77306839, 75996941, 75465042, 75598259, 75696091, 75182419, 74164825, 73280319, 73036659, 73368790, 73836838, 74164543, 74482689, 75041885, 75787605, 76319557, 76278488, 75703178, 74953331, 74306854, 73705208, 72930573, 71995316, 71281525, 71244751, 71969505, 73027802, 73788094]
688.6G3788094J01295m25636n07843k01668K07344M74190N29548M12575J54518k25525
698.2G4306892o30951q61694p40387k84653K66503O26808O81374N45204M23668M30130
707.9G4762894N26352N97648N50888L53463L1768l30772o17539p57072q00278q80752
717.5G3436600j046471j132629q63671j43249P56775J350448J338486Q77228M40582
726.2G5014099L96469O97716R63181Q41796L08472l50281p95402q83370p09564m61342
735.8G5021774k41821j9417K68555N70419O92826M51339j25305p55409j116356j132210
745.5G3614395j039856j133079j427460j604454j317612n54687L22662R02367J067566
754.2F8829842J021659J013321J091240J135651J069923R67408R34745R42612Q30780
$$ y = [73788094, 73889389, 73463753, 72955910, 72754242, 72961586, 73435776, 73965324, 74377899, 74532417, 74306892, 73675941, 72814247, 72073860, 71789207, 72055710, 72682518, 73363892, 73909096, 74332764, 74762894, 75289246, 75886894, 76437782, 76791245, 76823013, 76492241, 75874702, 75117630, 74317352, 73436600, 72390129, 71257500, 70393829, 70250580, 71007355, 72357803, 73696289, 74573517, 75014099, 75410568, 76108284, 77071465, 77913261, 78221733, 77871452, 77076050, 76192680, 75483116, 75021774, 74779953, 74760536, 75029091, 75599510, 76292336, 76743675, 76618370, 75862961, 74746605, 73614395, 72574539, 71441460, 70014000, 68409546, 67091934, 66537247, 66859909, 67762276, 68829842, 69851501, 70864822, 71956062, 73091713, 74161636, 75129044, 76063789, 77006401, 77837181]
762.8G7837181M89853M684m04869n73326n03212l08914r2155J01684K31812K24739
772.5G7007477K8984k94937n67559o02829l49891N8533L92272M77204L07236M2205
782.1G6498695j04728j6777K41485M69879M81758K44622j00579l56361m23782l67348
791.8G6566864l41705m46663o30089p18315n55969j52733K82448M69116K68791j81709
801.4G4560036n46891n43319j68030K92946M91356K87849j57860n35728o25221m25972
811.1G2629166j06308J44394K27562J53968K282j29395j60332n6061J55915L99040
820.7G3260231N88425O71035O34598M86000K30271j22574n27275q85330j072167j005859
830.4G2257355p10953l23067j8242Q7830j434j85662l44864m09782l86200l37807l51219
$$ y = [77837181, 78327034, 78331718, 77926849, 77353523, 76850311, 76541397, 76449242, 76550926, 76782738, 77007477, 77036461, 76741524, 76173965, 75571136, 75221245, 75279778, 75672050, 76149254, 76456490, 76498695, 76393967, 76377190, 76618675, 77088554, 77570312, 77814934, 77714355, 77357994, 76934212, 76566864, 76225159, 75778496, 75148407, 74430092, 73874123, 73721390, 74003838, 74472954, 74741745, 74560036, 74013145, 73469826, 73301796, 73594742, 74086098, 74373947, 74216087, 73680359, 73055138, 72629166, 72522858, 72667252, 72894814, 73048782, 73051064, 72921669, 72761337, 72705276, 72861191, 73260231, 73848656, 74519691, 75154289, 75640289, 75870560, 75747986, 75220711, 74335381, 73263214, 72257355, 71546402, 71223335, 71205093, 71292923, 71291489, 71105827, 70760963, 70351181, 69964981, 69627174, 69275955]
841F9275955m93286p67563j096596j362014j487625j491742j444210j364017j174160
849.6E8594742p85149k29946L09162O41430P44602P83795R33353J181133J326924J188423
859.3F4688469Q06343M36058L27889N05394P43377P55234M22943j09421n32692n79933
868.9F7463661k08031L61855P79999Q03222M64692L6888j94275j54907p088M1817n2597
879.5F9335236j54351j22955J8639J08459K9343j54656k58171j66008M5571J76071
889.2F8857178Q3275j93985m70627n56702l84117l8857K96174M39727L01560p4433
898.8F8259193n35263r01374j060395j016105q68733p48157p41299q49155r93882j076866
908.5E9467964j056106r80126r34524r37264q88798o49028j83319L72344Q12119J037872
$$ y = [69275955, 68782669, 68015106, 66918510, 65556496, 64068871, 62577129, 61132919, 59768902, 58594742, 57809593, 57579647, 57888809, 58530239, 59274841, 60058636, 60991989, 62173122, 63500046, 64688469, 65494812, 65930870, 66258759, 66764153, 67507530, 68262764, 68685707, 68576286, 68043594, 67463661, 67255630, 67617485, 68397484, 69200706, 69665398, 69702286, 69508011, 69353104, 69346016, 69387833, 69335236, 69180885, 69057930, 69076569, 69185028, 69214371, 69059715, 68801544, 68635536, 68681107, 68857178, 68940453, 68746468, 68275841, 67719139, 67335022, 67296165, 67592339, 68032066, 68333626, 68259193, 67723930, 66822556, 65762161, 64746056, 63877323, 63129166, 62387867, 61538712, 60544830, 59467964, 58411858, 57431732, 56497208, 55559944, 54671146, 54022118, 53838799, 54211143, 55023262, 56061134]
918.1E6061134J133561J258258J473099J684406J752064J632641J404343J168563R58054
926.8F8526123P49161N37315L65151K72255K42523K23701J90766J66328J71013J74568
936.4G1618904J20041k998j29433j76476j26647m1115Q545J2474K1858Q4297J87988
947.1G1577438K66541K52800J30752m8095j91536k20604j24054K5947J18851Q6846
956.7G1874886m4175j81854k47551k33566j88980j60866j56105j52878j32522r2682
966.3G0283707l9971J2993M0314P744r8076k42356l54888l80127l20221k29050j67084
976.9F8512985j61323k00882k59812l21899l90701m84436o17638p77344r14993r73419
986.6F3410538r35513q46168p74708p45812p11158n97420l85235j36242N9227J57822
$$ y = [56061134, 57194695, 58452953, 59926052, 61610458, 63362522, 64995163, 66399506, 67568069, 68526123, 69275284, 69812599, 70177750, 70450005, 70692528, 70916229, 71106995, 71273323, 71444336, 71618904, 71738945, 71735947, 71606514, 71430038, 71303391, 71262276, 71270821, 71283295, 71305153, 71389450, 71577438, 71843979, 72096779, 72227531, 72179436, 71987900, 71767296, 71643242, 71669189, 71788040, 71874886, 71830711, 71648857, 71401306, 71167740, 70978760, 70817894, 70661789, 70508911, 70376389, 70283707, 70243736, 70256729, 70297043, 70304787, 70206711, 69964355, 69609467, 69229340, 68909119, 68680069, 68512985, 68351662, 68150780, 67890968, 67569069, 67178368, 66693932, 66076294, 65298950, 64383957, 63410538, 62475025, 61628857, 60854149, 60108337, 59397179, 58799759, 58414524, 58278282, 58337509, 58495331]
996.2E8495331J86725K01924K33909K72274K86484K49260J46721j4084j94778l31379
1005.9E9532387l66917k86503j15429J19927M19357P84466J165203J444584J495918
1014.6F4192993J270111Q36464L43552o4514l14659m21105m55315m89494n38841n37743
1024.2F3821449l80672j4851M84768R33674J151802J084587Q26790N29686K80022O2240
1033.8F8779495j69105l89321m87083l62213n1399K45704K89787j4175n30502r90143
1043.5F6321045j195580j155662j034847r76483r74678r09752o93001l65249n8361
1052.2E8957432J22947J76175J77509K10915L21960N10536P32392R02401R26826P67880
1061.8F3806973M85874K05375K6047l2875l365R7725K82685N38017P79144Q90206Q21769
$$ y = [58495331, 58682056, 58883980, 59117889, 59390163, 59676647, 59925907, 60072628, 60058544, 59863766, 59532387, 59165470, 58878967, 58763538, 58883465, 59302822, 60087288, 61252491, 62697075, 64192993, 65463104, 66299568, 66643120, 66578606, 66263947, 65842842, 65387527, 64898033, 64359192, 63821449, 63440777, 63425926, 63910694, 64844368, 65996170, 67080757, 67907547, 68437233, 68717255, 68779495, 68610390, 68221069, 67733986, 67371773, 67320374, 67566078, 67855865, 67841690, 67311188, 66321045, 65125465, 63969803, 62934956, 61958473, 60983795, 60074043, 59381042, 59015793, 58957432, 59080379, 59256554, 59434063, 59644978, 59966938, 60477474, 61209866, 62112267, 63039093, 63806973, 64292847, 64498222, 64524269, 64491394, 64488029, 64585754, 64868439, 65406456, 66185600, 67075806, 67897575]
1072.4F7897575O42365M84100M32305M62875M74495L75351J51359j22024l21823l51288
1082.1G0125290k09084l074J20743R1384l2516j27182j27258p7355n5778o3431j6037
1092.7F9625702J41632L35709M09164K80685M3183j15067q9439N0278J47194J21177
1102.3G0950218L2387r827K1241M4021l4088k10648l86642m60396m12369k99743j85784
1112.9F9048370q9645m730N4153M6189m1459j44134j47698J0926K61268M28482L67302
1123.5F9789024R0088k28721l81546k82380j9699K25396L15246K34535O7604q4747
1133.2F9724800j74293k17675k60193l28079m07013m60502m71955m67979m95270n67314
1142.8F5874527o39725o52450o03939n73815o53034q44170j043178j137268j124375
$$ y = [67897575, 68539940, 69024040, 69456345, 69919220, 70393715, 70769066, 70920425, 70798401, 70476578, 70125290, 69916206, 69913132, 70033875, 70125259, 70092743, 69965561, 69838303, 69760948, 69705170, 69641739, 69625702, 69767334, 70103043, 70512207, 70792892, 70836075, 70721008, 70631569, 70681847, 70829041, 70950218, 70982605, 70972778, 70994019, 71038040, 71003952, 70793304, 70406662, 69946266, 69533897, 69234154, 69048370, 68958725, 68953995, 69008148, 69054337, 69012878, 68868744, 68721046, 68731972, 68993240, 69421722, 69789024, 69879112, 69650391, 69268845, 68986465, 68966766, 69192162, 69507408, 69741943, 69809547, 69724800, 69550507, 69332832, 69072639, 68744560, 68337547, 67877045, 67405090, 66937111, 66441841, 65874527, 65234802, 64582352, 63978413, 63404598, 62751564, 61907394, 60864216, 59726948, 58602573]
1151.5E8602573j121017j235851j434357j541798j395103r99680n39917k36885j91387
1160.2D9906578l48221n86563q27892j063740j306187j534187j687355j695400j505402
1168.9C9351631j093891m76967K78980J066895J778461K345448K742550K950004K925038
1177.5E1868149K626816K076450J383419O96693J17505l43647p28364j057006j300309
1186.2E5339706j418750j418225j356956j300919j280910j293522j329304j383022
1193.9D4558098j434651j438583j354286j194481j031952r42837r37252r50775r10229
1202.6C4363052q07655p07184o79657p33446q06744q20693p36075n66921l56140j47072
1212.3B8001465K9157J57805K44068L08436L66243M07537M03872L44461K66159K39029
$$ y = [58602573, 57481556, 56245705, 54811348, 53269550, 51874447, 50874767, 50334850, 50097965, 49906578, 49558357, 48971794, 48143902, 47080162, 45773975, 44239788, 42552433, 40857033, 39351631, 38257740, 37780773, 38059753, 39126648, 40905109, 43250557, 45993107, 48943111, 51868149, 54494965, 56571415, 57954834, 58651527, 58769032, 58425385, 57697021, 56640015, 55339706, 53920956, 52502731, 51145775, 49844856, 48563946, 47270424, 45941120, 44558098, 43123447, 41684864, 40330578, 39136097, 38104145, 37161308, 36224056, 35273281, 34363052, 33555397, 32848213, 32168556, 31435110, 30628366, 29807673, 29071598, 28504677, 28148537, 28001465, 28030622, 28188427, 28432495, 28740931, 29107174, 29514711, 29918583, 30263044, 30529203, 30768232]
1221.9C0768232L12847M72676O46776P59541P83042P48108P17648P50259Q74459J076240
1231.5C7909828J299595J467659J525692J482830J416756J426304J560577J776611
1239.3D9865852J959465J993096J833881J538197J224914R97441Q78044Q03177O84803
1247.9F1778870M90997K79339J54011J82460L41000N31063O46931O39709N37071M17298
1257.6F5998749L60664M04289N20592O34323O75194O29913N48050M90570M67995M34570
1267.2G1164909L47580K29164J58097J93626L10837M17282M34082L57079K41417J39015
1276.9G3993088O1714r08m9583p8209j03318j69433l08083m91165o35635o60507n39628
1287.5G1018333l01864N737L40927O54984Q81637R63677Q99994P56935O18416N20256
$$ y = [30768232, 31081079, 31553755, 32200531, 32960072, 33743114, 34491222, 35208870, 35959129, 36833588, 37909828, 39209423, 40677082, 42202774, 43685604, 45102360, 46528664, 48089241, 49865852, 51825317, 53818413, 55652294, 57190491, 58415405, 59412846, 60290890, 61094067, 61778870, 62269867, 62549206, 62703217, 62885677, 63226677, 63757740, 64404671, 65044380, 65581451, 65998749, 66359413, 66763702, 67284294, 67918617, 68593811, 69223724, 69771774, 70262344, 70730339, 71164909, 71512489, 71741653, 71899750, 72093376, 72404213, 72821495, 73255577, 73612656, 73854073, 73993088, 74054802, 74053894, 74004311, 73926102, 73822784, 73653351, 73345268, 72854103, 72218468, 71557961, 71018333, 70716469, 70722206, 71063133, 71718117, 72599754, 73563431, 74463425, 75220360, 75838776, 76359032]
1297.1G6359032M35417L23624J86798P0091J1741L258L533j4817m3632o3095p4959
1307.7G7196991r9876j40671j59508j03424M2297K26227L58772L72628K65266R5345
1317.4G8054047n6687j31485j15173l8651M2000P5501M3136l0883r4742j02806m7432
1328G7596825L3165P9338N3741k5932r5398r4994k7069L3592l402j61362l63052m84391
1339.6G6541061m54231l11317j68457j19072j71395k62611l25958l44124l48854l83812
1349.2G3651230m72229o10176p77420r50173j111679j259849j406220j560585j711979
1357.9F3790920j825535j861370j796760j627270j349644r53601m41643J39721O95762
1366.6E4770580J122505J362435J431236J396145J327766J264924J212024J159596
$$ y = [76359032, 76794449, 77118073, 77304871, 77374962, 77386703, 77389961, 77393494, 77378677, 77335045, 77271950, 77196991, 77097115, 76956444, 76796936, 76693512, 76735809, 76962036, 77320808, 77693436, 77958702, 78054047, 77997360, 77865875, 77750702, 77712051, 77754051, 77829552, 77872688, 77841805, 77747063, 77644257, 77596825, 77629990, 77709328, 77763069, 77737137, 77641739, 77546745, 77519676, 77553268, 77549866, 77388504, 77025452, 76541061, 76086830, 75775513, 75607056, 75487984, 75316589, 75053978, 74728020, 74383896, 74035042, 73651230, 73179001, 72568825, 71791405, 70841232, 69729553, 68469704, 67063484, 65502899, 63790920, 61965385, 60104015, 58307255, 56679985, 55330341, 54376740, 53935097, 54074818, 54770580, 55893085, 57255520, 58686756, 60082901, 61410667, 62675591, 63887615, 65047211]
1374.3F5047211J103584J049171J000519R47991Q66600P31514N43152L41461J89933
1382.9G1821136J33835J62712K12593K11655J33682J2291r6893j69891k31652l18817
1392.6G1870651m25689m91425m50340l02079j31385m9935j05743k43065l51265l57025
1402.2F8962700k74643j72867j01669n5840m822N7557J04469J13968J00601R8228J16105
1412.8F8943787J26678J04126O7619P0740J42326K44408K97783K51160J22589k4361
1422.5G0346855j35551j93993k06207j83869j49482j47515k25235l88221n82085p35252
1432.1F7399445q28789r16634j065628j268688j421192j389569j111454o37779q7040
1440.8E8672672M36394Q86196J254921J530476J680706J679771J542481J325500J089211
$$ y = [65047211, 66150795, 67199966, 68200485, 69148476, 70015076, 70746590, 71289742, 71631203, 71821136, 71954971, 72117683, 72330276, 72541931, 72675613, 72687904, 72591011, 72421120, 72189468, 71870651, 71444962, 70953537, 70503197, 70201118, 70069733, 70019798, 69914055, 69670990, 69319725, 68962700, 68688057, 68515190, 68413521, 68357681, 68352859, 68410416, 68514885, 68628853, 68729454, 68827682, 68943787, 69070465, 69174591, 69242210, 69312950, 69455276, 69699684, 69997467, 70248627, 70371216, 70346855, 70211304, 70017311, 69811104, 69627235, 69477753, 69330238, 69105003, 68716782, 68134697, 67399445, 66570656, 65654022, 64588394, 63319706, 61898514, 60508945, 59397491, 58759712, 58672672, 59109066, 59995262, 61250183, 62780659, 64461365, 66141136, 67683617, 69009117, 70098328]
1449.5G0098328Q56811O12122L42643Q4542q1001q7739N0858K36122L51311L42720
1459.1G2806717K43072J22269K1462o4263j50055k25464k63038k55638k29447k12501
1468.8G1793114j96976j46507m6379N9845R4970J5602j42952k89077l43773k96120
1478.4G0501747k04468j51443j91208l20374m85710o22513p02796p60460q68180j076248
1488.1F5118347j362491j640282j821118j875606j838490j759746j654503j497910
1495.8E1668201j259887r39652n71888k10849Q9996K98813M29065N50431P60040J114681
1505.4E1928951J572140J999870K256516K284214K137897J936303J783668J719605
1513.1F7619164J714530J691201J559204J262039Q26668L75999P2472J6991J77940
$$ y = [70098328, 70955139, 71567261, 71909904, 71994446, 71913445, 71825706, 71876564, 72112686, 72463997, 72806717, 73049789, 73172058, 73193520, 73129257, 72979202, 72753738, 72490700, 72235062, 72005615, 71793114, 71596138, 71449631, 71403252, 71463097, 71558067, 71573669, 71430717, 71141640, 70797867, 70501747, 70297279, 70145836, 69954628, 69634254, 69148544, 68526031, 67823235, 67062775, 66194595, 65118347, 63755856, 62115574, 60294456, 58418850, 56580360, 54820614, 53166111, 51668201, 50408314, 49468662, 48896774, 48685925, 48775921, 49074734, 49503799, 50054230, 50814270, 51928951, 53501091, 55500961, 57757477, 60041691, 62179588, 64115891, 65899559, 67619164, 69333694, 71024895, 72584099, 73846138, 74672806, 75048805, 75121277, 75138268, 75316208]
1521.8G5316208M12605N64423N58388M25544K56348J32126Q3198Q4626Q1329K9724
1531.5G7944519o1661j23428p1831J12442L38532M47708L24066j2169m06502o66351
1541.1G7825325o76170m52629j17264J78505L25149K93091J30516p0968k23641k79610
1550.7G6932304k41012j48743o4789n2978j50749l36228n20088n91766n01671l11318
1560.4G4012962j53747j25557k06116k82234k57698j42288l6034k8038j11771j96128
1570G2473351j93543r5062L4080J21964J49078J48010J57547J83602K00683J82946
1579.7G3362656J26999M8347l7689j26457k17163l02376l69286m10568m29909m32968
1589.3G1211586m15131l63876k78694j87904j39954j71715k80922m29115n70870o81587
$$ y = [75316208, 75728813, 76293236, 76851624, 77277168, 77533516, 77665642, 77748840, 77833466, 77914795, 77944519, 77882858, 77759430, 77687599, 77800041, 78138573, 78586281, 78910347, 78898178, 78491676, 77825325, 77149155, 76696526, 76579262, 76757767, 77082916, 77376007, 77506523, 77435555, 77211914, 76932304, 76691292, 76542549, 76477760, 76424782, 76274033, 75937805, 75417717, 74825951, 74324280, 74012962, 73859215, 73733658, 73527542, 73245308, 72987610, 72845322, 72809288, 72781250, 72669479, 72473351, 72279808, 72184746, 72218826, 72340790, 72489868, 72637878, 72795425, 72979027, 73179710, 73362656, 73489655, 73538002, 73500313, 73373856, 73156693, 72854317, 72485031, 72074463, 71644554, 71211586, 70796455, 70432579, 70153885, 69965981, 69826027, 69654312, 69373390, 68944275, 68373405, 67691818]
1599F7691818p60231q13263q43048q53714q62682q98602r83780j119579j289474j471348
1608.6E7796097j637497j735928j677585j361409p39097J23134J041832J791031K212124
1617.3E5812702K285057K114014J845154J580940J347256J121734Q84529O47812M49120
1626F8088318L24463K84485L06785L44101L44887K79655J59592L2646m3991l7239M6814
1636.6G0130516J72951K97569L82698M02237L50433K51290J53091R9381R6527J12442
1646.2G2449135J14876J10397J38504K19490L12149L35243K41829P2884o8611j04836
1655.9G3821060m7981J8722K3049l1937p8865n5580L5431J28021J46752O6185o8444
1666.5G3956413j69182j61537l3951J50567K91450L15735K24365Q4053k8190p8316
$$ y = [67691818, 66931587, 66118324, 65275276, 64421562, 63558880, 62660278, 61676498, 60556919, 59267445, 57796097, 56158600, 54422672, 52745087, 51383678, 50644581, 50767715, 51809547, 53600578, 55812702, 58097759, 60211773, 62056927, 63637867, 64985123, 66106857, 66991386, 67639198, 68088318, 68412781, 68697266, 69004051, 69348152, 69693039, 69972694, 70132286, 70164932, 70120941, 70083702, 70130516, 70303467, 70601036, 70983734, 71385971, 71736404, 71987694, 72140785, 72240166, 72336693, 72449135, 72564011, 72674408, 72812912, 73032402, 73344551, 73679794, 73921623, 73994507, 73925896, 73821060, 73773079, 73791801, 73814850, 73782913, 73704048, 73648468, 73683899, 73811920, 73958672, 74024857, 73956413, 73787231, 73625694, 73591743, 73742310, 74033760, 74349495, 74573860, 74657913, 74629723, 74551407]
1676.1G4551407q1185o2850k6146M2846J39496K23320K44217J86569Q2955j6144q3779
1686.7G5200706j25633j55449j71394j63254j35689j11312j02738q6967k2683R7153
1696.4G4222740K11403K24335Q8501j38069l21938l54691k37922p7416O432k9251j34041
1707G3460083k26379k65625k67105k60270k46612k04857j30440n7220l2563p3104j50544
1717.6G1545364k21893k67433k94617l10753l04123k60162j91254j39053j39145j86714
1727.2F9230217k43935k81746l08563l52424m18236m71817m72321m18907l60908l59101
1736.9F5542259m37317n70793p17064q54068r89674j140064j304421j461319j589382
1745.5E6478157j691757j801258j955067k153450k333950k391193k240116j879426
$$ y = [74551407, 74470222, 74407372, 74381226, 74424072, 74563568, 74786888, 75031105, 75217674, 75300629, 75284485, 75200706, 75075073, 74919624, 74748230, 74584976, 74449287, 74337975, 74235237, 74148270, 74125587, 74222740, 74434143, 74658478, 74746979, 74608910, 74286972, 73932281, 73694359, 73616943, 73623375, 73594124, 73460083, 73233704, 72968079, 72700974, 72440704, 72194092, 71989235, 71858795, 71801575, 71769012, 71695908, 71545364, 71323471, 71056038, 70761421, 70450668, 70146545, 69886383, 69695129, 69556076, 69416931, 69230217, 68986282, 68704536, 68395973, 68043549, 67625313, 67153496, 66681175, 66262268, 65901360, 65542259, 65104942, 64534149, 63817085, 62963017, 61973343, 60833279, 59528858, 58067539, 56478157, 54786400, 52985142, 51030075, 48876625, 46542675, 44151482, 41911366, 40031940]
1753.3D0031940j399910r22992n17014j62712K03297O11351J020195J348366J538063
1761.9D1750584J590446J549130J461799J359776J263180J188797J142616J107948
1769.7E2414276J050461R43008P89750O28784N12375M80445N42359O72111Q18451R28295
1779.3E9780315R73351R61525R21890Q75710Q22368P54425O82091O34598O30813O49247
1788.9F7686333O35688N47860L96125K40571J44920J31142J73019K27699K70134L00484
1798.6G0753975L25340L38684L22907K66701J80465R4048L8391K6481M8302Q1558J07697
1809.2G2584549J19888J18630J03370P0816K1668l2837p4066q6876o8459k6939K5528
1819.8G2755272P7316J16409J29639J07529N3528j1902n7656n7029k999Q4526J66100
$$ y = [40031940, 38632030, 37709038, 37192024, 37029312, 37232609, 37843960, 38864155, 40212521, 41750584, 43341030, 44890160, 46351959, 47711735, 48974915, 50163712, 51306328, 52414276, 53464737, 54407745, 55197495, 55826279, 56338654, 56819099, 57361458, 58033569, 58852020, 59780315, 60753666, 61715191, 62637081, 63512791, 64335159, 65089584, 65771675, 66406273, 67037086, 67686333, 68322021, 68869881, 69266006, 69506577, 69651497, 69782639, 69955658, 70183357, 70453491, 70753975, 71079315, 71417999, 71740906, 72007607, 72188072, 72282120, 72320511, 72346992, 72395294, 72476852, 72584549, 72704437, 72823067, 72926437, 72997253, 73018921, 72986084, 72912018, 72825142, 72756683, 72729744, 72755272, 72832588, 72948997, 73078636, 73186165, 73239693, 73227791, 73170135, 73113106, 73110107, 73194633, 73360733]
1830.4G3360733K03148J81885J22566O3812L2280K4109J7365M272P988O1829J67320
1841G4247307K74666L11523K38770Q4678p3715j64085j61820r1934J297Q4366J42120
1851.6G4893173J68122J56913J08200L5889l2173o7841o0028k1492K1088M6310N1071
1862.2G5299232M7875M9248N3367M4510Q339n0323j03218j13732o1317M1267J50200
1872.8G5365448K12044J92383R6733k9946j26190j48590r7076j2665N2284P0717N5778
1883.4G5630920M2466N2238P2777P0549K4338n2086j18141j36551r8946k7763M1313
1894.1G5501114P9048P3685L2959j9341n4085n3665k5589J770J686k8144o4118p8667
1905.6G5366653o4651m0207l1876n3138r4643j29524j27075o9855L1784J37260J95168
$$ y = [73360733, 73563881, 73745766, 73868332, 73932144, 73964424, 73988533, 74005898, 74010170, 74018158, 74079987, 74247307, 74521973, 74833496, 75072266, 75156944, 75083229, 74919144, 74757324, 74665390, 74666687, 74751053, 74893173, 75061295, 75218208, 75326408, 75362297, 75330124, 75262283, 75202255, 75180763, 75201851, 75248161, 75299232, 75347107, 75396355, 75449722, 75494232, 75502571, 75452248, 75349030, 75235298, 75173981, 75215248, 75365448, 75577492, 75769875, 75866608, 75836662, 75710472, 75561882, 75464806, 75452141, 75504425, 75575142, 75630920, 75673386, 75725624, 75798401, 75868950, 75893288, 75841202, 75723061, 75586510, 75487564, 75459801, 75501114, 75580162, 75653847, 75686806, 75667465, 75613380, 75559715, 75534126, 75535896, 75537582, 75509438, 75445320, 75366653, 75302002, 75261795, 75229919, 75176781, 75082138, 74952614, 74825539, 74755684, 74787468, 74924728, 75119896]
1916.2G5119896J77589J02921K4284j0895M975M1969O4957O3637N3146N2811O7566
1926.8G5762856Q7615R8305Q7746N0178q682o6398q9600n5466K6497J13487J55068
1937.5G6161606J26602M3724n1086j17585j39885j27761r9945o5079j7174M8950J18012
1948.1G5880379J53999J27289M6844l7010p0236m0054J5625M5692L2257K44j5152n607
1959.6G6134270O744k678l5599p2479r2262q6334n7457j4336K7924M8790L3287j2856
1971.2G5877014o1600q1687o2470j9691K0332M1046M2305L2814K0607J0124L441M81
1982.8G5822716n50j14N829K2484M6714O2150M8179j358o7238j14380j17263p9865
1994.3G5627304l3409j1719k4009m8447n2673k4903J3863K9197Q072k5612l3187K21
$$ y = [75119896, 75297485, 75400406, 75424690, 75413795, 75418770, 75460739, 75525696, 75589333, 75642479, 75695290, 75762856, 75850471, 75948776, 76036522, 76086700, 76078018, 76011620, 75922020, 75866554, 75893051, 76006538, 76161606, 76288208, 76331932, 76280846, 76163261, 76023376, 75895615, 75795670, 75730591, 75713417, 75762367, 75880379, 76034378, 76161667, 76208511, 76171501, 76101265, 76061211, 76076836, 76122528, 76154785, 76155029, 76139877, 76134270, 76141014, 76138336, 76102737, 76030258, 75937996, 75851662, 75794205, 75779869, 75807793, 75856583, 75889870, 75877014, 75815414, 75733727, 75671257, 75651566, 75671898, 75712944, 75755249, 75788063, 75808670, 75818794, 75822235, 75822716, 75822166, 75822052, 75827881, 75850365, 75897079, 75959229, 76007408, 76006050, 75938812, 75824432, 75707169, 75627304, 75593895, 75582176, 75558167, 75509720, 75457047, 75432144, 75446007, 75475204, 75483276, 75457664, 75424477, 75424698]
2005.9G5424698M9629P5554O4285M0390L7712O0677P7850N4901r063p8904j14753j03722
2017.5G5579254o3209k0119J0010K6741L6270M2831M5319L7834J4946j8082l9123j9684
2029.1G5632988M8080J31890J73744J34407K9785p8224j30569j14647o3271j5739J5548
2039.7G5763992M2237P2143R3804Q9798O0646K8747J7441K8847M4075M3930K6787P286
2051.2G6319733O33R354K2850K6191R735k4887o3675q5159p1991k3834L9284Q8073
2062.8G6246307J02181Q0368L5667j7288o9740j15952j46797j51146j24107p4120k0050
2073.4G5745323J9608L6163L1586J3267j0238k9419l3615j5503K0500N5771O6993M3686
2085G5944122j449m1046n5130m7364l8009m0024m2526k1271L1998R1301J11968O9314
$$ y = [75424698, 75474327, 75549881, 75614166, 75654556, 75692268, 75752945, 75830795, 75885696, 75876633, 75797729, 75682976, 75579254, 75516045, 75495926, 75505936, 75532677, 75568947, 75611778, 75657097, 75694931, 75709877, 75691795, 75652672, 75632988, 75681068, 75812958, 75986702, 76121109, 76150894, 76072670, 75942101, 75827454, 75764183, 75748444, 75763992, 75806229, 75878372, 75972176, 76061974, 76122620, 76151367, 76168808, 76197655, 76241730, 76285660, 76312447, 76319733, 76320366, 76329720, 76352570, 76378761, 76388496, 76363609, 76299934, 76214775, 76142784, 76118950, 76158234, 76246307, 76348488, 76428856, 76464523, 76447235, 76377495, 76261543, 76114746, 75963600, 75839493, 75765373, 75745323, 75764931, 75801094, 75832680, 75845947, 75835709, 75806290, 75772675, 75757172, 75777672, 75833443, 75900436, 75944122, 75942673, 75901627, 75846497, 75799133, 75761124, 75721100, 75678574, 75657303, 75689301, 75780602, 75892570, 75961884]
2096.6G5961884j5847r1034j13830q3306l3660k75P240J961l563j2177l4042o8443
2108.1G5514908r8999j07903r3017o7955m5540k2728J5594P6920J44974J83509J59203
2118.7G5658966O7047o0669j68106k05574j57402n1735N5298J12473J02363M7173j1711
2129.4G5388123m3679m5189l2402k0294q720J3145N0812R3201J16462R9785M0734m0986
2140.9G5610992j12648j44714j24161n8815K8061J08406J59058J66916J30554N9914
2150.6G5823563k5437j01394j47446j53679j21902o1776J2879Q4160J29272J26465
2160.2G5564705O8741k4834j13281j55586j35598p0816K396N4604P9193Q6708Q6807
2170.8G5443039P5966M3411j2245p2319j06606r4986m3983J6571N4146N4405K5696
$$ y = [75961884, 75946037, 75855003, 75741173, 75657867, 75624207, 75623932, 75631172, 75633133, 75629570, 75617393, 75583351, 75514908, 75415909, 75308006, 75214989, 75147034, 75101494, 75078766, 75094360, 75171280, 75316254, 75499763, 75658966, 75726013, 75665344, 75497238, 75291664, 75134262, 75082527, 75137825, 75250298, 75352661, 75399834, 75388123, 75344444, 75299255, 75266853, 75246559, 75237839, 75250984, 75301796, 75394997, 75511459, 75611244, 75651978, 75610992, 75498344, 75353630, 75229469, 75170654, 75198715, 75307121, 75466179, 75633095, 75763649, 75823563, 75798126, 75696732, 75549286, 75395607, 75273705, 75211929, 75224808, 75308968, 75438240, 75564705, 75633446, 75608612, 75495331, 75339745, 75204147, 75133331, 75135727, 75190331, 75269524, 75356232, 75443039, 75519005, 75562416, 75550171, 75477852, 75371246, 75276260, 75232277, 75248848, 75302994, 75357399, 75383095]
2181.4G5383095j2985m7287p2373q6563q4465n9219j1307M5471Q7868R5016N9685p439
2193G5289497q1230j31836j37382r5795k8320L0632N3787L7704L251k2202k5635j5426
2204.6G4877045r041j4565k3666k2224o569J1459J6388M143j4923k8435l5103m3114
2216.1G4711395n5099n8449l5126J5961O8024Q2756M3029k8587q4526q8882m4259J3581
2227.7G4539818M5921L8880O889k5246m2389m5616m4662m7249n4489o2416o5705o0043
2239.3G4183693m3701j8616R621L4057M9607N4382M8264L0593J007l6811p1984q9462
2250.9G4150650p8888m2404M433M0474M8255K0127m0344j17119j81679k01195j57051
2261.5G3445259o3721L1601P6439N0164k0447q3679j04500q8188o5979n9845o3073
$$ y = [75383095, 75370110, 75322823, 75250450, 75163887, 75079422, 75020203, 75008896, 75054367, 75142235, 75237251, 75296936, 75289497, 75208267, 75076431, 74939049, 74843254, 74814934, 74845566, 74899353, 74937057, 74940308, 74918106, 74892471, 74877045, 74868004, 74853439, 74829773, 74807549, 74800980, 74812439, 74828827, 74832970, 74818047, 74789612, 74754509, 74711395, 74656296, 74597847, 74562721, 74578682, 74646706, 74729462, 74772491, 74743904, 74659378, 74570496, 74526237, 74539818, 74585739, 74624619, 74631508, 74606262, 74563873, 74518257, 74473595, 74426346, 74371857, 74309441, 74243736, 74183693, 74139992, 74121376, 74130997, 74165054, 74214661, 74269043, 74317307, 74347900, 74348907, 74312096, 74240112, 74150650, 74071762, 74029358, 74033791, 74074265, 74122520, 74142647, 74102303, 73985184, 73803505, 73602310, 73445259, 73381538, 73413139, 73489578, 73539742, 73519295, 73435616, 73331116, 73242928, 73176949, 73117104, 73054031]
2272.1G3054031n3253k0782J9180M2603M0214K3438Q796L1j1399l0059m5708m1107
2283.7G2985985j1673K4307L7285J0109m6623j01815j27273j17500q9615o5209n1750
2294.3G2446228m1069k5345j2398k1179n9341j05530j19514p6096P629Q0132R5039
2304.9G2168556M8081k1569o6536p0221n6007o1371j01623j54358j76346j37764m8668
2315.5G1322174M3106Q1734M2122n0896j38123j67198j27632n2467J2573M3762M8195
2326.1G1057350M2664K9541m006o1439j15341j16982l7186R5078J96754J85250M7447
2336.7G1319130j36017k41218j94649l4744J14402J40198K8053j35688k41959k43874
2346.3G0373634j75514j01402n7472l7461k2751j0643j2840l7613q1657j34407j76483
$$ y = [73054031, 73000778, 72979996, 72999176, 73041779, 73081993, 73105431, 73114227, 73114258, 73102859, 73072800, 73027092, 72985985, 72974312, 72998619, 73035904, 73046013, 72999390, 72897575, 72770302, 72652802, 72563187, 72497978, 72446228, 72405159, 72379814, 72367416, 72346237, 72286896, 72181366, 72061852, 71985756, 71993385, 72073517, 72168556, 72216637, 72195068, 72128532, 72058311, 72002304, 71940933, 71839310, 71684952, 71508606, 71370842, 71322174, 71365280, 71447014, 71489136, 71438240, 71300117, 71132919, 71005287, 70952820, 70965393, 71009155, 71057350, 71100014, 71129555, 71125549, 71064110, 70948769, 70831787, 70794601, 70889679, 71086433, 71271683, 71319130, 71183113, 70941895, 70747246, 70712502, 70826904, 70967102, 70995155, 70859467, 70617508, 70373634, 70198120, 70096718, 70039246, 70001785, 69979034, 69968391, 69955551, 69917938, 69836281, 69701874, 69525391]
2356.9F9525391j71540p6667J15020L34000M52629L72017J10268j93657l75771l62053
2366.6F9729637k04841j9501J08551J64291J74652J61599J27319P1915Q811m2076p1037
2377.2G0209320q2565q5167q2672p6691p2144p5332q6640r7724r7771q1757n2673j9257
2388.8F9298927P042J5229N64l0380o2088q1551q7257q5426p7355n5595j5648K8732
2400.3F8855194M8256K1202m4792j14891j52298j42876r8709m3014N584L7400M7821
2410.9F8418877L5713N432l1975o3034p7843p4020n6953l7507k7183l0594m0657m3724
2422.5F7976532l3493k0767k5719n5771r0904r4887m7531L1639R2156R0530K4353o5506
2434.1F7780632j27159j35521j05660p3638o4301p3799p9781o6024l8323j7898k0562
$$ y = [69525391, 69353851, 69277184, 69392204, 69726204, 70178833, 70550850, 70661118, 70467461, 70091690, 69729637, 69524796, 69505295, 69613846, 69778137, 69952789, 70114388, 70241707, 70313622, 70322433, 70280357, 70209320, 70126755, 70041588, 69958916, 69882225, 69810081, 69734749, 69648109, 69550385, 69452614, 69370857, 69318184, 69298927, 69305969, 69321198, 69321762, 69291382, 69229294, 69147743, 69060486, 68975060, 68897705, 68842110, 68826462, 68855194, 68903450, 68924652, 68879860, 68764969, 68612671, 68469795, 68371086, 68328072, 68333656, 68371056, 68418877, 68454590, 68460022, 68428047, 68365013, 68287170, 68213150, 68156197, 68118690, 68091507, 68060913, 68020256, 67976532, 67943039, 67922272, 67896553, 67840782, 67749878, 67654991, 67607460, 67639099, 67731255, 67821785, 67846138, 67780632, 67653473, 67517952, 67412292, 67338654, 67274353, 67200554, 67120773, 67054749, 67016426, 66998528, 66977966]
2444.7F6977966m2717o6742p8231p6317o8016n6298l7910j3916K243o546m2069q2618
2456.3F6408829r8954q0902m7119k6962l2463m9622n6518m6433l2371k9717m0077n3276
2467.8F5814415o1714o6910p0976o6651m2579K59M1245N4702L2853o966l8933n0819
2479.4F5537926m8271l9925k3903O470M5181O6910M4586k3438j03576j47309j25488
2490F5189163m9225L9719R8801J11076Q8989N8007L5537K2835J2016j495j4198j9616
2501.6F5571609j5861o157O546K3491M5662O7093P4661N7922K0157k1850m9912n7930
2513.2F5715431n4237n1613n5344o0875o0730n2902m2564l6400l7842m6539o1592q2459
2524.7F5072334j05652j21307j16783q6708m1367l227P988j0010m1473o6979p8582
$$ y = [66977966, 66935249, 66868507, 66790276, 66713959, 66645943, 66589645, 66551735, 66537819, 66540062, 66533516, 66491447, 66408829, 66309875, 66228973, 66181854, 66154892, 66122429, 66072807, 66016289, 65969856, 65937485, 65907768, 65867691, 65814415, 65752701, 65685791, 65614815, 65548164, 65505585, 65505844, 65547089, 65601791, 65634644, 65627678, 65588745, 65537926, 65489655, 65449730, 65425827, 65432297, 65477478, 65544388, 65588974, 65565536, 65461960, 65314651, 65189163, 65139938, 65179657, 65278458, 65389534, 65478523, 65536530, 65572067, 65594902, 65606918, 65605423, 65591225, 65571609, 65555748, 65549591, 65556137, 65579628, 65625290, 65692383, 65767044, 65824966, 65845123, 65823273, 65773361, 65715431, 65661194, 65609581, 65554237, 65493362, 65432632, 65379730, 65337166, 65300766, 65262924, 65216385, 65154793, 65072334, 64966682, 64845375, 64728592, 64641884, 64600517, 64597290, 64605278, 64595268, 64553795, 64486816, 64408234]
2535.4F4408234q1749q4130q4961p7400n9402l9463k8782k9045l0442k3273j0624p111
2546.9F3851852k4326n7835q9660j03447r7824q5026p7084p4073o4843l9692k246L0140
2558.5F3165936L8890J8483j9261n4432p2696p2335o0199m3774k7519j4572q225r350
2570.1F2840946j4030j6987j8597k6638m7230p3688q6353o7597j8211M0180Q0128Q6323
2581.6F2678246O1370J8288k9560p1911r9953j06552r0000n6755j8784J2158K8065
2592.2F2324612K5272N035k4665n0229n9925n2963m1332l9959n3337p1789q1551p9628
2603.8F1799541p8037r2491j25366j58901j66417j34056p4840k2774r663m1935r5706
2614.4F0799355j34251j33949r8587n2624k0775j1711j6346j7769m116K3689N0675
$$ y = [64408234, 64326485, 64242355, 64157394, 64079994, 64020592, 63981129, 63952347, 63923302, 63892860, 63869587, 63858963, 63851852, 63827526, 63769691, 63680031, 63576584, 63478760, 63393734, 63316650, 63242577, 63177734, 63138042, 63135796, 63165936, 63204826, 63223309, 63204048, 63149616, 63076920, 63004585, 62944386, 62900612, 62873093, 62858521, 62850296, 62840946, 62826916, 62809929, 62791332, 62764694, 62717464, 62643776, 62557423, 62489826, 62471615, 62511795, 62591923, 62678246, 62739616, 62757904, 62728344, 62656433, 62556480, 62449928, 62359928, 62303173, 62284389, 62296547, 62324612, 62349884, 62354919, 62330254, 62280025, 62220100, 62167137, 62125805, 62085846, 62032509, 61960720, 61879169, 61799541, 61721504, 61629013, 61503647, 61344746, 61178329, 61044273, 60969433, 60946659, 60936996, 60895061, 60799355, 60665104, 60531155, 60432568, 60379944, 60359169, 60347458, 60331112, 60313343, 60309227, 60332916, 60383591]
2625F0383591N4832K1729l9326r2251r4753l2829N9433J18961J01341J8395p1083j10306
2636.6F0317734q9745m7592k8252m1492o0658n6469k8755m287o691l0957m7977l0827
2648.2E9844032K2805R1144J46996J75644J79248J68579J52180J31970J07185Q1150
2657.8F1100933O3461O4156Q4103J11358J28956J27400J09844Q5258N8380K8736p01
2668.4F1961884j9074j5922M447K0817J1460k6028p2140j03149j10619j03729r5947
2679F1452000r2602r1168q9256q7757q7463q7605q9981j01841j28490j61702j79229
2689.6F0254906j62133j14524o3977l8772m2931n4191m6986j8547P091M05m6799j12095
2701.2E9561447j57825j58413j18119o6700l6541l9691o1993p9552q0894p5386q0094
$$ y = [60383591, 60438423, 60460152, 60420826, 60328575, 60233822, 60200993, 60260426, 60379387, 60480728, 60499123, 60428040, 60317734, 60227989, 60180397, 60152145, 60110653, 60049995, 59993526, 59964771, 59960484, 59953793, 59922836, 59874859, 59844032, 59866837, 59957981, 60104977, 60280621, 60459869, 60628448, 60780628, 60912598, 61019783, 61100933, 61164394, 61228550, 61312653, 61424011, 61552967, 61680367, 61790211, 61875469, 61933849, 61962585, 61961884, 61942810, 61926888, 61931335, 61952152, 61963612, 61937584, 61865444, 61762295, 61651676, 61547947, 61452000, 61359398, 61268230, 61178974, 61091217, 61003754, 60916149, 60826168, 60724327, 60595837, 60434135, 60254906, 60092773, 59978249, 59914272, 59875500, 59832569, 59778378, 59731392, 59712845, 59719936, 59720341, 59673542, 59561447, 59403622, 59245209, 59127090, 59060390, 59023849, 58984158, 58922165, 58842613, 58761719, 58686333, 58606239]
2711.8E8606239r9376j18435j17253r0332n2242k4494j7933k7344m0668n0942n8975
2722.4E7908245o7310p4105p3738o2069m1294k0054r338j6792m1615p3253r5829r6528
2734E7236320p3032l4466M322L0678L9272L2238J5725l636k0302k9205k4467j423L8479
2746.5E7210503Q2927J12412J12240Q5510N3497M0844N6549Q8085J13472J19843J11351
2757.2E8187233J01154R7676R8446R4676P8965M8561M276n0091j06243j50654j68152
2767.8E8235847j48910r4605k0893M6223Q0082O7833K1641k4266l4298J778N8201R1564
2779.3E8280197P5691K4220k0184k0866K3788Q2936J22551J33514J33511J44455J69407
2789.9E9149220J90814J89682J64860J34392J19049J24584J38417J41594J23851Q9791
$$ y = [58606239, 58506863, 58388428, 58271175, 58180843, 58128601, 58104107, 58086174, 58058830, 58018162, 57967220, 57908245, 57840935, 57766830, 57693092, 57631023, 57589729, 57569675, 57560337, 57543545, 57501930, 57428677, 57332848, 57236320, 57163288, 57128822, 57133144, 57163822, 57203094, 57235332, 57251057, 57247421, 57227119, 57197914, 57173447, 57172024, 57210503, 57293430, 57405842, 57518082, 57603592, 57657089, 57697933, 57754482, 57842567, 57956039, 58075882, 58187233, 58288387, 58386063, 58484509, 58579185, 58658150, 58706711, 58710987, 58660896, 58554653, 58403999, 58235847, 58086937, 57992332, 57971439, 58017662, 58097744, 58165577, 58187218, 58162952, 58128654, 58130432, 58188633, 58280197, 58355888, 58380108, 58359924, 58339058, 58362846, 58445782, 58568333, 58701847, 58835358, 58979813, 59149220, 59340034, 59529716, 59694576, 59828968, 59948017, 60072601, 60211018, 60352612, 60476463, 60566254]
2799.6F0566254N4168L1643K8729M1672N9650P1316P0785N9510M2984K5772J0059j362
2811.2F1061180k903J0155L4328N5298N6004L0235j1166m8034o5037n9570l8090q988
2822.7F1013412J8513L0716J2146m1771j12877j66824j77761j50292j15898j05205
2832.4F0204159j23226j51162j70749j82179j95846k10327k05727j64486r6355l6866
2842E8667236j5899k8885m2446k9786J511J8620r01m5913q3802r2788p9159o3732n6935
2854.6E8147121n0304l2238o672P843k277k8630m5364l1303J2149O2912R7561J08326
2866.1E8239124J03409R3567Q1253O4140M6826M3419O3533R5719J10279Q6136L6136
2876.7E9063541J660J6048P1083J22845J33408J06948Q3470R7629J46256J96205K19234
$$ y = [60566254, 60620422, 60652065, 60680794, 60722466, 60782116, 60853432, 60924217, 60983727, 61026711, 61052483, 61062542, 61061180, 61058277, 61068432, 61102760, 61158058, 61214062, 61244297, 61233131, 61185097, 61120060, 61060490, 61022400, 61013412, 61031925, 61062641, 61074787, 61033016, 60920139, 60753315, 60575554, 60425262, 60309364, 60204159, 60080933, 59929771, 59759022, 59576843, 59380997, 59170670, 58964943, 58800457, 58704102, 58667236, 58651337, 58622452, 58580006, 58550220, 58551731, 58570351, 58569450, 58523537, 58439735, 58346947, 58267788, 58204056, 58147121, 58096817, 58064579, 58057907, 58065750, 58063473, 58034843, 57989479, 57958176, 57970325, 58033237, 58130798, 58239124, 58342533, 58436100, 58517353, 58581493, 58628319, 58671738, 58735271, 58830990, 58941269, 59027405, 59063541, 59065201, 59081249, 59152332, 59275177, 59408585, 59515533, 59599003, 59696632, 59842888, 60039093, 60258327]
2887.3F0258327K14512J98243J78928J50631J09405O8730N0976O3209Q6037R0336O4846
2897.9F1534180K5425l014j2035j5946l4702p2228j12617j36005j37238j29757j32309
2908.6F0773754j52019j79596j99501k04430j99993j96308j95732j90640j72489j42891
2918.2E8940155j13499r4837q6071p6778n8655l3199p580J6594M6287Q7845J34705
2928.8E8754967J67736J69861J41628J02505P6191P4791R5516J29844J71692K15164
2938.5F0099895K47555K50515K13909J49739Q8993O0467O9332R5932J15852J21201
2948.1F1513390J23176J34892J54647J66596J57398J30860J05842R9838J14029J32450
2957.7F2833118J34709J11126O8729K4151r884l3516n6515q6177j17699j37005j33652
$$ y = [60258327, 60472839, 60671082, 60850010, 61000641, 61110046, 61178776, 61229752, 61292961, 61378998, 61469334, 61534180, 61559605, 61556591, 61544556, 61528610, 61493908, 61421680, 61309063, 61173058, 61035820, 60906063, 60773754, 60621735, 60442139, 60242638, 60038208, 59838215, 59641907, 59446175, 59255535, 59083046, 58940155, 58826656, 58731819, 58645748, 58568970, 58510315, 58477116, 58469536, 58486130, 58532417, 58620262, 58754967, 58922703, 59092564, 59234192, 59336697, 59412888, 59487679, 59583195, 59713039, 59884731, 60099895, 60347450, 60597965, 60811874, 60961613, 61050606, 61111073, 61180405, 61276337, 61392189, 61513390, 61636566, 61771458, 61926105, 62092701, 62250099, 62380959, 62486801, 62586639, 62700668, 62833118, 62967827, 63078953, 63147682, 63171833, 63161949, 63128433, 63071918, 62985741, 62868042, 62731037, 62597385]
2968.3F2597385j10889q2981o3915o0337p4280j07388j56795k06429k29297k06421
2978F1298653j47694r0305p1194r6523j38245j59733j45523j07414o5868k9862N177
2988.6F0251469M3819P9987J00578R7752P6679N1979L7845L9021M8454N1945L7994
2999.2F0917522N906l4104p0202r8987j25439j52840j74526j78993j63506j39583j22204
3009.8E9663044j13613j01101p2514l2325N83J1276L224o161j655K0267N4978R6328
3021.4E9522331J35540J57200J45523J00784M7951K1977L9207Q3306J21860J37611
3031F0513290J42304J59237J94633K28565K33582K00233J43956R0713N8808N3138O9550
3041.6F2088009R8366J24229J29295J04393N9201J8886O062K3884N4928P5614P1587
$$ y = [62597385, 62486496, 62403515, 62339600, 62279263, 62204983, 62097595, 61940800, 61734371, 61505074, 61298653, 61150959, 61060654, 60989460, 60892937, 60754692, 60594959, 60449436, 60342022, 60276154, 60246292, 60251469, 60295288, 60375275, 60475853, 60573605, 60650284, 60702263, 60740108, 60779129, 60827583, 60879528, 60917522, 60923428, 60889324, 60819122, 60720135, 60594696, 60441856, 60267330, 60088337, 59924831, 59785248, 59663044, 59549431, 59448330, 59375816, 59343491, 59344074, 59355350, 59358574, 59352413, 59350758, 59371025, 59426003, 59522331, 59657871, 59815071, 59960594, 60061378, 60109329, 60131306, 60170513, 60253819, 60375679, 60513290, 60655594, 60814831, 61009464, 61238029, 61471611, 61671844, 61815800, 61906513, 61965321, 62018459, 62088009, 62186375, 62310604, 62439899, 62544292, 62603493, 62622379, 62628441, 62652325, 62707253, 62782867, 62854454]
3052.2F2854454M2572k575n1155q8818j02825q9618o1345m1851n1216q9912j36490
3062.9F2181221j62792j55083j24466r8221r8282j23847j52173j57634j33763r8484
3072.5F0876476p7198p7373p9121n2051J5937J04565J75301K00439J81896J43994J11572
3083.1F1524437R3628Q4255P3822N7865L7640J7105J133n329j68J2424K2702K2262
3094.7F1941776J2383N176J5663M9363R5234J30485J35594J10599P8911P2262J04862
3105.3F2752308J56719J84734J56979Q3382J4145L131O5873J66954K46917K63432K14607
3115.9F4309181J30264M7020j0742l4431k6688K655L8971O7513P9849P6561O3217M4388
3127.5F4787758K2110r92j9409k7084k2172q918M860J1497O386r666k8283l5522k0615
$$ y = [62854454, 62897026, 62894451, 62843296, 62754478, 62651653, 62562035, 62500690, 62458839, 62407623, 62317711, 62181221, 62018429, 61863346, 61738880, 61640659, 61542377, 61418530, 61266357, 61108723, 60974960, 60876476, 60799278, 60721905, 60642784, 60590733, 60606670, 60711235, 60886536, 61086975, 61268871, 61412865, 61524437, 61618065, 61702320, 61776142, 61834007, 61871647, 61888752, 61889885, 61884556, 61884388, 61896812, 61919514, 61941776, 61954159, 61959335, 61974998, 62024361, 62119595, 62250080, 62385674, 62496273, 62575184, 62647446, 62752308, 62909027, 63093761, 63250740, 63334122, 63348267, 63351398, 63417271, 63584225, 63831142, 64094574, 64309181, 64439445, 64486465, 64475723, 64441292, 64414604, 64417259, 64456230, 64523743, 64603592, 64680153, 64743370, 64787758, 64809868, 64808876, 64789467, 64762383, 64740211, 64731293, 64736153, 64747650, 64754036, 64744370, 64716087, 64680565, 64659950]
3140F4659950J3153M6585N7488L9047P218j1170o9L3699O6811P7278N8823K2819r727
3152.5F5061905j9425K099M7576R7428J30783J37863J24199J03317Q4336O6886M6082
3163.1F5883049K1729J350n142O729L1975N7472O7879N3817J9310j7418l4591k3224
3174.7F6062935M272K3285J7784n645k3415j5167K0088O4285R4071R5688P1769L9032
3186.3F6448982J9432K7558O0188R6130J10054R1607N3428K0394R376J8189L1959L8155
3197.9F7025452L5072K8313K2674J8067J0818l235k5696n2612p2922p3082m7439n745
3209.4F6859665L1280M6601L8292J7814j602j3099j4275k251K3850N5076P2014N8098
3221F7171463J6731k6565m2885k3766J2741L9566M4686L7659L3447L2501J9379j6579
$$ y = [64659950, 64673103, 64719688, 64777176, 64816223, 64823441, 64812271, 64812202, 64845901, 64912712, 64989990, 65048813, 65071632, 65061905, 65042480, 65044579, 65092155, 65189583, 65320366, 65458229, 65582428, 65685745, 65770081, 65836967, 65883049, 65904778, 65906128, 65900986, 65907715, 65939690, 65997162, 66065041, 66118858, 66138168, 66120750, 66086159, 66062935, 66067207, 66090492, 66108276, 66102631, 66079216, 66064049, 66084137, 66148422, 66242493, 66338181, 66409950, 66448982, 66468414, 66495972, 66556160, 66652290, 66762344, 66853951, 66907379, 66927773, 66937149, 66955338, 66987297, 67025452, 67060524, 67088837, 67111511, 67129578, 67140396, 67137161, 67111465, 67058853, 66985931, 66912849, 66865410, 66859665, 66890945, 66937546, 66975838, 66993652, 66992050, 66978951, 66964676, 66962425, 66986275, 67041351, 67113365, 67171463, 67188194, 67161629, 67118744, 67094978, 67107719, 67147285, 67191971, 67229630, 67263077, 67295578, 67314957, 67298378]
3232.6F7298378o1157p9949m7599K4887R3116J12290P1266j617o3004q3618n9822o356
3244.2F7196815N4131R6329R8640N6015j1329o8108r0103q1566o3805m7424k1011K7908
3255.7F7146492Q3969J05217O0837l2425j15875j36193q9111j8211K6413K7939O797
3266.3F7065849p049j335J4473K4383K1118R888K281P172K3491L8444L4470L052m4510
3278.9F7191727q1612q6090n9059k5391j3138k9686n5465o0753l0609K2422O8100Q0605
3290.4F6921051N6274J3192k4468m4029n0407n6916p0358q3565q2138n9112k4636p17
3302F6494171m333l2074o0707o4965l9093l738R323j6373o7085j08513j12404p7675
3313.6F5916534k9388J274j343l0006o2645p6950o2630k7298N455P591l4629j06385
$$ y = [67298378, 67237221, 67157272, 67109673, 67134560, 67227676, 67339966, 67411232, 67409615, 67346611, 67262993, 67203171, 67196815, 67250946, 67347275, 67445915, 67501930, 67490601, 67422493, 67332390, 67250824, 67187019, 67139595, 67118584, 67146492, 67230461, 67335678, 67396515, 67364090, 67248215, 67112022, 67022911, 67004700, 67031113, 67059052, 67065849, 67058800, 67057465, 67071938, 67096321, 67117439, 67127327, 67129608, 67136780, 67160271, 67198715, 67233185, 67236237, 67191727, 67110115, 67024025, 66964966, 66939575, 66926437, 66896751, 66841286, 66780533, 66749924, 66772346, 66840446, 66921051, 66977325, 66990517, 66966049, 66922020, 66871613, 66814697, 66744339, 66660774, 66578636, 66519524, 66494888, 66494171, 66489838, 66457764, 66397057, 66332092, 66292999, 66289261, 66298584, 66282211, 66215126, 66106613, 65994209, 65916534, 65887146, 65888420, 65887077, 65857071, 65794426, 65717476, 65654846, 65627548, 65633003, 65640594, 65605965, 65499580]
3325.2F5499580j68235j80298j30776m5784K8443N6572L4103j7372p0343j08208j27868
3335.8F4769814j32897j27808j17553j07262r8762q8227p0770n0247m2690o4751j15177
3346.4F3753670j68247j90533j68614j21868q6178q2569j00315j09913r2071n4928
3356F2578434k5421k6657o2046j16036j64093j82663j58291r7915l3158p400m5971
3366.6F1658783j31218k07993k22049j61968o8867m540n996o2771j31893j72089j68274
3377.2F0321125j31912q5804m9877l5622m6261p6557j12789j37486j39167j20610r6790
3387.8E9288250q2768q0841p9475o6307m2950k6592l4744o6826j01112j11962r2457
3398.4E8502216o0657m3255n1849p4559q9882q8405q0753q4771j06018j31431j40889
$$ y = [65499580, 65331345, 65151047, 65020271, 64974487, 65002930, 65059502, 65093605, 65076233, 65005890, 64897682, 64769814, 64636917, 64509109, 64391556, 64284294, 64185532, 64097305, 64026535, 63976288, 63933598, 63868847, 63753670, 63585423, 63394890, 63226276, 63104408, 63018230, 62935661, 62835346, 62725433, 62633362, 62578434, 62553013, 62526356, 62464310, 62348274, 62184181, 62001518, 61843227, 61745312, 61712154, 61704754, 61658783, 61527565, 61319572, 61097523, 60935555, 60866688, 60862148, 60856152, 60793381, 60661488, 60489399, 60321125, 60189213, 60103409, 60053532, 60017910, 59971649, 59895092, 59782303, 59644817, 59505650, 59385040, 59288250, 59205482, 59124641, 59045166, 58978859, 58935909, 58909317, 58874573, 58807747, 58706635, 58594673, 58502216, 58441559, 58398304, 58346455, 58271896, 58182014, 58093609, 58012856, 57928085, 57822067, 57690636, 57549747]
3409.1E7549747j25091r1209n3341j9608R846L3664M1802K1034k9644r0851j32255
3419.7E7114094j34178j01220n6301k0782k7J3516K5714L1628K0580j0768n1453q2092
3431.2E6748711q7929o7524l1868L193K5112K9354K0134P725K865J0746K7874M3949
3442.8E6732342M7867L4141O661k3011m2102m5166l8502l4958m1226m8435l6926N497
3454.4E6516182O7532J17122J24500Q6323K9537r502j1814J4313M6913P1350Q8592
3465E7141048J04706J16089J08070O9981J1810l6151m3152j419O7421J28200J56002
3475.6E7822605J47846J15776P2697K6020j7769m8229n5241l8463r979J4991K9911
3486.2E8060165L9002M7714N4089N0472L3318Q819j1036j6434l128K9042P5348J22417
$$ y = [57549747, 57424656, 57333447, 57280106, 57260498, 57270344, 57304008, 57345810, 57366844, 57337200, 57246349, 57114094, 56979916, 56878696, 56822395, 56801613, 56801586, 56815102, 56840816, 56872444, 56893024, 56882256, 56830803, 56748711, 56660782, 56593258, 56561390, 56564583, 56589695, 56619049, 56639183, 56646908, 56649773, 56660519, 56688393, 56732342, 56780209, 56814350, 56821011, 56798000, 56755898, 56710732, 56672230, 56637272, 56596046, 56547611, 56510685, 56516182, 56583714, 56700836, 56825336, 56911659, 56941196, 56931694, 56919880, 56934193, 56981106, 57052456, 57141048, 57245754, 57361843, 57469913, 57539894, 57551704, 57515553, 57472401, 57470982, 57538403, 57666603, 57822605, 57970451, 58086227, 58158924, 58184944, 58167175, 58118946, 58063705, 58025242, 58015263, 58030254, 58060165, 58099167, 58146881, 58200970, 58251442, 58284760, 58293579, 58282543, 58266109, 58262981, 58292023, 58367371, 58489788]
3497.8E8489788J48602J36005Q6090K3689j9111k5719m169K5428N0412P2242R5936
3508.4E9079193J17279J23753J07475P4715M0680J5651j098j3279j5709N421N7750
3519E9591831J28018J84787J98887J64978J05034N1960K8309L7045O6890J02558J29658
3529.6F0789955J35765J14666P4169L8037L2707O4918J10253J28452R7435L6915l105
3540.2F1620167J6380Q6063J51288J56135R2548J0129k3278K2888J18515J99223K16152
3550.8F2666210J66039Q2882P953l2089k9167J0338O7543J15783J35216J29303J22402
3561.4F3442413J34415J55663J52355J01616K0801m2293n0629q465M8531R0042J13006
3572F4157455J30227J44744J44005J18332P9254N4062O3050J03813J56707K00089K18788
$$ y = [58489788, 58638390, 58774395, 58860485, 58884174, 58865063, 58839344, 58835175, 58860603, 58911015, 58983257, 59079193, 59196472, 59320225, 59427700, 59502415, 59543095, 59558746, 59557648, 59544369, 59528660, 59534081, 59591831, 59719849, 59904636, 60103523, 60268501, 60373535, 60425495, 60453804, 60490849, 60557739, 60660297, 60789955, 60925720, 61040386, 61114555, 61152592, 61185299, 61250217, 61360470, 61488922, 61586357, 61623272, 61620167, 61636547, 61722610, 61873898, 62030033, 62122581, 62132710, 62109432, 62132320, 62250835, 62450058, 62666210, 62832249, 62915131, 62923084, 62890995, 62861828, 62872166, 62939709, 63055492, 63190708, 63320011, 63442413, 63576828, 63732491, 63884846, 63986462, 64007263, 63964970, 63914341, 63905876, 63954407, 64044449, 64157455, 64287682, 64432426, 64576431, 64694763, 64774017, 64828079, 64891129, 64994942, 65151649, 65351738, 65570526]
3582.6F5570526K03003J48880O5788j9592p2746p1160j8356N8281J22269J45141J19362
3593.2F6251396O4369K1012K8915R5429J81709K26097J93794J10413M3884M6227J07513
3603.9F7370758J67160J72440J27136Q2703Q3084J20704J48018J29952Q0497M5678
3613.5F8528130N3367Q4480R5421O5033J5480j3412n158K2408M4899O2080R4094J47544
3625.1F9194366J92429J82655J03104n539p3799o0616J3657Q8898J19003J05423Q2161
3635.7F9941742P3296P0175M9339P767k6390j9959L0388R2125J25450J15769P8537
3646.3G0538239L7437L777k2248l6697k7535J1513O5643J03165R8869N5352K128k6214
3657.9G0803429j5396J8768M3594L6583O920j0124J3679O4736R0500M7828m4586j09207
$$ y = [65570526, 65773529, 65922409, 65988197, 65968605, 65895859, 65824699, 65806343, 65864624, 65986893, 66132034, 66251396, 66315765, 66336777, 66365692, 66461121, 66642830, 66868927, 67062721, 67173134, 67217018, 67263245, 67370758, 67537918, 67710358, 67837494, 67920197, 68003281, 68123985, 68272003, 68401955, 68482452, 68528130, 68581497, 68665977, 68761398, 68826431, 68841911, 68828499, 68823341, 68845749, 68890648, 68952728, 69046822, 69194366, 69386795, 69569450, 69672554, 69667015, 69593216, 69532600, 69546257, 69635155, 69754158, 69859581, 69941742, 70015038, 70085213, 70134552, 70142319, 70115929, 70095970, 70126358, 70218483, 70343933, 70459702, 70538239, 70575676, 70579453, 70557205, 70520508, 70492973, 70504486, 70570129, 70673294, 70772163, 70827515, 70829643, 70803429, 70788033, 70806801, 70850395, 70886978, 70893898, 70883774, 70897453, 70962189, 71052689, 71100517, 71055931, 70946724]
3669.4G0946724p8255L3348J29547J18409J266j25786j61316q9935J4481O8870N6481
3680G0913834K5940K8465O9099J15868J39900J35079J04805M9133k3766q2931r0370
3690.6G1385056m1085J9463L1616j8204p7942p6057R384J27205J95358J65428N2346
3701.3G1772568q5335j84464k03269j31691K655J35635J91841J32423r109j42944j87569
3711.9G1290741j30646l1357L5912M2831J7693M662J8310L7964L8345J8593k67O79
3723.4G1343460K0584M3984N6640N3925L7895J2749j4145l1517l0228j2710N348N707
3735G1491692j6747m7264n8403k8427M0214J13289J39008Q2901l7392j49032j67763
3745.6G1362076o2782J10443K42614K47345J20758o1569k01958k41989j86416q4694
$$ y = [70946724, 70868469, 70901817, 71031364, 71149773, 71151039, 71025253, 70863937, 70774002, 70788483, 70857353, 70913834, 70939774, 70968239, 71037338, 71153206, 71293106, 71428185, 71532990, 71582123, 71558357, 71475426, 71385056, 71343971, 71363434, 71395050, 71376846, 71298904, 71222847, 71232231, 71359436, 71554794, 71720222, 71772568, 71687233, 71502769, 71299500, 71167809, 71170464, 71306099, 71497940, 71630363, 71621254, 71478310, 71290741, 71160095, 71128738, 71164650, 71207481, 71225174, 71229836, 71248146, 71286110, 71324455, 71343048, 71342781, 71343460, 71364044, 71408028, 71464668, 71518593, 71556488, 71569237, 71555092, 71523575, 71493347, 71480637, 71485985, 71491692, 71474945, 71427681, 71369278, 71340851, 71381065, 71494354, 71633362, 71716263, 71678871, 71529839, 71362076, 71299294, 71409737, 71652351, 71899696, 72020454, 71958885, 71756927, 71514938, 71328522, 71243828]
3755.3G1243828M844M4953L3310j900k4551j9623n577j4458n4626r4269q7479k1103
3766.8G1003349O5819J12648Q9737K2049l6697n0339k2751J7029M3411M7249L0685
3777.4G1322189M43l0708m3976k6894J0452L6301K2171k8961q0818r3392n6610L311
3789G1033508M9111O2324N0797L2303J6937N447j625j159N287P995J07p706Q072N6732
3802.5G1318130J10741J18569M8896p3944j80664k08259j46477m0604M5540P1091L5026
3813.1G1098045l2264q7525r4406m2663M1557J08101J17386P0373M570m1778o1181
3823.7G1080215p1350q3557q5396o0234j7563P454p576l9444l5675L0480J23550J71768
3835.3G1012672J33263L6049m9233p4424n0377k0989j0460l791K0759N2147N3696J2192
$$ y = [71243828, 71248672, 71293625, 71326935, 71325035, 71300484, 71280861, 71275284, 71260826, 71206200, 71111931, 71024452, 71003349, 71069168, 71181816, 71271553, 71293602, 71256905, 71206566, 71183815, 71200844, 71244255, 71291504, 71322189, 71322632, 71291924, 71247948, 71221054, 71231506, 71267807, 71289978, 71261017, 71180199, 71086807, 71030197, 71033508, 71082619, 71144943, 71195740, 71228043, 71244980, 71250427, 71248802, 71247643, 71252930, 71260925, 71261032, 71253326, 71261398, 71318130, 71428871, 71547440, 71596336, 71522392, 71341728, 71133469, 70986992, 70946388, 70991928, 71063019, 71098045, 71065781, 70978256, 70883850, 70841187, 70882744, 70990845, 71108231, 71178604, 71183174, 71141396, 71080215, 71008865, 70925308, 70839912, 70779678, 70762115, 70769569, 70761993, 70722549, 70686874, 70717354, 70840904, 71012672, 71145935, 71181984, 71132751, 71058327, 71007950, 70986961, 70976501, 70972710, 70993469, 71045616, 71099312, 71111504]
3846.9G1111504l1411j7219O0852J28212R1659o2217k35443k96273j95564p408J43463
3857.5G0690155J89301J54792R9366M6051k1355j02303j48552j07284Q392J10985J14548
3868.1G1034096J8730r1065j28891q9279m0046m1031q0185r4086m3434M1916R5512
3878.7G0582237Q3267L2425o218j3633j1917k3072l2524n157O3759J25434J17356K7855
3890.3G0939812q3557j35689r6573o508O3858P3608L3005k2835o9061r9876j14350
3900.9G0481834j06880p4646k8824J0102K8763L1692L4431M7364O6665P8988P3242
3911.5G0642731M9362J8585m524j2215r399r545k3628n1071p9742r3506q1383m3762
3923.1G0301903O012M6150N9738M9843L9749N1544P9911R1903N9052q538o5513p2945
$$ y = [71111504, 71080093, 71062874, 71123726, 71251938, 71343597, 71281380, 71045937, 70749664, 70554100, 70546692, 70690155, 70879456, 71034248, 71133614, 71179665, 71158310, 71056007, 70907455, 70800171, 70808563, 70919548, 71034096, 71052826, 70961761, 70832870, 70743591, 70703545, 70662514, 70582329, 70488243, 70444809, 70486725, 70582237, 70665504, 70697929, 70691711, 70678078, 70666161, 70643089, 70610565, 70605408, 70669167, 70794601, 70911957, 70939812, 70856255, 70720566, 70623993, 70617485, 70681343, 70754951, 70787956, 70765121, 70696060, 70596184, 70481834, 70374954, 70300308, 70271484, 70281586, 70310349, 70342041, 70376472, 70423836, 70490501, 70569489, 70642731, 70692093, 70710678, 70706154, 70693939, 70684540, 70674995, 70651367, 70600296, 70520554, 70427048, 70345665, 70301903, 70307915, 70354065, 70413803, 70463646, 70503395, 70554939, 70634850, 70726753, 70785805, 70777267, 70711754, 70638809]
3934.6G0638809l5454N372J2725j3809m6799o2149n7060m2267k7542j7219j2734j1284
3946.2G0330589m425J3748L3913L4302K533m7585q7143j00982r8816r5940q9134n9982
3957.8F9831078j236O7428J12816J13861P3746J4427l4576m9202k8946n181j8272p2487
3969.3G0003456j19758j05515l3646K9549K8946j5663l7995j2436J6541M662k1393
3980F9736748j030N8716O7665l3417j75530k31117j75880j19049j41342j65230p4974
3990.6F8745560N1330l4118l94585o77551m79935q1253o51703l363266q020657j2616802
4000.2D2477020
$$ y = [70638809, 70603355, 70608727, 70621452, 70607643, 70560844, 70498695, 70441635, 70399368, 70371826, 70354607, 70341873, 70330589, 70326164, 70339912, 70373825, 70408127, 70410660, 70363075, 70275932, 70174950, 70076134, 69980194, 69891060, 69831078, 69829842, 69897270, 70010086, 70123947, 70197693, 70212120, 70177544, 70128342, 70099396, 70094215, 70075943, 70003456, 69883698, 69778183, 69744537, 69774086, 69803032, 69787369, 69749374, 69736938, 69753479, 69758141, 69736748, 69735718, 69794434, 69862099, 69828682, 69653152, 69422035, 69246155, 69127106, 68985764, 68820534, 68745560, 68796890, 68762772, 68368187, 67690636, 67210701, 67129448, 66477745, 63114479, 55093822, 42477020]
##END=$$ End of the data block
