##TITLE=$$ Begin of the data block
##JCAMP-DX=5.00 $$ ACD/SpecManager v 10.08
##SPECTROMETER/DATA SYSTEM=Varian
##DATE=16 Apr 2013 13:59:42
##DATA TYPE=INFRARED SPECTRUM
##DATA CLASS=XYDATA
##ORIGIN=
##OWNER=
##NPOINTS=3735
##FIRSTX=399.26403809
##LASTX=4000.35498047
##MAXX=4000.35498047
##MINX=399.26403809
##MAXY=1000.00000000
##MINY=0.00000100
##XFACTOR=1.0000000000
##YFACTOR=0.000010000000000
##FIRSTY=10.61927700
##DELTAX=0.96440572
##XUNITS=1/CM
##YUNITS=TRANSMITTANCE
##XYDATA=(X++(Y..Y))
399.3A061928J369446%Tk431374%ZJ057918L189239m247157%TL4395895k2125563j2270332
418.6@%S1K0524258J920372%Zk1713316K975892L217725J3733803K1595850%l2004059
445.6A0250525N359819%Tj5610344K8540802%k8540802N519653J315944%Vo835597
459.1@%VQ363287L316819K48063n75574m725759m236926k389910N575999K158411k182679
472.6E551731P77617O5231590K8439062q8503905k436612N476978O150242n594836
480.3A5091867j1239553j951636J427347K677125K406678M186774R212154j320255
488B0490501l183697l031893m841248l402362J470846K824901j288668j491423O18068
496.7H165025L526497J305413p53390K008794N674230j999331q306816k162068N5682
$$ y = [1061928, 2431374, 2431374, 2431374, 0, 0, 0, 0, 0, 0, 0, 0, 0, 1057918, 4247157, 0, 0, 0, 34395895, 12270332, 0, 0, 0, 0, 0, 0, 0, 0, 0, 0, 0, 0, 20524258, 22444630, 22444630, 22444630, 22444630, 22444630, 22444630, 22444630, 22444630, 22444630, 731314, 3707206, 6924931, 20658734, 42254584, 42254584, 10250525, 15610344, 15610344, 15610344, 0, 28540802, 28540802, 0, 5519653, 6835597, 6835597, 6835597, 6835597, 6835597, 0, 0, 0, 0, 0, 8363287, 11680106, 11928169, 11352595, 6626836, 2389910, 0, 5575999, 7734410, 5551731, 6329348, 71560938, 100000000, 11496095, 9059483, 14536461, 20686703, 15091867, 3852314, 1900678, 3328025, 6005150, 8411828, 12598602, 21810756, 20490501, 17306804, 14274911, 9433663, 6031301, 7502147, 10327048, 9038380, 7546957, 8165025, 11691522, 12996935, 12243545, 14252339, 19926569, 17927238, 9620422, 7458354, 7514036]
505.3G514036k66340Q35712J091436J48320P41909K291252O38501k409473j622192
514H963161n79078m78839p79364J22136R85110P99400L90380O34186Q47418m83569
523.7A0420941j306077n88661L90891M71333l27538l13154M99708J236284R52169m00738
533.3A1035158o26849l52216m24055m16977o2475M65483M45843j32283k31608N64536
543A0264557K44787m16839J89697L07866n56330o74967K82255M65500j10654l02001
552.6I693871n1817M55111q8909p3192M39931L26851n86094j030793L07863N62712
562.3I955534k35260n3186L87265O04968o3378m79105k08511K32762M09015n22310
571.9A0027794o86064R660K40609K07583K19965K24868K52111k88987j07153L2780
$$ y = [7514036, 7247696, 8083408, 9174844, 9323164, 10065073, 12356325, 12994826, 10585353, 8963161, 8384083, 7905244, 7125880, 7248016, 8233126, 9032526, 9422906, 10057092, 10904510, 10420941, 9114864, 8526203, 8917094, 9388427, 9060889, 8747735, 9247443, 10483727, 11435896, 11035158, 10408309, 10056093, 9632038, 9215061, 9152586, 9618069, 10063912, 9931629, 9700021, 10264557, 10509344, 10092505, 10282202, 10590068, 10033738, 9358771, 9641026, 10106526, 9995872, 9693871, 9642054, 10097165, 10008256, 9935064, 10374995, 10701846, 10115752, 9084959, 9392822, 9955534, 9720274, 9667088, 10054353, 10659321, 10595943, 10116838, 9908327, 10141089, 10550104, 10027794, 9341730, 9351390, 9591999, 9799582, 10019547, 10244415, 10496526, 10207539, 10100386, 10133166]
581.5A0133166m66952o945L81857M66052l45257p72371J58694N17043J24049j42771
591.2A0046565K18820J27599k41997k18546k97218N7533N5093K35587L88414J04603
600.8A0476453K6679l67011k83403k31741o5119L44037R0166j41639m0290K46915K07866
611.4A0262913k8842k07602k38552Q7212N609l18789j67807J98702K17674K93491J82047
622A0286056k4666N2911m02356l93993n5695l62278k75028K47864N00047K64266j01032
632.7I736096j76394J13826K40718k0713j79897k02309j72761k7545K26369M05642
642.3I943032K26347k09061q6189J40824M2754P0196k46690l14748N360M4375n8022
652.9I558178j34795J95767K91768j7144j49771j12252N6307m0202k45936k75325p1451
$$ y = [10133166, 9666214, 9659269, 10041126, 10507178, 10161921, 9389550, 9548244, 10065287, 10189336, 10046565, 10265385, 10392984, 10150987, 9932441, 9635223, 9692756, 9747849, 9983436, 10371850, 10476453, 10503132, 10136121, 9852718, 9620977, 9555858, 9899895, 9990061, 9848422, 9808132, 10055047, 10262913, 10234071, 10026469, 9787917, 9875129, 9880738, 9561949, 9394142, 9592844, 9810518, 10104009, 10286056, 10261390, 10314301, 9911945, 9517952, 9462257, 9099979, 8824951, 9072815, 9572862, 9837128, 9736096, 9559702, 9673528, 9914246, 9893533, 9713636, 9511327, 9338566, 9311021, 9537390, 9943032, 10169379, 9960318, 9874129, 10014953, 10057707, 10127903, 9881213, 9566465, 9571825, 9616200, 9558178, 9423383, 9619150, 9910918, 9893774, 9744003, 9631751, 9688058, 9647856, 9401920, 9126595, 9055144]
663.5I055144K26121K42227K22926O59551L65744q21386l69517m61917l7490K91877
673.2I373280L09202K58235j77286j00427R9287j27052j12447P3701N3225j29365r0000
683.8I430353K81073J40240l23868J24446K90363L0863P1471k92122j55854K14743
693.4I811708L8399j74951j88350l2975J26790K94614K02084J2444j57066k13080J28150
704I847767J41794j79103j44242J36293J95312k4460k06639r6990L6993n1150L3671
714.6I689246n3758j46180P3163K0935j1296J79141J53993q0533N4561J87478m9633
725.2A0017117j54837q9096N5245J2087r8319j5617K3853M6695N5004j45623j57750
735.8I548759K27358J89129K225l1611k01705j26637j14740K8542J44667j5944N0988
$$ y = [9055144, 9281265, 9523492, 9746418, 10405969, 10771713, 9950327, 9580810, 9118893, 9081403, 9373280, 9682482, 9940717, 9763431, 9663004, 9762291, 9635239, 9522792, 9596493, 9649718, 9520353, 9430353, 9711426, 9851666, 9527798, 9652244, 9942607, 9973470, 10044941, 9752819, 9596965, 9811708, 9850107, 9675156, 9486806, 9453831, 9580621, 9875235, 10077319, 10089763, 9932697, 9719617, 9847767, 9989561, 9810458, 9666216, 9802509, 9997821, 9973361, 9766722, 9669732, 9706725, 9655575, 9689246, 9635488, 9489308, 9562471, 9583406, 9572110, 9751251, 9905244, 9824711, 9879272, 10066750, 10017117, 9862280, 9773184, 9828429, 9840516, 9742197, 9726580, 9750433, 9797128, 9852132, 9706509, 9548759, 9776117, 9965246, 9967471, 9935860, 9734155, 9607518, 9492778, 9521320, 9665987, 9650043, 9701031]
746.5I701031K0414p0821o7888j79942k46687k13836l31353l48025j57260j3711J25260
757.1H217182J09034K28321L72882K94413J16427j8962J08335J87560J52572q0423
766.7I687341j80019J04803J38771R8622N1684p6440j13806p1740j0644l8694m1338
777.3I548540p1318R2048K65217J20187j02421k00624m5519J0340k736N5011j29613
787.9I539112k00899R2025J69123J04763O1726j88696L5077J86051j54724j77050j41086
798.5I325422M2638K88666J18119q7829M0592J79153n2585j97869m8298L9393o7496
809.1I579906j8216J98358J28763o7007o7368O7418J24522M8212j29566k14914q6138
819.7I563970j08156j54497n5593L4115J73554J52212j8744j43534k97918j06617J5345
$$ y = [9701031, 9721445, 9650624, 9582736, 9402794, 9156107, 8942271, 8610918, 8262893, 8105633, 8091922, 8217182, 8326216, 8554537, 8927419, 9221832, 9338259, 9319297, 9427632, 9615192, 9767764, 9687341, 9507322, 9612125, 9750896, 9849518, 9901202, 9824762, 9710956, 9639216, 9628572, 9589878, 9548540, 9477222, 9569270, 9834487, 9954674, 9852253, 9651629, 9606110, 9616450, 9613714, 9668725, 9539112, 9338213, 9430238, 9599361, 9704124, 9765850, 9577154, 9612231, 9798282, 9643558, 9466508, 9325422, 9368060, 9656726, 9774845, 9687016, 9727608, 9906761, 9854176, 9656307, 9608009, 9647402, 9579906, 9561690, 9760048, 9888811, 9821804, 9754436, 9821854, 9946376, 9994588, 9865022, 9650108, 9563970, 9455814, 9301317, 9245724, 9279839, 9453393, 9605605, 9586861, 9443327, 9145409, 9038792, 9054137]
830.4I054137l94734m11287j53929Q6190K29708L730m4462k5561p426J26868P3505
841H536739K0232J35056J59853R6960K32056K63116Q9518L0594K0242N276m040N2254
852.5I637856R3630p3589j61173J79763L54937q3018k44332l0267J47655J62666j74938
863.1I809190k58643J604J68345J83819N483k1632J14066R5267P9587p5914l06706
873.8I794466j98720Q9268O7066j45492r820J71420K05074J14622m7892k3098r6642
884.4I920252q5485m0585j24066M1587O3223m505J20357L5506j65778r2228O1436N9522
895.9I789236n6633j22832p124p1249j25330P5121J10460l2268j63630j31763q1661
906.5I182327k4365j7049q6497n1003j73317j04878O1210j2443K0655l7825j21030
$$ y = [9054137, 8659403, 8248116, 8094187, 8180377, 8410085, 8413815, 8369353, 8343792, 8336366, 8463234, 8536739, 8556971, 8692027, 8851880, 8948840, 9180896, 9444012, 9533530, 9564124, 9584366, 9589642, 9585602, 9637856, 9731486, 9657897, 9496724, 9676487, 10031424, 9948406, 9704074, 9673807, 9821462, 9984128, 9809190, 9550547, 9552151, 9720496, 9904315, 9909798, 9888166, 10002232, 10097499, 10177086, 10101172, 9794466, 9595746, 9685014, 9752080, 9606588, 9596768, 9768188, 9973262, 10087884, 10039992, 10016894, 9920252, 9834767, 9794182, 9670116, 9711703, 9774926, 9770421, 9890778, 9926284, 9760506, 9668278, 9729714, 9789236, 9732603, 9609771, 9602647, 9531398, 9406068, 9481189, 9591649, 9559381, 9395751, 9263988, 9182327, 9157962, 9140913, 9054416, 9003413, 8830096, 8725218, 8786428, 8773985, 8794640, 8756815, 8635785]
917.2H635785K0259Q6273j6324k5734J2896J35499K18698K5675L4501J17051r767k9789
928.7I205023N7613R0667P067K813J56006J97342N064j00255j8726R6506J70499K4158
940.3I893777o3709l5523r3764q706N3044j4393j0999J6230O7613M3777j63469j64977
951.9I518901P1301J35464L5667m0194j1299N6045J14192R7737k0108p0282p2187l7302
963.4I777935l1495o8606K0765P2583J9880j8749r1267P501J70190j0322q4933r437
975I754045q6055J2656N2093n0861k5235K2112K8120p5024j23833q345j8688o3962
986.6I417023l9171j43512m3964N1993j22039q1959r824L1926L6297n6871j18306j57325
998.2H764268m4712p9085k52209l29803j46703J86447L34254L86813J74648K5622J8856
$$ y = [8635785, 8656044, 8742317, 8725993, 8700259, 8713155, 8848654, 9067352, 9093027, 9127528, 9244579, 9234812, 9205023, 9262636, 9353303, 9360370, 9363183, 9519189, 9716531, 9721595, 9621340, 9602614, 9699120, 9869619, 9893777, 9830068, 9794545, 9700781, 9692075, 9745119, 9730726, 9719727, 9735957, 9803570, 9847347, 9683878, 9518901, 9590202, 9725666, 9761333, 9721139, 9709840, 9765885, 9880077, 9977814, 9957706, 9887424, 9815237, 9777935, 9746440, 9677834, 9698599, 9771182, 9791062, 9772313, 9681046, 9688547, 9858737, 9848415, 9763482, 9754045, 9667990, 9680646, 9732739, 9681878, 9656643, 9678755, 9706875, 9631851, 9508018, 9499673, 9480985, 9417023, 9377852, 9234340, 9190376, 9242369, 9120330, 9038371, 9028547, 9060473, 9096770, 9039899, 8921593, 8764268, 8719556, 8640471, 8388262, 8058459, 7911756, 8098203, 8432457, 8819270, 8993918, 9019540, 9038396]
1008.8I038396j26147j15499j35509k00451j54227K1247J92683L24160L60843J81255
1018.4I386751J41987O3944k9698N3792j1633o3298M1905J13694K263n7706k5555n2589
1030I563857q985J8363J3406p5018j67364p0544o822r1730j41793r4030l6172p2713
1041.6H830455j22043j5845K2744N2688J46736J82170K42176J53834K8192M1595Q6681
1052.2I649383J64290O7829j23888j72111p0470R0404O9927J1622j4569j33923r9301
1062.8I439193k2694o0061k44404m44219k62795j55488j88469P296J90480L94872M29604
1073.4I083315K51308P6975P3489J24138O3601M6854j7385M0195J23642K6542q331
1084I884343J30O4093M7958q3351j37865j69119q4245J41813P757j71087N4318J5093
$$ y = [9038396, 8912249, 8796750, 8661241, 8460790, 8306563, 8327810, 8520493, 8844653, 9205496, 9386751, 9528738, 9592682, 9562984, 9616776, 9605143, 9541845, 9583750, 9697444, 9699707, 9642001, 9616446, 9563857, 9554872, 9573235, 9586641, 9511623, 9344259, 9273715, 9266893, 9175163, 9033370, 8939340, 8903168, 8830455, 8708412, 8692567, 8715311, 8767999, 8914735, 9096905, 9339081, 9492915, 9521107, 9562702, 9649383, 9813673, 9881502, 9757614, 9585503, 9515033, 9605437, 9675364, 9686986, 9672417, 9538494, 9439193, 9416499, 9356438, 9112034, 8667815, 8405020, 8249532, 8061063, 8068359, 8258839, 8653711, 9083315, 9334623, 9411598, 9485087, 9609225, 9672826, 9719680, 9702295, 9742490, 9866132, 9892674, 9884343, 9884473, 9948566, 9996524, 9913173, 9775308, 9606189, 9521944, 9663757, 9671514, 9500427, 9554745, 9569838]
1095.6I569838j6146k3084j25851K1873j4279L4929Q3807L4816Q5210P8588J04718
1106.2I834419k6043p936L3978q9883n7997n7608n6502j205R5745N3814J2525P7630
1117.7I810937N9070L1684m9857m3858m8001j1011q015r9490M2254K3368k4149m828
1129.3I678104j05661r3805m1391m8034j26145m6107M2894O7309J58919J35601J20173
1139.9I741857J8530r1267O776Q1714O0120o791k1749P538O80l3992J2619M6337j9344
1152.5I803028k1694J3683Q3018M1378o5164j0415L0279M7645L1977j2095r00k6923
1164I913817o1036n2130l8574k1434j4314j7612L3311J8966n1886l3173l9418k9717
1175.6I606800j9389k3870O8128Q3961K3771K7439N4770P848n9059l0251j864O3617
$$ y = [9569838, 9553692, 9530608, 9404757, 9426630, 9412351, 9447280, 9531087, 9565903, 9651113, 9729701, 9834419, 9808376, 9800440, 9834418, 9744535, 9686538, 9628930, 9572428, 9571223, 9666968, 9720782, 9733307, 9810937, 9870007, 9901691, 9851834, 9807976, 9759975, 9748964, 9740949, 9641459, 9683713, 9707081, 9682932, 9678104, 9572443, 9478638, 9437247, 9389213, 9263068, 9216961, 9259855, 9327164, 9486083, 9621684, 9741857, 9760387, 9669120, 9675896, 9757610, 9817730, 9810939, 9789190, 9796728, 9797408, 9763416, 9776035, 9822372, 9803028, 9781334, 9795017, 9878035, 9919413, 9854249, 9843834, 9874113, 9921758, 9953735, 9941640, 9940740, 9913817, 9852781, 9800651, 9762077, 9740643, 9726329, 9708717, 9742028, 9760994, 9709108, 9675935, 9636517, 9606800, 9587411, 9563541, 9631669, 9715630, 9739401, 9766840, 9821610, 9829458, 9770399, 9740148, 9738284, 9801901]
1187.2I801901O3895j00175j52429j08203n9152j3588m1668k8570p960l3608p990J1430
1198.8I323883M3773R8871M1560J7742L3998M5610J08161Q2962L7710n0134m5061P9358
1210.3I818433K1803j3922L167j117J3629j7535K4869J6929j3853K7616N712j2524
1221.9I873207m5963m3189K0058J7522J765o485R703M3246L1109n194l2809n513J1107
1234.4I868564n998J6800p71k6183J2622K2279K0498N051l5501Q992J4214k8273J2653
1247I884947j6650j2652K8043j7568J178l4334m1494L1768Q134j3797l8827r584J7408
1259.5I786572k4505k4136m9638k2496P364k5032j4581k4699m8883n7012n7779m4435
1271.1I400740q504N3864J02831P8756N7593N3894J7152P8974O1856m6613k6002J5428
$$ y = [9801901, 9865796, 9765621, 9613192, 9504989, 9445837, 9432249, 9390581, 9362011, 9354051, 9320443, 9312453, 9323883, 9367656, 9466527, 9508087, 9525829, 9559827, 9605437, 9713598, 9796560, 9834270, 9784136, 9739075, 9818433, 9840236, 9826314, 9829481, 9828364, 9841993, 9824458, 9849327, 9866256, 9852403, 9880019, 9885731, 9873207, 9827244, 9784055, 9804113, 9821635, 9823400, 9816915, 9826618, 9869864, 9900973, 9895779, 9862970, 9857457, 9868564, 9862566, 9879366, 9878595, 9852412, 9865034, 9887313, 9907811, 9912862, 9877361, 9886353, 9900567, 9872294, 9884947, 9868297, 9855645, 9883688, 9866120, 9867298, 9832964, 9791470, 9823238, 9831372, 9817575, 9778748, 9769164, 9786572, 9762067, 9737931, 9688293, 9665797, 9673161, 9648129, 9633548, 9608849, 9559966, 9502954, 9445175, 9400740, 9392236, 9446100, 9548931, 9627687, 9685280, 9739174, 9756326, 9835300, 9897156, 9850543, 9824541, 9839969]
1282.7I839969K1721n146l2813l0342m204J1242m2544n2668K935L6008J7217j2995
1294.2I748380j1910K3890N3433K0302j9057j6021J6984M0682M3920j7421o1258J5548
1305.8I837472J0850l9080j6227m963l891j7047K2949L6353k7167l6800k4247p077
1317.4I731125j7843k3694N835N265J1968K7569L5106J2791j8765O008J3330p98O722
1329.9I794619j5480k8021p502j8984m2606o345N2726L5804k3353l9859k4556n3230
1341.5I623213m7352j3749m866J288l3872j9642J1736m0801m6000n9555p6431l6359
1353.1I257610j3887k7027m2529m01R153R298O653K575L4451L5675K5990M432K5651
1365.6I327644J9181L5851Q7250M3088L1796M6796L8114J5164J4204j9764n9250J748
$$ y = [9839969, 9861690, 9856544, 9823731, 9793389, 9789185, 9800427, 9757883, 9705215, 9708150, 9744158, 9761375, 9748380, 9736470, 9760360, 9813793, 9834095, 9815038, 9799017, 9816001, 9856683, 9900603, 9883182, 9821924, 9837472, 9848322, 9809242, 9793015, 9788052, 9784161, 9767114, 9790063, 9826416, 9799249, 9762449, 9738202, 9731125, 9713282, 9689588, 9695423, 9700688, 9712656, 9740225, 9775331, 9788122, 9769357, 9775365, 9788695, 9787897, 9794619, 9779139, 9751118, 9743616, 9724632, 9682026, 9675681, 9728407, 9764211, 9740858, 9700999, 9676443, 9623213, 9575861, 9562112, 9557246, 9558534, 9524662, 9505020, 9516756, 9475955, 9429955, 9370400, 9293969, 9257610, 9243723, 9216696, 9174167, 9173766, 9182919, 9192217, 9198870, 9201445, 9235896, 9271571, 9297561, 9301993, 9327644, 9346825, 9382676, 9469926, 9513014, 9544810, 9591606, 9629720, 9644884, 9659088, 9639324, 9580074, 9581822]
1377.2I581822J2984P047M680J930M6302M5227L2531J4791j4191k1025k6566J9419
1388.7I704951N1503K6983m8390l655J03258J0746j12579J6683K5776j6704k5037M747
1400.3I738282j1001m2261k0638k0354q1507r4629o4163l3201n2611j53658j76236
1410.9H988023j69965j95112k27666k02030q5350J0553J83251K00366L90441K92520
1420.6I185031J15212Q1406R100l899K9344J4678o707Q992K0134p1016p9380m3739
1432.1I259156r4076j08859o6569m1466j89118j13625j7787n5170k2383l3430n2833
1442.7H463840m3985p9577q1508p9325k9234m9825n3619m489p928M104j9349N8632
1454.3H077737R7469K0061o1180j0583J51269Q5208P5490M6929K5535M6418L2345P0197
$$ y = [9581822, 9594806, 9601853, 9606533, 9608463, 9654765, 9699992, 9732523, 9747314, 9733123, 9712098, 9685532, 9704951, 9756454, 9783437, 9735047, 9731392, 9834650, 9845396, 9732817, 9749500, 9775276, 9758572, 9733535, 9738282, 9727281, 9685020, 9664382, 9644028, 9562521, 9467892, 9403729, 9370528, 9317917, 9164259, 8988023, 8818058, 8622946, 8395280, 8193250, 8107900, 8118453, 8301704, 8502070, 8892511, 9185031, 9300243, 9381649, 9390749, 9386850, 9416194, 9430872, 9424165, 9433157, 9453291, 9382275, 9302895, 9259156, 9165080, 9056221, 8989652, 8948186, 8759068, 8645443, 8627656, 8572486, 8550103, 8516673, 8463840, 8419855, 8340278, 8258770, 8179445, 8150211, 8100386, 8046767, 8042278, 8034350, 8038454, 8019105, 8077737, 8175206, 8195267, 8134087, 8123504, 8274773, 8359981, 8435471, 8482400, 8507935, 8554353, 8586698, 8656895]
1465.9H656895N0145P8459O0262R5840J17849M4361N6171J01934J40888Q1849M0021
1476.5I524674M8822P8874P4118L1096M8132j83r883L2777M5753K6136k7645J2653
1488.1I885324L8407l3358l9555O2881J5528l6088L9533P0287K6033P148l6421k0156
1499.6I979563M576l7710p15K3533J6187N2802j62384j40178J14903K6407M1780K016
1511.2I920780l1695R865M8774L5548J9599j3172j01012P8851J03129m3226j50289
1521.8I877152k7774M4464n41m9375K3204N1504N872R198M2299K5466J7730m2108j9063
1534.3I958028K6042k0348r012J3890J10499j43045K1877J37623l4270k0461p8471
1545I962352n784M8136k1241j7254q652M8659K2495k1807l7236q4487K1869J6538n4853
$$ y = [8656895, 8707040, 8785499, 8845761, 8941601, 9059450, 9103811, 9159982, 9261916, 9402804, 9484653, 9524674, 9573496, 9652370, 9726488, 9757584, 9805716, 9805533, 9795650, 9828427, 9874180, 9900316, 9872671, 9885324, 9923731, 9890373, 9850818, 9913699, 9929227, 9893139, 9932672, 10002959, 10028992, 10036140, 9999719, 9979563, 9984139, 9946429, 9945714, 9969247, 9985434, 10038236, 9875852, 9735674, 9850577, 9876984, 9918764, 9920780, 9889085, 9898950, 9947724, 9983272, 10002871, 9989699, 9888687, 9967538, 10070667, 10027441, 9877152, 9849378, 9893842, 9893301, 9843926, 9867130, 9918634, 9924506, 9933704, 9976003, 10001469, 10019199, 9977091, 9958028, 9984070, 9963722, 9954710, 9968600, 10079099, 9936054, 9957931, 10095554, 10061284, 10040823, 9962352, 9956568, 10004704, 9983463, 9966209, 9957557, 10006216, 10028711, 10006904, 9969668, 9885181, 9907050, 9923588, 9868735]
1557.5I868735N5738L1277q2851Q6017N3268J6041l4560m8474Q750m967j918j5847
1569.1I931209o0723M7399n78o1126k7713N3290Q5771p1686k3116L3244K4286j969
1580.6I928288j5249j0616q421j6316k0234k0857j4031O386k4131n0472m4013m9653
1592.2I660681j8260j0514j1560m4279m7795k0699n4800o6220j07960j01153j12628
1602.8I064813j51697r2412m6539N2341J22903J64291J58125J22591J31770J29573
1612.5I655759O9967M9108K8930J0139l2567J2931N5669K1435j2645K6146K9718j9005
1624I895585L4582K5303o382m4585m1725L1398n62j2714j0288j9730L2811j27043j38169
1636.6I618481p4767r5801r1280j24717m2202L5987N0273J06320R6294J08099J78424
$$ y = [9868735, 9924473, 9955750, 9872899, 9958916, 10012184, 10028225, 9993665, 9945191, 9953941, 9948974, 9947056, 9931209, 9870486, 9917885, 9917307, 9856181, 9828468, 9881758, 9967529, 9895843, 9872727, 9905971, 9930257, 9928288, 9913039, 9902423, 9894002, 9877686, 9857452, 9836595, 9822564, 9828950, 9804819, 9754347, 9710334, 9660681, 9642421, 9631907, 9620347, 9576068, 9528273, 9507574, 9452774, 9386554, 9278594, 9177441, 9064813, 8913116, 8820704, 8774165, 8826506, 8949409, 9113700, 9271825, 9394416, 9526186, 9655759, 9725726, 9774834, 9803764, 9813903, 9781336, 9794267, 9849936, 9871371, 9858726, 9884872, 9914590, 9895585, 9930167, 9955470, 9949088, 9904503, 9862778, 9894176, 9893614, 9880900, 9870612, 9850882, 9883693, 9756650, 9618481, 9543714, 9447913, 9356633, 9231916, 9189714, 9225701, 9275974, 9382294, 9478588, 9586687, 9765111]
1647.2I765111O5014K4010L0708K038K523K5048j0149q0802M857Q2642L5951j9204
1658.8I927747m4609j4700N4135m3442o6505N5778N6360K3810M165r470j00436K3114
1670.3I865947M4294k5694L0218N4670o027l1662K4979l03J2147K5714k557R723j2726
1682.9I988723q5998l3419O9330L0637k0707R09O3527r282k7470K2490J8513L5206
1694.4A0052459M5850j68497k6140P6691O4576r285j63980O3849P8659J0304j4601
1705A0009885j1066k0511M4570J4733J268j2317l0862j0937N58n179Q611L8654p3233
1717.6I954174j26659O8230N5138M2408j2091k3294k0261q969R747j2271j3538j3531
1729.1I899083R497M5114L6533O746n8607L3927o551j2047J9280K6699l5982l3402
$$ y = [9765111, 9830125, 9854135, 9884843, 9886881, 9889404, 9914452, 9904303, 9823501, 9828358, 9911000, 9946951, 9927747, 9883138, 9868438, 9922573, 9879131, 9812626, 9868404, 9924764, 9948574, 9952739, 9943269, 9842833, 9865947, 9910241, 9884547, 9914765, 9969435, 9963408, 9931746, 9956725, 9956422, 9968569, 9994283, 9991726, 10001449, 9988723, 9902725, 9869306, 9938636, 9969273, 9948566, 9949475, 10013002, 10003720, 9976250, 9998740, 10017253, 10052459, 10098309, 9929812, 9903672, 9980363, 10044939, 10035654, 9871674, 9935523, 10014182, 10024486, 10009885, 9998819, 9978308, 10022878, 10037611, 10038879, 10026562, 9995700, 9984763, 9985321, 9980142, 9988753, 10027407, 9954174, 9827515, 9895745, 9950883, 9993291, 9981200, 9957906, 9937645, 9928676, 9938423, 9926152, 9912614, 9899083, 9908580, 9953694, 9990227, 9996973, 9938366, 9972293, 9965742, 9953695, 9972975, 9999674, 9963692, 9930290]
1740.7I930290M4099K4180m869P132L5717L467k0730j193m1913j4027p0201K6339J06463
1753.3A0024754J8944r98J7804k0724j8680k3149j6188K1494j1424j7614M6330J1439
1764.8A0031988j6889M1964L4870o4691k3520J5394N645k8486l6856J9718j9685j0859
1776.4I948593N3966O555l258K146l4640j4p119k4508Q033M0197J7441j4960q500J021
1789.9I984953P621Q125n3517K408L4555R688k080k9830l039M0641J9894J1702k0220
1802.4A0010901k5275J4771Q374j7695j2471q495N849L1599k985o145o497k2594O297
1815I975634O759K388J897J4146O531k5341K427K5982J0537k7865l5035K3345J6942
1827.5I998347M567m4876o3238L9821J8110q649J3722P858L597m01k3534j0511J4997
$$ y = [9930290, 9974389, 9998569, 9993700, 10000832, 10036549, 10040016, 10019286, 10018093, 9976180, 9962153, 9891952, 9918291, 10024754, 10043698, 10042700, 10060504, 10039780, 10021100, 9997951, 9981763, 10003257, 9991833, 9974219, 10020549, 10031988, 10015099, 10057063, 10091933, 10027242, 10003722, 10019116, 10024761, 9996275, 9959419, 9979137, 9959452, 9948593, 10002559, 10009114, 10005856, 10008002, 9973362, 9973348, 9966229, 9941721, 9949754, 9989951, 10007392, 9992432, 9983932, 9984953, 9992574, 10000699, 9947182, 9949590, 9984145, 9993833, 9991753, 9961923, 9958884, 9999525, 10019419, 10031121, 10010901, 9985626, 10000397, 10008771, 9991076, 9978605, 9970110, 9975959, 10007558, 10004573, 9998428, 9991931, 9969337, 9975634, 9982393, 9984781, 9986678, 10000824, 10007355, 9982014, 9984441, 10010423, 10020960, 9993095, 9958060, 9981405, 9998347, 10002914, 9958038, 9894800, 9934621, 9952731, 9944082, 9957804, 9965662, 9969259, 9968858, 9945324, 9934813, 9949810]
1840.1I949810K4655L404p83n824m5318J9575L6052P243j8864l277P890r634N445K8547
1853.6I998921J2892j5968j7388J5449K8658m306j9151j2844p092K1279J4082j371
1865.1A0013161r46M684L2904k7576o0818Q383J4957J6981J5468j9407n755L6487N348
1877.7A0033871r284o107k789J5025L136J8951L070l0437k1807l974J643m1213o734
1890.2I953351M9859M1021n664n2608j4111J1804K517n580j4126n296k395j555l711
1902.7I953506p421j1523J0587M515k7662j2998j4070j5805P548l381n190L0318K0236
1915.3I928660M149k471n3623J2994L6719j1471j646J8278K4480L527J4185L6494p367
1927.8A0002908k5889k336m87l487L291j946Q783K9180O006n839J1590R265P402q508
$$ y = [9949810, 9974465, 9977869, 9977086, 9971262, 9925944, 9945519, 9981571, 9988814, 9969950, 9966673, 9974563, 9964929, 9970374, 9998921, 10011813, 9995845, 9978457, 9993906, 10022564, 10018258, 9999107, 9986263, 9979171, 10000450, 10014532, 10013161, 10012215, 10016899, 10049803, 10022227, 9961409, 9969792, 9984749, 10001730, 10017198, 9997791, 9992036, 10028523, 10033871, 10024587, 10018480, 10015691, 10030716, 10033852, 10052803, 10055873, 10025436, 10003629, 9999655, 10001298, 9960085, 9953351, 10003210, 10044231, 10038567, 9985959, 9971848, 9983652, 9986169, 9980589, 9966463, 9961167, 9958772, 9957217, 9953506, 9946085, 9934562, 9945149, 9949664, 9922002, 9909004, 9894934, 9879129, 9886677, 9883296, 9878106, 9908424, 9928660, 9932809, 9930338, 9876715, 9889709, 9926428, 9914957, 9913311, 9931589, 9956069, 9959596, 9973781, 10010275, 10002908, 9977019, 9974683, 9974196, 9970709, 9974000, 9972054, 9980837, 10010017, 10016023, 10010184, 10021774, 10031039, 10038441, 10029933]
1941.3A0029933o1861l4399L5185J7619R627J8544R370Q48l493N594k679j8214J2185
1953.8A0018259Q922k8061m220J4024O372N678k027J0162J7050n360n055o234l7993
1966.4I991517k6380J7345K0712J5763J2547J778q53O222r252j9640p504O800Q449
1978.9A0017504j5476p517J9686K2702q56j8156r87K879J2209j12j6513L437j1319
1991.5A0007481j4674J4666K2734k226o298L0104N096l3883k4365M440J9671j445o485
2004A0014816K1546K8566K81k9258k8969R127J4243k6990j9217Q873M892J4431K1985
2016.5A0034326O437k951j0049P709J1298j6629j6684q614J3927J6662j7871l1257
2028.1I986304L42L8343J8462o083j9204j5839k943l38K4544P532k0527j0829K1940
$$ y = [10029933, 9968072, 9933673, 9968858, 9986477, 9996104, 10014648, 10024018, 10024866, 10021373, 10026967, 10024288, 10006074, 10018259, 10027181, 9999120, 9994900, 10008924, 10015296, 10020974, 10018947, 10029109, 10046159, 10040799, 10035744, 10029510, 9991517, 9965137, 9982482, 10003194, 10018957, 10031504, 10033282, 10032429, 10038651, 10029399, 10009759, 10002255, 10009055, 10017504, 10002028, 9994511, 10014197, 10036899, 10036043, 10017887, 10016900, 10019779, 10031988, 10031876, 10015363, 10018800, 10007481, 9992807, 10007473, 10030207, 10027981, 10021683, 10051787, 10056883, 10023000, 9998635, 10003075, 10022746, 10021301, 10014816, 10036362, 10064928, 10065209, 10035951, 10006982, 10016109, 10030352, 10003362, 9984145, 9993018, 9997910, 10012341, 10034326, 10040763, 10037812, 10027763, 10035472, 10046770, 10030141, 10013457, 10004843, 10018770, 10035432, 10017561, 9986304, 9986646, 10024989, 10043451, 10037368, 10018164, 10002325, 9999382, 9999044, 10023588, 10031120, 10010593, 9999764, 10021704]
2040.6A0021704L1136o082o753n064l542q762k8648j5491J3996K2077K607J4646Q878
2053.2A0040702j0826K728J214n672j7189q450J0867J4765q75o66J2564k0263k4951
2065.7I993948n310J9329K7062j2757j0607L671p286p403J3715J3134L139m348j8455
2078.2A0007832J8652J0407k2366j631n027q062m830Q590K3879M818l089o720k4329
2090.8I998124j3537J5640J9134J0130P414j5650k2691J3655L775j4612P385J3474
2102.4A0022241J1344j6969j4835J6523P097r366j4866Q770J0238K762R267p974q949
2114.9A0015283n095P399J0247r691r168N596J1012l701r517L493J4786O398p114j8411
2128.4A0011517m973J5942q462m837R330l32j3729j8467J2413Q442n745P386M812j9907
$$ y = [10021704, 10052840, 10046758, 10040005, 10034941, 10031399, 10022637, 9993989, 9978498, 9992494, 10014571, 10017178, 10031824, 10040702, 10029876, 10032604, 10033818, 10028146, 10010957, 10002507, 10013374, 10028139, 10027264, 10026598, 10039162, 10018899, 9993948, 9988638, 10007967, 10035029, 10022272, 10011665, 10015336, 10008050, 10000647, 10014362, 10027496, 10030635, 10026287, 10007832, 10026484, 10036891, 10014525, 10012894, 10007867, 9999805, 9994975, 10003565, 10027444, 10032262, 10029173, 10022453, 9998124, 9984587, 10000227, 10019361, 10029491, 10036905, 10021255, 9998564, 10012219, 10015994, 10001382, 10008767, 10022241, 10033585, 10016616, 10001781, 10018304, 10025401, 10016035, 10001169, 10009939, 10020177, 10022939, 10032206, 10024232, 10015283, 10010188, 10017587, 10027834, 10018143, 10008975, 10014571, 10025583, 10021882, 10012365, 10015858, 10030644, 10037042, 10029928, 10011517, 10006544, 10022486, 10014024, 10009187, 10018517, 10018185, 10004456, 9985989, 9998402, 10006844, 10001099, 10008485, 10013297, 9993390]
2141.9I993390j6882J6063N763K759k240j7075J0708J9172N752O737J886j9043o630
2154.4A0000360J5840K805o130r39J1173M653j5766j8677p626P193K2264R805j7271
2167A0007684q376O815J1113j6687l3913k460J4725J9354O087L084K778n299J424r037
2180.5I997292R90J2536J3654M068j3773n126m568k232l405k987P551J2167j242j2503
2194A0002422M981j3843r995J7920P86o129l423O134J375j0953o732j579P223Q893
2207.5I997080Q715K64J983K550m977l22k0663j9989M149P220K0465J1457j7453m336
2221I986143K1722J0299j2011j124M430j7021p235O898r858q740O880J605j7008k1261
2234.5I943719M789K9463M358l1703k2077J5792L1073Q257j464L262N705J9462Q851
$$ y = [9993390, 9976508, 9992571, 9998334, 10001093, 9998853, 9981778, 9992486, 10011658, 10017410, 10024147, 10026033, 10006990, 10000360, 10016200, 10019005, 10012875, 10011936, 10023109, 10027762, 10011996, 9993319, 9985693, 9992886, 10015150, 10024955, 10007684, 9999308, 10006123, 10017236, 10000549, 9966636, 9964176, 9978901, 9998255, 10004342, 10007426, 10010204, 10004905, 10006329, 9997292, 9998282, 10010818, 10024472, 10028540, 10014767, 10009641, 10005073, 10002841, 9999436, 9996449, 10004000, 10016167, 10014925, 10002422, 10007403, 9993560, 9983565, 10001485, 10002271, 9996142, 9992719, 9998853, 10000228, 9989275, 9982543, 9980964, 9988187, 9997080, 10005795, 10006059, 10008042, 10010592, 10005615, 10005293, 9984630, 9964641, 9968790, 9976010, 9996475, 10007932, 9990479, 9986143, 10007865, 10018164, 10006153, 10005029, 10009459, 9992438, 9985203, 9992101, 9982243, 9973503, 9980383, 9981988, 9964980, 9943719, 9948508, 9977971, 9982329, 9950626, 9928549, 9944341, 9975414, 9983671, 9982207, 9985469, 9991174, 10010636, 10019487]
2247A0019487k1681k4272j0986O188K5690P846j8691p739K0645J0476k4779l631L864
2259.5I982417q472Q450N152O121J0323Q101p351k1031k0976j8572K1663K7222j5283
2272.1I977764k0736M830Q856p775n126J1405R742n566J3023j406k0317K725r054N920
2285.6I964285K141j0407Q887q31M82j0464M508J4048r459L554M066J486Q054P186
2299.1I987536j6418k4617O307J8234J4133q725k1657j525J1229k451O46J6674M656
2311.6I984022k436J7793L7612p698l4419j2368n729L904j4792j137J766R252L2726
2324.2A0008496r565k4388n1845J5367R4985q65m5406J1084M0141K1888p528o0001
2335.7I992363n0130J4208r635k6399K707J4346J3953L9580j7854m2722J7951m546
$$ y = [10019487, 9997806, 9973534, 9962548, 9968736, 9994426, 10002272, 9983581, 9975842, 9996487, 10006963, 9982184, 9978553, 9982417, 9973945, 9982395, 9987547, 9993668, 10003991, 10012092, 10004741, 9983710, 9962734, 9944162, 9965825, 9993047, 9977764, 9957028, 9961858, 9970714, 9962939, 9957813, 9969218, 9978960, 9973394, 9986417, 9985011, 9964694, 9967419, 9958365, 9964285, 9966426, 9956019, 9964906, 9964075, 9964557, 9954093, 9958601, 9972649, 9963190, 9966744, 9970810, 9972296, 9980350, 9987536, 9971118, 9946501, 9952808, 9971042, 9985175, 9976450, 9954793, 9953268, 9964497, 9962046, 9962692, 9979366, 9984022, 9981586, 9999379, 10036991, 10029293, 9994874, 9982506, 9976777, 9980681, 9965889, 9964752, 9966518, 9975770, 10008496, 9998931, 9974543, 9922698, 9938065, 10033050, 10032185, 9986779, 9997863, 10038004, 10059892, 10052364, 9992363, 9942233, 9956441, 9946806, 9920407, 9923114, 9937460, 9951413, 9990993, 9973139, 9930417, 9948368, 9943822]
2347.3I943822L39J4212j1997j8948L2029L2016L0462Q5656J029k2816l5057p5450
2358.9I975297n1679o9888l1321l1192Q6084J36782p323l2705m1819j08M9474K6999
2370.4A0008601k5617o8934k4714K0112R367o877O017M3979M6632k229m2326m2568
2382I921443m670J9327J9927R763k8247l727L6760J7797O709k0438k4266J1667P154
2394.6I969199r481O076J0701o210p571J0146K8207j559j7604q759j4335M899p474
2407.1I956235l72J5526m513J3992J9132J0762j3129k1959J3562O943j7451j8872O483
2419.6I966339J1400j2661L120K1579P914m605p109j1461k026J48j0706J264L110K848
2433.1I969154J5261K1940K4931l691k8893j6939k0979k0540N913J3955J9914J1235
$$ y = [9943822, 9944161, 9958373, 9946376, 9927428, 9959457, 9991473, 10021935, 10107591, 10108620, 10085804, 10050747, 9975297, 9923618, 9853730, 9822409, 9791217, 9877301, 10014083, 10006760, 9974055, 9932236, 9932128, 9981602, 10008601, 9982984, 9914050, 9889336, 9909448, 9918815, 9911938, 9917955, 9961934, 10008566, 10006337, 9964011, 9921443, 9916773, 9936100, 9956027, 9965790, 9937543, 9933816, 9970576, 9988373, 9995082, 9974644, 9950378, 9962045, 9969199, 9959718, 9965794, 9976495, 9970285, 9962714, 9972860, 10001067, 9999508, 9981904, 9973145, 9958810, 9963709, 9956235, 9955863, 9971389, 9966876, 9980868, 10000000, 10010762, 9997633, 9975674, 9989236, 9996179, 9978728, 9959856, 9966339, 9977739, 9965078, 9968198, 9989777, 9997691, 9993086, 9985977, 9974516, 9972490, 9972638, 9961932, 9963196, 9966306, 9969154, 9984415, 10006355, 10031286, 10027595, 9998702, 9981763, 9960784, 9940244, 9946157, 9960112, 9980026, 9991261]
2444.7I991261j0596J3426K6734k991j6094L073J5411r956l4125l8115j1532L4422
2456.3I960918L2785J0461k103j2455l206J1627P208j5016j2574O32L747q7j3303J2307
2469.8I980941K2550o651j5551j6833r720L523J8281J680j5203J1556K2196K8908N443
2482.3A0031120l3159j4894J532L839j0775k9305M805L4019J7681m244r101m369j4919
2494.8I972230j7602K191K632l384J0741J6857j186k219J5381Q278J142j487j2655
2507.4I990919j0818j131o324j6290M544K1874J1090J102m061L452R201j730j6167
2519.9I985661k5827j0759J0573q09m137M205Q778K6086N875j7484j2770k3072k3330
2532.5I922990l058L3363L8834j0865k7289Q369J6139m443j7369k4927j727P184r42
$$ y = [9991261, 9980665, 9994091, 10020825, 10017834, 10001740, 10004813, 10020224, 10010268, 9976143, 9938028, 9926496, 9960918, 9993703, 10004164, 10002061, 9989606, 9986400, 9998027, 10005235, 9990219, 9977645, 9978277, 9982024, 9981937, 9968634, 9980941, 10003491, 9996840, 9981289, 9964456, 9954736, 9958259, 9976540, 9978220, 9963017, 9974573, 9996769, 10025677, 10031120, 9997961, 9983067, 9984599, 9988438, 9977663, 9948358, 9953163, 9987182, 10004863, 10000619, 9991518, 9987149, 9972230, 9954628, 9956819, 9959451, 9956067, 9966808, 9983665, 9982479, 9980260, 9995641, 10003919, 10005061, 10003574, 9990919, 9980101, 9978970, 9972646, 9956356, 9960900, 9982774, 9993864, 9994966, 9990905, 9994357, 10003558, 10001828, 9985661, 9959834, 9949075, 9959648, 9958839, 9954702, 9958907, 9967685, 9993771, 9999646, 9982162, 9969392, 9946320, 9922990, 9919932, 9953295, 9992129, 9981264, 9953975, 9962344, 9978483, 9974040, 9956671, 9931744, 9930017, 9937201, 9936259]
2545I936259J4326N99j8518m816J1178N696K583K585k951j01q101K33J3707R732o203
2559.5I956208p713P808r424J873O746q12K2373M624j0502j6643K003K4821l304j2876
2573I965182k1691j3826K5157K7096M25j5307j8200J378K4590J988j2576o139P018
2585.5I965095O810k3186l261J2485N038Q481j3774j6884L227K1969K1345j458j6800
2598I969087k482K0332M40j8007j4735M96K0228L035j0998J278J6938J6845r883k7689
2611.5I964885j4621k913k969Q255K84l228J9183J9197O314j2793j5880q470K529N547
2625I965320j8006O189J3456p103L634n374L201J0971J5027J5117j8003l0386j8215
2637.6I935828J0382J0595k485Q577J4658o86k5408n667J6397J3503j5444j9639J7300
$$ y = [9936259, 9950585, 9951184, 9932666, 9927850, 9939028, 9944724, 9947307, 9949892, 9946941, 9946840, 9938739, 9938972, 9952679, 9962411, 9956208, 9948495, 9956303, 9946879, 9948752, 9955498, 9954686, 9977059, 9981683, 9971181, 9954538, 9956541, 9981362, 9978058, 9965182, 9943491, 9929665, 9954822, 9981918, 9982343, 9967036, 9948836, 9950214, 9974804, 9976792, 9964216, 9958077, 9965095, 9971905, 9948719, 9945458, 9957943, 9962981, 9971462, 9957688, 9940804, 9944031, 9966000, 9987345, 9985887, 9969087, 9966605, 9986937, 9987377, 9969370, 9954635, 9955131, 9975359, 9978394, 9967396, 9968674, 9985612, 10002457, 9992574, 9964885, 9950264, 9947351, 9944382, 9952637, 9952921, 9949693, 9968876, 9988073, 9994387, 9981594, 9965714, 9957244, 9959773, 9965320, 9947314, 9953503, 9966959, 9959856, 9963490, 9958116, 9961317, 9972288, 9987315, 10002432, 9984429, 9954043, 9935828, 9946210, 9956805, 9954320, 9962897, 9977555, 9976869, 9951461, 9945794, 9962191, 9975694, 9960250, 9940611, 9957911]
2650.1I957911r821j2098K4952K8621K303k6644O05R656r485k5103j0338L0539K7157
2662.6I988255N242k5997k4481M624K4333K7258r765l2252l3088Q265M1239L196k3679
2675.2I953150j7291K2630L9864K941j7645j5142K533P110j9774j9790R243J6565P888
2687.7I972282L172q44p157m118N616J0239o496l0309j3656n19K946J7155J9979J3051
2701.2I981341j9625j3563J0436K716R294j3780k7593P019J4697j880L772J5633N717
2713.8I974184j1391j1219K728Q51P486K465l0821j7108J3980J4562J0650J7625P742
2726.3I981734j4372j4105j4948k0054j6711n272Q628J7064J4444J0848J2256J247
2737.9I960759o509j1660k13J3731o188j2853L99K587k325P69O391J5607Q593o748
$$ y = [9957911, 9948090, 9935992, 9960944, 9989565, 9991868, 9965224, 9965829, 9975485, 9966000, 9940897, 9930559, 9961098, 9988255, 9993497, 9967500, 9943019, 9947643, 9971976, 9999234, 9989469, 9957217, 9924129, 9932394, 9973633, 9976829, 9953150, 9935859, 9958489, 9998353, 10001294, 9983649, 9968507, 9971040, 9978150, 9958376, 9938586, 9947829, 9964394, 9972282, 9975454, 9974610, 9967453, 9963335, 9968951, 9979190, 9972694, 9942385, 9928729, 9928210, 9931156, 9948311, 9968290, 9981341, 9961716, 9948153, 9958589, 9961305, 9970599, 9956819, 9929226, 9936245, 9950942, 9949062, 9952834, 9968467, 9974184, 9962793, 9951574, 9954302, 9955153, 9962639, 9965104, 9934283, 9917175, 9931155, 9945717, 9956367, 9973992, 9981734, 9967362, 9953257, 9938309, 9918255, 9901544, 9896272, 9904900, 9921964, 9936408, 9947256, 9959512, 9960759, 9954250, 9942590, 9942377, 9956108, 9949920, 9937067, 9937466, 9940053, 9937728, 9938497, 9944888, 9960495, 9969088, 9962340]
2751.4I962340l009j4041m749l41p246J0949l186o704N600L888l379j2373M542J5384
2764.9I947675M4j9356r825K0904K2731j6471k2986J4586J2568m647q404O608O499
2777.4I949926k5790j7099J0808J0840n852N962P560j0256k578j323J6329Q308p586
2789.9I939249P844j457r936j8971k692K1284J0681n588k0055j2321m416O527K5689
2802.5I935838Q599j4530k77M229j6009j4471j4035j0442L600m6l6k817K564K8735
2816I910902J0038k4973p166O058J077n050j1752p399k0768j9510M749N269o895l797
2829.5I830783o80n357j5814l3852r049j069k4791j7590j6674q25R614k101k7782m3194
2843I641619j7835p915K941r406k6720j2527r555J113M5J202M261M847L933J38J3658
$$ y = [9962340, 9959331, 9945290, 9940541, 9940200, 9932954, 9943903, 9940717, 9934013, 9939613, 9943501, 9940122, 9927749, 9932291, 9947675, 9947719, 9928363, 9918538, 9939442, 9962173, 9945702, 9922716, 9937302, 9949870, 9945223, 9936819, 9943427, 9949926, 9924136, 9907037, 9917845, 9928685, 9922833, 9928795, 9936355, 9926099, 9923521, 9922198, 9938527, 9946835, 9939249, 9947093, 9945636, 9935700, 9916729, 9914037, 9935321, 9946002, 9940414, 9920359, 9908038, 9903622, 9910149, 9935838, 9944437, 9929907, 9929630, 9933859, 9917850, 9903379, 9889344, 9878902, 9882502, 9882456, 9882420, 9879603, 9882167, 9910902, 9920940, 9895967, 9888801, 9894859, 9895936, 9890886, 9879134, 9871735, 9850967, 9831457, 9836206, 9841475, 9834580, 9830783, 9830103, 9824746, 9808932, 9775080, 9766031, 9764962, 9740171, 9722581, 9705907, 9705082, 9714696, 9712595, 9684813, 9641619, 9623784, 9615869, 9618810, 9609404, 9582684, 9570157, 9560602, 9561715, 9561760, 9562962, 9567223, 9572070, 9576003, 9576141, 9589799]
2857.4I589799k480M25J3261J39l517n542J1652N832n543L867o045M66R074m810k231
2871.9I604347Q180M107Q390j603j7623J3353L6479J5341r782k5908j3167J6492M335
2884.4I642941j722k67k7620j5711p765p910J274j3307j144J0748O672k0018m4093
2897I522078j1781R620J48k2194k7558k725R071j8103l1732P984n39k1642r021q599
2910.5I395007M742r782j4668p104k5045k2757o440J3684j0643l3129l5708m6267l030
2923I198860J0816p017J124o667n01J4097o267j8945r707j3170m761M114J8292K5157
2936.5I205425K241J035q416L479J6690p658m047k1592k1395J5371M797j9057M522
2949.1I171395L4602J4821P762m0k7124k2369o690O323K7926M1299J0399J2525K7675
$$ y = [9589799, 9587319, 9587744, 9601005, 9601144, 9597627, 9592085, 9603737, 9609569, 9604026, 9607893, 9601848, 9602314, 9611388, 9606578, 9604347, 9612527, 9616634, 9625024, 9623421, 9605798, 9619151, 9655630, 9670971, 9661189, 9635281, 9622114, 9638606, 9642941, 9641219, 9640952, 9613332, 9597621, 9589856, 9581946, 9583220, 9569913, 9568769, 9579517, 9586189, 9566171, 9522078, 9510297, 9519917, 9520065, 9497871, 9470313, 9467588, 9476659, 9458556, 9426824, 9434808, 9434269, 9412627, 9403606, 9395007, 9399749, 9389967, 9375299, 9368195, 9343150, 9320393, 9313953, 9327637, 9316994, 9283865, 9248157, 9201890, 9198860, 9209676, 9202659, 9203783, 9197116, 9196615, 9210712, 9204445, 9185500, 9175793, 9162623, 9157862, 9161976, 9180268, 9205425, 9207666, 9208701, 9200285, 9203764, 9220454, 9212796, 9208749, 9187157, 9165762, 9181133, 9185930, 9166873, 9171395, 9205997, 9220818, 9228580, 9228540, 9201416, 9179047, 9172357, 9178680, 9206606, 9247905, 9258304, 9270829, 9298504]
2961.6I298504J4854L9855M0316L3601N786j6389K7921J5720q431k286M844R678j8160
2974.1I445813l4414k2740j537p251n509K1156J4382J9807L1694K7642K8530J3723
2985.7I531296J2821K7067J3775K822K1124J7894n791n651j0443j8086j941J8233K1504
2998.2I624624J0133m569j9637N652L4013J0924r982j2384J2887K5923J6046K6708
3009.8I720338K3163J2975j050Q443K3194K405r64N519J3635K171r283N259K6207K1649
3023.3I853661p791J3394O220o201l449j6691K2876M715j4244l149j7013l468k822
3035.9I826038J3409J0622n001j0808p69K4882n900j6848j2918L286K5415N33k0368
3048.4I831573k7587l865R66j5178k3707j5774J6907O652r059k3688m2501l1088o586
$$ y = [9298504, 9313358, 9353213, 9393529, 9427130, 9432916, 9416527, 9444448, 9460168, 9451737, 9449451, 9454295, 9463973, 9445813, 9411399, 9388659, 9387122, 9379871, 9374362, 9395518, 9409900, 9429707, 9461401, 9489043, 9517573, 9531296, 9544117, 9571184, 9584959, 9587781, 9608905, 9626799, 9621008, 9615357, 9604914, 9586828, 9584887, 9603120, 9624624, 9634757, 9630188, 9610551, 9616203, 9650216, 9661140, 9651158, 9638774, 9651661, 9677584, 9693630, 9720338, 9743501, 9756476, 9755426, 9763869, 9787063, 9789468, 9788504, 9794023, 9807658, 9809829, 9800546, 9805805, 9832012, 9853661, 9845870, 9859264, 9865484, 9859283, 9855834, 9839143, 9862019, 9866734, 9852490, 9849341, 9832328, 9828860, 9826038, 9839447, 9850069, 9845068, 9834260, 9833491, 9858373, 9852473, 9835625, 9822707, 9825993, 9851408, 9851941, 9831573, 9803986, 9800121, 9801087, 9785909, 9762202, 9746428, 9763335, 9769987, 9760928, 9737240, 9694739, 9663651, 9657065]
3060.9I657065P706q971j6280k7820l6101p443O95j234J0220q825k6575k0235l0303
3073.5I491899k7022k7398l1472p399N002J6429J9611K0650K3293J7215L1483L1071
3085I563362K2126J5405J5631M9055M5823J9941K7951J7113J2723J4172q331J0592
3096.6I805563K1373L331o844j0211K0168J2944j8345Q93L2346K4418j9213r741K3994
3109.1I880676R281p608o901O362J4980j096n906J6008K4172r267k5115K0807J3401
3121.7I929794k4585M824J6907L814j5720k7146P578K6625P055J271K254j3990q491
3134.2I910190q413o172N597q021R318J5976K474P827J0552J0187p304j9118j7326
3146.8I905767J1182K9344O869r749q834K7491K6185k1446k2664j140j9928m0178P48
$$ y = [9657065, 9664771, 9655800, 9639520, 9611700, 9575599, 9568156, 9568851, 9567617, 9577837, 9569012, 9542437, 9522202, 9491899, 9464877, 9437479, 9406007, 9398608, 9403610, 9420039, 9439650, 9460300, 9483593, 9500808, 9532291, 9563362, 9585488, 9600893, 9616524, 9665579, 9711402, 9731343, 9759294, 9776407, 9789130, 9803302, 9794971, 9805563, 9826936, 9830267, 9823423, 9813212, 9833380, 9846324, 9827979, 9828872, 9861218, 9885636, 9866423, 9856682, 9880676, 9889957, 9882349, 9875448, 9881810, 9896790, 9895694, 9889788, 9905796, 9929968, 9920701, 9895586, 9916393, 9929794, 9905209, 9910033, 9926940, 9930754, 9915034, 9887888, 9895466, 9922091, 9929146, 9930417, 9932671, 9918681, 9910190, 9901777, 9895605, 9901202, 9893181, 9902499, 9918475, 9920949, 9928776, 9939328, 9949515, 9942211, 9923093, 9905767, 9916949, 9946293, 9953162, 9943413, 9934579, 9962070, 9988255, 9966809, 9944145, 9943005, 9923077, 9882899, 9883647]
3159.3I883647K6474K7123K9319j152j7819o272K01K132J2272Q434n167j1807j9249
3171.8I928136j4678L505K8658K5665R00j9381k3065l483m025k33R448L995J3314J9960
3185.3I968716J917r872L88j205q951j3324r369L31j978J8722K1792OO210o099j8263
3199.8I949021l322m463r449r06L463N227J3415J2568J616m23j298K528P463j794r806
3214.3I963840p002N485n700j1144K0880J3542l871L315p494o971j42j5583j3214J1138
3227.8I947079J9552J7921o007j5110J2393R586m526j986r432k6247k591K8660J1152
3240.3I980444j0716j8883O426J4911k986R647m460j6701j3502j3707J5988L5822O667
3252.8I988950j9311R74J0299L296p367j5311N92J2373R615j5023q977L821j1397K3761
$$ y = [9883647, 9910121, 9937244, 9966563, 9965411, 9947592, 9941320, 9941521, 9943653, 9955925, 9964359, 9959192, 9947385, 9928136, 9913458, 9916963, 9945621, 9971286, 9972186, 9952805, 9929740, 9926257, 9922232, 9921999, 9931447, 9935442, 9948756, 9968716, 9970633, 9960761, 9961149, 9959944, 9950993, 9937669, 9928300, 9928631, 9926653, 9945375, 9967167, 9967173, 9973383, 9967284, 9949021, 9945699, 9941236, 9931787, 9930881, 9934344, 9939571, 9952986, 9965554, 9967170, 9966747, 9965449, 9967977, 9975440, 9973646, 9963840, 9956838, 9962323, 9956623, 9945479, 9966359, 9979901, 9976030, 9979345, 9971851, 9964880, 9964738, 9949155, 9935941, 9947079, 9966631, 9984552, 9978545, 9963435, 9975828, 9985414, 9980888, 9978902, 9969470, 9943223, 9940632, 9969292, 9980444, 9969728, 9950845, 9957271, 9972182, 9969196, 9978843, 9974383, 9957682, 9944180, 9930473, 9946461, 9982283, 9988950, 9969639, 9970613, 9980912, 9984208, 9976841, 9961530, 9962122, 9974495, 9984110, 9969087, 9960110, 9963931, 9952534, 9976295]
3266.3I976295K6993k4274l1761K80K6099k666k9969j1582R423K2003J5761M056m040
3278.9I976618j015P522j1355m335p357k3794J9596J7157j8850j4523P064K8850n436
3291.4I970142k6155J5233K8582j0402m2001r122K9686K5614l383j1320J8587J74j5737
3303.9I969898K298j2628j2635j1392m89J7541J4273K6894P880m467q744k0063n9K963
3317.4I971270J0794p502k9471j1796J3250K8236N756K2310M058m0995j7032n656M359
3330I947581k583J3468K9536p50j1195k4269j4317l245K0984K8722j9538j9452q823
3342.5I936119M186K9257J0428j8052J405K2759O253n698l3645k6697O136M547J2534
3355.1I949532M11j0452J7698K7564n256l0817j0828K6224K6732p716k2518j7413K795
$$ y = [9976295, 10003288, 9979014, 9947253, 9947533, 9973632, 9970966, 9940997, 9929415, 9938838, 9960841, 9976602, 9980658, 9976618, 9975603, 9983125, 9971770, 9967435, 9960078, 9936284, 9955880, 9973037, 9954187, 9939664, 9946728, 9975578, 9970142, 9943987, 9959220, 9987802, 9977400, 9935399, 9926277, 9955963, 9981577, 9978194, 9966874, 9985461, 9985635, 9969898, 9972196, 9959568, 9946933, 9935541, 9935052, 9952593, 9966866, 9993760, 10001640, 9997173, 9988429, 9968366, 9968307, 9971270, 9982064, 9974562, 9945091, 9933295, 9946545, 9974781, 9980537, 10002847, 10006905, 9965910, 9948878, 9943222, 9947581, 9944998, 9958466, 9988002, 9987252, 9976057, 9951788, 9937471, 9934226, 9955210, 9983932, 9964394, 9944942, 9936119, 9940305, 9969562, 9979990, 9961938, 9963343, 9986102, 9992355, 9986657, 9953012, 9926315, 9932451, 9936998, 9949532, 9949943, 9939491, 9957189, 9984753, 9979497, 9948680, 9937852, 9964076, 9990808, 9983092, 9960574, 9943161, 9945956]
3367.6I945956J408q676J2139P504J0736J3556r865o537P925M081k0901j5619K681
3380.1I944388n174J2471J3234j6039j954J2238n143j1065J2419K9515p74j0985m889
3392.7I968242k0712r307J889M266J958q788L616J8302n955j3894J3574M779J85P90
3406.2I958945j3426j4698p050J8149J3715M959Q260o158m901k055j5168j5583J8441
3418.7I943430K9190J1585M13j1796j5164j1000k279q006j1621k424J6072L641j6427
3431.2I925614M678j5997n285J7373O961J2277n669J5383J0758k0094j4408m87J5220
3443.8I946324p698J0344K5392j7320k3795R272J4585j7865j2259N382K6678R154k0801
3456.3I947393j743p874p872j6736j1508K805K03J0823l851J5212K1608N785j657j6364
$$ y = [9945956, 9947364, 9938688, 9950827, 9958331, 9969067, 9982623, 9972758, 9966221, 9974146, 9978227, 9957326, 9941707, 9944388, 9939214, 9951685, 9964919, 9948880, 9946926, 9959164, 9954021, 9942956, 9955375, 9984890, 9984116, 9973131, 9968242, 9947530, 9938223, 9940112, 9944378, 9946336, 9937548, 9941164, 9959466, 9953511, 9939617, 9953191, 9957970, 9958155, 9958945, 9945519, 9930821, 9923771, 9941920, 9955635, 9960594, 9968854, 9962696, 9957795, 9955740, 9940572, 9924989, 9943430, 9972620, 9984205, 9984618, 9972822, 9957658, 9946658, 9944379, 9936373, 9924752, 9922328, 9938400, 9942041, 9925614, 9930292, 9914295, 9909010, 9926383, 9933344, 9945621, 9939952, 9955335, 9966093, 9945999, 9931591, 9931104, 9946324, 9938626, 9948970, 9974362, 9957042, 9933247, 9942519, 9957104, 9939239, 9926980, 9932362, 9959040, 9968194, 9947393, 9945650, 9937776, 9929904, 9913168, 9901660, 9904465, 9904668, 9915491, 9911640, 9926852, 9948460, 9954245, 9952588, 9936224]
3469.8I936224P055k401p654J5481n320k1949p707R740J9909O167o556J0633R88k6038
3483.3I928572l2528j7514J6009K8203J6880j2068p152Q164J8412J9138j6788j7338
3494.9I931990q234m964j764n925O794P398J6194N469k5525j2845K6281K1709k3975
3507.4I932603j3711n523m910J7595n915q067J6893J6924J914n252Q015k473j8629
3520I929464N768L815k2179Q230M0015J0964k8267j8386r72r160j1216n564K5199J6630
3533.5I944341j1599J5118J2405k0650j2256l321m117J0440J9628J003j267n700l1457
3546I912568j0610K0904K7255K6529L79k8523k6693j3566M563L1885P990k3289R712
3558.5I939104K2900j0200j9816R844J4282o820Q490L942k3560l7676J651L5931r352
$$ y = [9936224, 9943279, 9940878, 9933224, 9948705, 9943385, 9921436, 9913729, 9923469, 9943378, 9949545, 9942989, 9953622, 9954610, 9928572, 9896044, 9878530, 9894539, 9922742, 9939622, 9927554, 9920402, 9928566, 9946978, 9966116, 9949328, 9931990, 9923756, 9918792, 9917028, 9911103, 9917897, 9925295, 9941489, 9946958, 9921433, 9908588, 9934869, 9956578, 9932603, 9918892, 9913369, 9908459, 9926054, 9920139, 9912072, 9928965, 9945889, 9947803, 9942551, 9950566, 9948093, 9929464, 9935232, 9939047, 9916868, 9925098, 9965113, 9976077, 9947810, 9929424, 9928452, 9919292, 9908076, 9902512, 9927711, 9944341, 9932742, 9947860, 9960265, 9939615, 9927359, 9924038, 9919921, 9930361, 9949989, 9950992, 9949725, 9944025, 9912568, 9901958, 9922862, 9950117, 9976646, 9977025, 9948502, 9921809, 9908243, 9912806, 9944691, 9952681, 9929392, 9939104, 9962004, 9951804, 9931988, 9941832, 9956114, 9949294, 9957784, 9961726, 9938166, 9900490, 9902141, 9938072, 9928720]
3571.1I928720j3702J9228J5385q100j4870J1126O915q105j2054l582R031J1537j947
3583.6I939582l480M2810l520n2101K4661j1432j8404n728K0795O929q802J5502l3602
3596.1I913210J4381K7523j4485j72l0457p218K6448J973N795L4299K665m4030k588
3608.7I927344n3979J7146J08347J4798n2950J488k0457J9699k0264m5217K7904l1146
3620.3I892713J2193L4617J1924K0944j2707k5748o727l652j02537n0635J10603N9303
3631.8I940291P253k6531R18K7890n77j1908j113j795o092J0481q39j1892N812L1543
3645.3I963441O4317m8898j15071M3187K9026l5771j8625J5280L4854M0079l3889j14599
3656.9I823331M8783O2588M990q960L799M274p945J4875J7314j5184o350m043l571
$$ y = [9928720, 9915018, 9934246, 9949631, 9941531, 9926661, 9937787, 9944702, 9936597, 9924543, 9920961, 9929992, 9941529, 9939582, 9936102, 9978912, 9975392, 9923291, 9947952, 9936520, 9918116, 9912388, 9933183, 9940112, 9931310, 9946812, 9913210, 9927591, 9955114, 9940629, 9940457, 9910000, 9902782, 9929230, 9931203, 9936998, 9971297, 9973962, 9929932, 9927344, 9873365, 9890511, 9998858, 10013656, 9960706, 9962194, 9941737, 9961436, 9941172, 9895955, 9923859, 9892713, 9904906, 9939523, 9951447, 9972391, 9959684, 9933936, 9927209, 9923557, 9821020, 9770385, 9880988, 9940291, 9947544, 9921013, 9921931, 9949821, 9949244, 9937336, 9936223, 9934428, 9928336, 9938817, 9937978, 9926086, 9931898, 9963441, 10027758, 9978860, 9863789, 9906976, 9936002, 9900231, 9881606, 9896886, 9931740, 9971819, 9937930, 9823331, 9872114, 9934702, 9939692, 9930732, 9934531, 9938805, 9930860, 9945735, 9963049, 9947865, 9941515, 9937472, 9933901]
3669.4I933901j6058m7151L3890M2665J9094n9363j77719P4151J07959K3613m3947
3680I891035r3K7983K2091J1389K6660J2533n490J5844o3176j6037n354r0487O5147
3692.6I892045N0262j2968k302j810J8049P289j2572M078j6615m2447L7942L8236n362
3705.1I953825R06J643K3487L362q6910J1800k2814o1692O5354M9733J0035q970K9965
3717.7I969724J5475m8462J608L6596j8402l8768K5572J6851l2988k8245K6015M0193
3729.2I965169L2783M4892o0054q2587O5130k2947j12553K2021M6011K4118K7749K3830
3740.8I973562j0064N1785O1458k34634n9643R0642M4210N1416j6902o129N6631j15167
3752.4I887165k3625Q0392K2551j8722o2216J588J3178l4520M1651K5008N014L6748
$$ y = [9933901, 9917843, 9870692, 9904582, 9947247, 9966341, 9906978, 9729259, 9803410, 9911369, 9934982, 9891035, 9890942, 9918925, 9941016, 9952405, 9979065, 9991598, 9986108, 10001952, 9938776, 9922739, 9917385, 9826898, 9892045, 9942307, 9929339, 9927037, 9925227, 9943276, 9950565, 9937993, 9942071, 9925456, 9883009, 9920951, 9959187, 9953825, 9954731, 9956374, 9979861, 9983223, 9896313, 9908113, 9885299, 9823607, 9888961, 9938694, 9948729, 9939759, 9969724, 9985199, 9936737, 9938345, 9974941, 9956539, 9917771, 9943343, 9960194, 9927206, 9898961, 9924976, 9965169, 9997952, 10042844, 9982790, 9900203, 9965333, 9942386, 9829833, 9851854, 9897865, 9921983, 9949732, 9973562, 9963498, 10015283, 10076741, 9842107, 9782464, 9873106, 9917316, 9968732, 9951830, 9945701, 10002332, 9887165, 9863540, 9943932, 9966483, 9947761, 9885545, 9887133, 9900311, 9865791, 9907442, 9932450, 9937464, 9974212]
3763.9I974212J3159q3917l7201O9394N5028k9177j02211K6155N4824J4547R346j4294
3775.5I949865M935K660j3141q033l1724K9664P202R079M2240l9157l3506K3597L9724
3788I983405p278n6500k2068J4655L5116J1162Q672M642o6704p199M9917L6165Q718
3800.6I992703n3368m6108n638J7892L5281P544q7293j0021M7928L7610L3305P797
3812.2I977632k8548k70L6565o4442p7023N4805M1712N0342k5617j35829M5224N1592
3823.7I926143K9428M747q119k1222p922K4293L8998J2130p1042L647L7655k6513R935
3836.3I952158J9184o1205j2131J8826j5598J5080L3581l3022k3322N0267K9976j1253
3847.8I962541j1301k419K8781L3643k7331p3832j81556J16284J17457j3148m3160
$$ y = [9974212, 9987371, 9903454, 9866253, 9935647, 9990675, 9961498, 9859287, 9885442, 9940266, 9954813, 9964159, 9949865, 9954800, 9957460, 9944319, 9936286, 9904562, 9934226, 9941428, 9950507, 9992747, 9953590, 9920084, 9943681, 9983405, 9976127, 9919627, 9897559, 9912214, 9947330, 9958492, 9967164, 9971806, 9905102, 9897903, 9947820, 9983985, 9992703, 9939335, 9893227, 9887589, 9905481, 9940762, 9948306, 9861013, 9850992, 9898920, 9936530, 9969835, 9977632, 9949084, 9948814, 9985379, 9920937, 9843914, 9898719, 9940431, 9990773, 9965156, 9829327, 9874551, 9926143, 9955571, 9960318, 9952199, 9930977, 9923055, 9947348, 9986346, 9998476, 9927434, 9931081, 9968736, 9942223, 9952158, 9971342, 9910137, 9898006, 9916832, 9901234, 9916314, 9949895, 9916873, 9893551, 9943818, 9973794, 9962541, 9951240, 9948821, 9977602, 10011245, 9983914, 9910082, 9728526, 9844810, 9962267, 9949119, 9905959]
3858.4I905959J8180M9875K4457m5547J1127M4396k2850n6721j2612K4007L1171l6012
3870I935430k7051K8588K7091j6375o9348J7194L5914R599J1487J5157o3050m1325
3881.6I863311M1461K0049L3699j9286j25851O2369O8825K1064q252l8478N97J3076
3893.2I932584L92p993J5442J1469M261j7667m9751N5398J6436k4599l012p7277q567
3905.7I847116K4820L6455K2907j4218n80J1189J1361L448j61j1676N856K698k5252
3918.2I913963J8582j6811k2070L0926K7008Q989m3028j4104J8974M009J8113q723
3929.8I935828j6766m481k3221K0354K2483j5808k553J1426K582K55P324K5994J7698
3942.3I981115l5445k3221L817R404P697l6328k8167l21O933L2180J7671l350J5051
$$ y = [9905959, 9924139, 9974014, 9998471, 9952924, 9964051, 10008447, 9985597, 9928876, 9916264, 9940271, 9971442, 9935430, 9908379, 9936967, 9964058, 9947683, 9878335, 9895529, 9931443, 9941042, 9952529, 9967686, 9904636, 9863311, 9904772, 9924821, 9958520, 9939234, 9813383, 9875752, 9944577, 9965641, 9957389, 9918911, 9919508, 9932584, 9932976, 9924983, 9940425, 9951894, 9956155, 9938488, 9888737, 9944135, 9960571, 9935972, 9932960, 9855683, 9847116, 9871936, 9908391, 9931298, 9917080, 9916500, 9927689, 9939050, 9942498, 9942337, 9930661, 9936517, 9939215, 9913963, 9932545, 9915734, 9893664, 9924590, 9951598, 9960587, 9917559, 9903455, 9922429, 9926438, 9944551, 9935828, 9919062, 9914581, 9891360, 9911714, 9934197, 9918389, 9915836, 9927262, 9929844, 9930099, 9937423, 9963417, 9981115, 9945670, 9922449, 9926266, 9935670, 9943367, 9907039, 9878872, 9878551, 9885484, 9917664, 9935335, 9931985, 9947036]
3954.9I947036K3798j6550m0476q077M093J4161P781j2283L822J6498O152m250N846
3967.4I947551K661q385j0957r314j2118j4089J4107K4618J2644r326j5555K0985J6925
3980I959747l4311k2347J8289O913M919j7836j5650L1119K2556K3552j2216m4467k0604
3992.5I899664r800J4318k942j3376O643K7373L4069j764
4000.2I954185
$$ y = [9947036, 9970834, 9954284, 9913808, 9905731, 9909824, 9923985, 9931766, 9919483, 9923305, 9939803, 9945955, 9941705, 9947551, 9950212, 9941827, 9930870, 9921556, 9909438, 9895349, 9909456, 9934074, 9946718, 9937392, 9921837, 9942822, 9959747, 9925436, 9903089, 9921378, 9928291, 9933210, 9915374, 9899724, 9930843, 9953399, 9976951, 9964735, 9920268, 9899664, 9889864, 9904182, 9901240, 9887864, 9894507, 9921880, 9955949, 9954185]
##END=$$ End of the data block
