##TITLE=Xisto $$ Begin of the data block
##JCAMP-DX=5.00 $$ ACD/SpecManager v 10.08
##SPECTROMETER/DATA SYSTEM=Alpha
##DATE=26 Nov 2014 09:52:56
##DATA TYPE=INFRARED SPECTRUM
##DATA CLASS=XYDATA
##ORIGIN=
##OWNER=
##NPOINTS=1765
##FIRSTX=399.76428223
##LASTX=3997.64306641
##MAXX=3997.64306641
##MINX=399.76428223
##MAXY=0.83374459
##MINY=0.40841994
##XFACTOR=1.0000000000
##YFACTOR=1.000000000000000e-9
##FIRSTY=0.62293518
##DELTAX=2.03961372
##XUNITS=1/CM
##YUNITS=ARBITRARY UNITS
##XYDATA=(X++(Y..Y))
399.8F22935176J3904929Q731186n51164m378974n380035q689463r454488n681992
416.1F11435175n489111r241879o444871k543807k873183k518415J104235K508700
432.4E85936844N9188m08113J230836n78702m217326m721404n002200q349836j0359407
450.8E53589880r062588q702636j1161088j1664629r271801r446084j0015607p528335
467.1D76737112m474879k188444K012670Q207858J2206823J3377070J5054226J7027438
483.4E37959874J5189051J1382044J0021567Q036792K692342p67171k92540j075268
499.7E83146691l968537m164814k568961l697455m842221k304614J99676j75178R1433
518.1E61716020K313852K525270J064361K006351M078866L562569K785385M893243
$$ y = [622935176, 636840105, 645571291, 645020127, 640641153, 635261118, 626571655, 617117167, 611435175, 605946064, 596704185, 590259314, 587715507, 584842324, 582323909, 583428144, 585936844, 585996032, 585587919, 586818755, 586240053, 582022727, 577301323, 572299123, 563949287, 553589880, 544527292, 535824656, 524663568, 512998939, 503727138, 494281054, 484265447, 476737112, 472262233, 470073789, 472086459, 480294317, 492501140, 505878210, 520932436, 537959874, 553148925, 564530969, 574552536, 582589328, 585281670, 584514499, 584221959, 583146691, 579178154, 575013340, 572444379, 568746924, 563904703, 561600089, 561799765, 561624587, 561716020, 564029872, 566555142, 567619503, 569625854, 573704720, 577267289, 580052674, 584945917]
534.4E84945917O712675N556464N146802P118463P060588M429519M082143N437076
550.7F30489647M011095J897097L048718M167497K310693J373649L197670L421545
567F53917611J300096J411081L180205K323270O19114K123057L802956K317965J542389
585.4F72537744L696561M340410K355695K493143M767597M316628K337396L295243
601.7G00140417M628002K638400J091122L192962M502594K679765K365232M487574
618G25726068M168749J892567K361357L799498K061486K01166J667797K525390K53021
636.4G44657099p00950J094699J031279j026213j83404K741814K920747J861215L355681
654.7G55751967M311502J898408M98712K181173K208829p43866j009763K136827J110256
$$ y = [584945917, 591658592, 597215056, 602361858, 609480321, 616540909, 620970428, 625052571, 630489647, 634500742, 636397839, 639446557, 643614054, 645924747, 647298396, 650496066, 653917611, 655217707, 656628788, 659808993, 662132263, 662751377, 664874434, 668677390, 670995355, 672537744, 676234305, 680574715, 682930410, 685423553, 690191150, 694507778, 696845174, 700140417, 704768419, 707406819, 708497941, 711690903, 716193497, 718873262, 721238494, 725726068, 729894817, 731787384, 734148741, 737948239, 740009725, 740210891, 741878688, 744404078, 744657099, 743956149, 745050848, 746082127, 745055914, 744872510, 747614324, 750535071, 752396286, 755751967, 760063469, 761961877, 762460589, 764641762, 766850591, 766106725, 765096962, 767233789, 768344045]
673.1G68344045j200021m40120R44972p81715k325595j036882r99630l915607m931212
691.4G53658235k110124J061976L308595N753576O402016L237665O8724M47273R91643
709.8G72819579j026035k014219l81649k25246k224624j964569K55942K15113j064777
728.1G64389515k19703P90656q67963k397954j387775q60572k281785k257169k58445
746.5G54648805j75417k019107k075017j047909k119720l523052k391755j222193k603829
764.9G37470806m116416m279852n937040r346306j0099471o260037o46413L953219
781.2G00738490O519436N622983J203895l193974n216420o795585q273959n695343
797.5F84909523K187252J0655105J5698015J7708540J7002821J2900889P961035N638361
$$ y = [768344045, 767144024, 766703904, 767648876, 766867161, 764541566, 763504684, 762505054, 758589447, 753658235, 751548111, 752610087, 755918682, 761672258, 768074274, 771311939, 771380663, 771827936, 772819579, 771793544, 769779325, 769397676, 769172430, 766947806, 764983237, 765239179, 765454292, 764389515, 764169812, 764960468, 764092505, 761694551, 760306776, 759446204, 757164419, 754907250, 754648805, 754473388, 752454281, 750379264, 749331355, 747211635, 743688583, 741296828, 740074635, 737470806, 733354390, 729074538, 723137498, 713791192, 703691721, 697431684, 696785271, 700738490, 707257926, 712880909, 714084804, 710890830, 705674410, 698878825, 690604866, 684909523, 687096775, 697751880, 713449895, 731158435, 748161256, 761062145, 769023180, 774661541]
813.8G74661541M569113K144635J59144M91917O17028r73284j562417l72529l20077
832.2G79415071j595497j391053k30015p57157j849950j262903o62327j783967k510905
850.5G67371297j595795j437366k796591l145277k231598k535164l713251l427386
866.8G46488869k582133l230333l924072k866149j897216k632021l150285k401411
883.2G23805249k440572l660679l871977l178060l647387m664004m380703l853917
899.5F94107950m621208n199730m326404l634274l934860l552913k188147j679182
915.8F64971232k143859j888097j136958j466453k191365j827121j404703k112567
932.1F50800109k598643j981795j810789k683521l040194k678812l177106m347682
$$ y = [774661541, 779230654, 781375289, 781534433, 782026350, 782643378, 781670094, 780107677, 779735148, 779415071, 777819574, 776428521, 776198506, 775441349, 773591399, 772328496, 771666169, 769882202, 767371297, 765775502, 764338136, 761541545, 758396268, 756164670, 753629506, 749916255, 746488869, 743906736, 740676403, 736752331, 733886182, 731988966, 729356945, 726206660, 723805249, 721364677, 717703998, 713832021, 710653961, 707006574, 702342570, 697961867, 694107950, 689486742, 684287012, 679960608, 676326334, 672391474, 668838561, 666650414, 664971232, 662827373, 660939276, 659802318, 658335865, 656144500, 654317379, 652912676, 650800109, 648201466, 646219671, 644408882, 641725361, 638685167, 636006355, 632829249, 628481567]
948.4F28481567m631221m493833n261540o125927n965054n837620o635844p144571
964.7E82385957o748855o742537p450580p560075p047057p160485p615626p300138
981.1E24760604o719411o780326o891489o346166n809307n875379n871743n447626
997.4D75019157n335838n659759n523622m915386m718363m789383m388541l795057
1013.7D35893208l634185l532290l046006k675861k798289k829701k422780k102882
1030D12851214j989781j529456p24911j87129J28180O17295R88931Q78036P34985J050412
1050.4D12817776J475781J619578J814574K317250K689868K769649K935350L130108
1066.7D31569934K776176J902967J173765P23779K66701m47J91092L33757O9737j41770
$$ y = [628481567, 623850346, 619356513, 614094973, 607969046, 602003992, 596166372, 589530528, 582385957, 575637102, 568894565, 561443985, 553883910, 546836853, 539676368, 532060742, 524760604, 518041193, 511260867, 504369378, 498023212, 492213905, 486338526, 480466783, 475019157, 469683319, 464023560, 458499938, 453584552, 448866189, 444076806, 439688265, 435893208, 432259023, 428726733, 425680727, 423004866, 420206577, 417376876, 414954096, 412851214, 410861433, 409331977, 408607066, 408419937, 408548117, 409165412, 410154343, 411032379, 411767364, 412817776, 414293557, 415913135, 417727709, 420044959, 422734827, 425504476, 428439826, 431569934, 434346110, 436249077, 437422842, 438146621, 438413322, 438412875, 438603967, 438937724, 439007461, 438865691]
1087.1D38865691M232J12683j0759J06812N68777R17465J196801J896024K850920L543049
1107.5D50051695M059345M774719N463898N747974N873084O040097N933880N497635
1123.8D93442327N238235N348176N454659N309284N176425N138755M832446M454076
1140.1E34394383M506648M714429M610062M594147N070508N441844N072415L929138
1156.5E72333574J895011n85497j636266j28210K473056M230798N095482N866408O380617
1174.8E95924973O198526N908251O057501O066262N574465N234182N270302M996658
1191.1F41231120M398822M215718M324019M019737L587782L684342L859163L544330
1207.5F72865033L335953L655672L732264L259897L070414L295541L104508K557397
$$ y = [438865691, 438869923, 438982606, 438971847, 439078659, 439647436, 440564901, 441761702, 443657726, 446508646, 450051695, 454111040, 458885759, 464349657, 470097631, 475970715, 482010812, 487944692, 493442327, 498680562, 504028738, 509483397, 514792681, 519969106, 525107861, 529940307, 534394383, 538901031, 543615460, 548225522, 552819669, 557890177, 563332021, 568404436, 572333574, 574228585, 573643088, 572006822, 571878612, 574351668, 578582466, 583677948, 589544356, 595924973, 602123499, 608031750, 614089251, 620155513, 625729978, 630964160, 636234462, 641231120, 645629942, 649845660, 654169679, 658189416, 661777198, 665461540, 669320703, 672865033, 676200986, 679856658, 683588922, 686848819, 689919233, 693214774, 696319282, 698876679]
1223.8F98876679K472818K607763K229690J771629J909018K082467J703560J453638
1240.1G15107262J771987J851260J420081J339376J672506J547635J080930J101673
1256.4G26892710J341164J063466P29501R87590J213967Q76308O68704R61304J016855
1274.8G35751569O39677O38068J071572J090229P92503R62913J254380R40621N81682
1293.1G43723214Q04007R76681O23644M52638Q42809J012206O94394O92308J081586
1311.5G50903487J001179O19412Q08835J129508Q35597N55218Q50558J021683N99325
1329.8G58324802L59178P23302Q81672M82738K31862M04239L97205J70052L45528O89924
1350.2G63010502N17309K72929N39124P78556M97520J01626Q8871J84178O914R1910
$$ y = [698876679, 701349497, 703957260, 706186950, 707958579, 709867597, 711950064, 713653624, 715107262, 716879249, 718730509, 720150590, 721489966, 723162472, 724710107, 725791037, 726892710, 728233874, 729297340, 730026841, 731014431, 732228398, 733104706, 733773410, 734734714, 735751569, 736391246, 737029314, 738100886, 739191115, 739983618, 740946531, 742200911, 743141532, 743723214, 744527221, 745503902, 746127546, 746580184, 747422993, 748435199, 749129593, 749821901, 750903487, 751904666, 752524078, 753332913, 754462421, 755298018, 755853236, 756703794, 757725477, 758324802, 758683980, 759407282, 760288954, 760771692, 761003554, 761407793, 761804998, 761975050, 762320578, 763010502, 763527811, 763800740, 764339864, 765118420, 765615940, 765717566, 765806437, 765990615, 765997529, 766089439]
1370.6G66089439N60224L42548l14533k00689M2975j10567M03285J568139J595258
1389G69976079O94633M98116P58290M86493k20298k93255L03983K41399l52740j67608
1409.4G71925092K60412R2566O259L61621Q2434p10726p29144k31147P0453k56658
1429.8G70871162l71635L20077M55916m43875l57450M15743N32508M18186O34313O98030
1450.2G73172975N00857P83265J561046Q74042l75569K35439J254737J062632O66678
1468.5G79736102J439452K152920J051843m1545K77877P70688N79477N51819J253009
1486.9G87771642J338303J36435p8022R82165J213372J47283P1764J129150K004922
1505.2G94717014J078844n72443m17769p510L82781Q15570Q03232N8890n12362r4890
$$ y = [766089439, 766649663, 766992211, 766677678, 766476989, 766519964, 766409397, 766812682, 768380821, 769976079, 770670712, 771168828, 771927118, 772413611, 772193313, 771900058, 772204041, 772445440, 772092700, 771925092, 772185504, 772278070, 772284329, 772645950, 772728384, 772017658, 771288514, 771057367, 771127820, 770871162, 770499527, 770819604, 771275520, 770831645, 770474195, 770889938, 771422446, 771840632, 772474945, 773172975, 773673832, 774457097, 776018143, 776892185, 776516616, 776752055, 778006792, 779069424, 779736102, 781175554, 783328474, 784380317, 784338772, 784616649, 785387337, 785966814, 786518633, 787771642, 789109945, 789246380, 789168358, 790150523, 791363895, 791511178, 791582942, 792712092, 794717014, 795795858, 795223415, 794805646, 794798136, 795180917, 795996487, 796799719, 796858609, 796346247, 796251357]
1525.6G96251357j18077l64483K65003P49647M74572Q29101J377881R9003j255989
1544G98308015j230955l06130K76208O0320J78158J041949R52542j842618j940668
1562.4G95496821n97298k98798o38246j046002q28505o41107j511276j847685j398325
1580.7G86689579j607537j817882j574278j717210k325713k440512k245069k562642
1597G70398736k947450k738595k484440k757967l031731k886057k712190k611518k621054
1615.4G45607734k869368k299547j412153j067698j004935j292467j455366r9719K174139
1633.7G36280620L352940K191723J896321K754212L410578M294872M387736L400028
1650.1G61969030M199386M738092K527535K250433L016531L647268L379524K642333
$$ y = [796251357, 796133280, 795768797, 796033800, 796783447, 797258019, 798087120, 799465001, 799564004, 798308015, 797077060, 796770930, 797047138, 797107458, 797285616, 798327565, 799280107, 797437489, 795496821, 794899523, 794600725, 793962479, 792916477, 792087972, 791446865, 789935589, 788087904, 786689579, 785082042, 783264160, 781689882, 779972672, 777646959, 775206447, 772961378, 770398736, 767451286, 764712691, 762228251, 759470284, 756438553, 753552496, 750840306, 748228788, 745607734, 742738366, 740438819, 739026666, 737958968, 736954033, 735661566, 734206200, 734106481, 736280620, 739633560, 741825283, 743721604, 746475816, 749886394, 754181266, 758569002, 761969030, 766168416, 770906508, 773434043, 775684476, 778701007, 782348275, 785727799, 788370132]
1666.4G88370132K693475K669751J990080J495838J117826J235723J739562J889646
1682.7H03202033J120567J69337J26004J68920O02305J470089J471698Q40843M14431
1701.1H09586227J75238J16050m7624K07901P16626R58026J187384J094341P5937k74718
1721.5H13795388L31044R09328J043082J075327J388133J576006O50644L05236Q91506
1739.8H21965694R46284N43177O27994J089275Q26419j42753j56701M60803M70818
1758.2H26631010J95741J77205J99497K68340L65853N54323L17216m77671n14865Q8691
1778.6H27805340K85745n2154j33872J27911L66331M17649J48356j10388o5088M2379
1799H28832209J07229L4511q8275M8817L96669L74853n7220q9109K41875K66374J05977
$$ y = [788370132, 791063607, 793733358, 795723438, 797219276, 798337102, 799572825, 801312387, 803202033, 804322600, 804491937, 804617941, 804786861, 805389166, 806859255, 808330953, 809171796, 809586227, 809761465, 809877515, 809829891, 810037792, 810754418, 811712444, 812899828, 813994169, 814070106, 813795388, 814126432, 815035760, 816078842, 817154169, 818542302, 820118308, 820768952, 821074188, 821965694, 822911978, 823455155, 824083149, 825172424, 825998843, 825856090, 825699389, 826160192, 826631010, 826826751, 827003956, 827203453, 827471793, 827837646, 828391969, 828709185, 828231514, 827716649, 827805340, 828091085, 828038931, 827905059, 828032970, 828399301, 828816950, 828965306, 828854918, 828789830, 828832209, 828939438, 828973949, 828885674, 828934491, 829331160, 829706013, 829648793, 829559684, 829801559, 830067933, 830173910]
1821.4H30173910K83181N35965M30703N5075k41458r9480R238p4923J54674N32687
1841.8H31759572L06726l31760l61025k40088l97324l63946j17302j70708m26114l24785
1862.2H29333246N1558J88887o5923l23117k71320k24829j92284L4570J33574k6524
1882.6H28637838j967K99633L16799n9903o7413K02000R0480o2704J58250L47734K31504
1905H30092251J60992K79904K25305J4365J23024M03881K63632m3750p2360j6153p7725
1927.5H31353366j50382j3173J25051j9312j28269R0956K15114r3401k59161n0783
1947.9H31070006K4319j09613r8288K9563l2365j76430r3638J00195K9206k16603k11775
1970.3H30314577q5593j41620j60516n662L4213q7380q3447N6684N7578o7353j12474
$$ y = [830173910, 830457091, 830993056, 831423759, 831478834, 831237376, 831137896, 831147134, 831072211, 831226885, 831759572, 832066298, 831734538, 831373513, 831133425, 830736101, 830372155, 830254853, 830084145, 829658031, 829333246, 829384804, 829573691, 829507768, 829184651, 828913331, 828688502, 828496218, 828530788, 828664362, 828637838, 828635871, 828935504, 829252303, 829192400, 829124987, 829326987, 829417467, 829354763, 829513013, 829860747, 830092251, 830253243, 830533147, 830758452, 830772817, 830895841, 831299722, 831563354, 831519604, 831447244, 831431091, 831353366, 831202984, 831189811, 831314862, 831295550, 831167281, 831258237, 831473351, 831379950, 831120789, 831070006, 831094325, 830984712, 830886424, 830915987, 830883622, 830707192, 830613554, 830713749, 830742955, 830526352, 830314577, 830228984, 830087364, 829926848, 829921186, 829955399, 829868019, 829784572, 829841256, 829898834, 829831481, 829719007]
1992.7H29719007q6963j07944j51158p3790K8670k8551n9962Q7738J42395J5617K5570
2015.2H29510629J60158P8499j09255m7982J19209O2406p1287n9R3400j788k8551J56343
2039.6H29921722J98245m231m4346J23143J21832k1458L2723J75297R0361m4644N7221
2062.1H30605865J58607L815q8632P2479J27375k3245k3604J25289R2864l3140M0829
2084.5H31058502J73032Q2911n4718K8730J28806K5570j7464J22726J36018P867K2531
2106.9H31714511J07527L9339m4286M9114J51157O0320k6762P2121J19746o080l6835
2129.4H32199872R0718J05142j490J8537J12176O3718j2696O1333J29998N3107N37
2151.8H32820952P8380Q4817j9371J132J05441O9499j9431L1829J11043N3048j5318
$$ y = [829719007, 829632044, 829524100, 829372942, 829299152, 829327822, 829299271, 829239309, 829327047, 829469442, 829485059, 829510629, 829670787, 829749286, 829640031, 829592049, 829711258, 829773664, 829702377, 829702318, 829795718, 829793930, 829765379, 829921722, 830119967, 830115736, 830071390, 830194533, 830316365, 830294907, 830327630, 830502927, 830593288, 830548644, 830605865, 830764472, 830768287, 830679655, 830752134, 830879509, 830856264, 830832660, 830957949, 831050813, 831017673, 831058502, 831231534, 831314445, 831259727, 831288457, 831417263, 831442833, 831425369, 831548095, 831684113, 831691980, 831714511, 831822038, 831861377, 831817091, 831866205, 832017362, 832077682, 832050920, 832123041, 832242787, 832236707, 832199872, 832290590, 832395732, 832394242, 832412779, 832524955, 832588673, 832575977, 832637310, 832767308, 832820415, 832820952, 832899332, 832984149, 832964778, 832965910, 833071351, 833140850, 833121419, 833153248, 833264291, 833317339, 833302021]
2174.3H33302021M9710R3758J1444j1026P1585O6280k7776k5391N9128N2929j2637
2196.7H33630025Q762M7148p749k8670M7028M8042m1307m5537J8954K384o0856m3631
2221.2H33574593K6882K6047j7405R537K4259n4955p7665K623K2530l1471k8849P987
2245.6H33484113k8372p9035m0949J1683o974l2008R54P927o3598p9691j4186Q941
2270.1H33168805k5154k8908N782k444k3484O318O378p6592j45972j40548j37389j68442
2294.6H32438350j73807j61112j87635k41101k94626l57032m14729m25696l52800k91049
2315H29538763m03583n75305n80787m45426l71754m41789m85719l58522j94370j96815
2335.4H25484693k86162l22282k30253J89900Q62957R05573O6399q73446j295924j203299
$$ y = [833302021, 833351731, 833445489, 833456933, 833445907, 833517492, 833583772, 833555996, 833530605, 833589733, 833642662, 833630025, 833638787, 833685935, 833678186, 833649516, 833696544, 833744586, 833703279, 833657742, 833676696, 833679080, 833618224, 833574593, 833601475, 833627522, 833610117, 833619654, 833643913, 833588958, 833511293, 833513916, 833536446, 833504975, 833476126, 833484113, 833455741, 833376706, 833335757, 833347440, 833340466, 833308458, 833309412, 833317339, 833253741, 833174050, 833159864, 833168805, 833143651, 833114743, 833120525, 833118081, 833094597, 833100915, 833107293, 833030701, 832884729, 832744181, 832606792, 832438350, 832264543, 832103431, 831915796, 831674695, 831380069, 831023037, 830608308, 830182612, 829829812, 829538763, 829135180, 828559875, 827979088, 827533662, 827161908, 826720119, 826234400, 825875878, 825681508, 825484693, 825198531, 824876249, 824645996, 824835896, 825698853, 826604426, 826670825, 825797379, 824501455, 823298156]
2355.8H23298156q85129l91185Q0824M27008P36951R46165R82880R63211R30965Q84593
2376.2H27974439Q59439Q05855O68228M74631K55406O7234j1384j6511m0114p4565
2396.6H30962658o5804n9485j00315j06096n6088l1352n0127o1095n9784q7678j10686
2419H30174148p4088j8120r120m0412p0154r3699j16289j04129m9174k9564o2704o3777
2443.5H29442918m0173o6400j03831q2314l4154j7583m5597q1301j05143j29700j14083
2465.9H28622639n0425k6524n5075n4598n7876j20998j53124q7857j8716l7432p6353
2488.3H27883661p0632q6963j33157j19984n9128m2319o3181o3956p3671j26481j46925
2510.8H26897264q9169l0458k8849l5226l7611q3982j22786j08302o8426l0577k8670
$$ y = [823298156, 822413027, 822021842, 822102666, 822529674, 823266625, 824212790, 825195670, 826158881, 827089846, 827974439, 828833878, 829639733, 830307961, 830782592, 831037998, 831105232, 831093848, 831077337, 831037223, 830962658, 830896854, 830837369, 830737054, 830630958, 830574870, 830543518, 830493391, 830432296, 830372512, 830284834, 830174148, 830100060, 830081940, 830072820, 830032408, 829962254, 829868555, 829752266, 829648137, 829598963, 829569399, 829506695, 829442918, 829402745, 829336345, 829232514, 829150200, 829116046, 829098463, 829052866, 828971565, 828866422, 828736722, 828622639, 828572214, 828545690, 828490615, 828436017, 828378141, 828257143, 828104019, 828016162, 827997446, 827960014, 827883661, 827813029, 827726066, 827592909, 827472925, 827413797, 827371478, 827308297, 827244341, 827170670, 827044189, 826897264, 826808095, 826777637, 826748788, 826713562, 826675951, 826591969, 826469183, 826360881, 826292455, 826261878, 826233208]
2533.2H26233208m8280o9677j02044j20520r4116m0769k4260m0888m7803q4162j38402
2555.6H25422287j28329p2837m6193l9637k5988m6313j19209j59800j05739n2392p1585
2578.1H24554265q0467o2048r2089j40846j15812m3690k1577m4167n0962o5267j19746
2600.5H23717594j53065j26123r4056q5652o6817n3108j00433j60456j41978o6460
2620.9H22669446k6345n5313r7632j10627j22070j42753j16527n3108n1021r0540r5665
2643.4H21707845j23680j91927j99020j38700r4890p2718n3763o2585r9361j24932
2663.7H20546269r5546n4002n6564n9247n9307r7156j22368j00970j14501j60932j43886
2686.2H19481790p7426o6579j42693j93537j39653p7009r4235j24097j06812j00016
$$ y = [826233208, 826184928, 826115251, 826013207, 825892687, 825798571, 825757802, 825733542, 825692654, 825644851, 825560689, 825422287, 825293958, 825221121, 825174928, 825135291, 825109303, 825062990, 824943781, 824783981, 824678242, 824625850, 824554265, 824473798, 824411750, 824319661, 824178815, 824063003, 824019313, 823997736, 823953569, 823902607, 823837340, 823717594, 823564529, 823438406, 823344350, 823258698, 823191881, 823138773, 823038340, 822877884, 822735906, 822669446, 822643101, 822587788, 822490156, 822379529, 822257459, 822114706, 821998179, 821945071, 821894050, 821803510, 821707845, 821584165, 821392238, 821193218, 821054518, 820959628, 820886910, 820833147, 820770562, 820671201, 820546269, 820450723, 820396721, 820340157, 820280910, 820221603, 820124447, 820002079, 819901109, 819786608, 819625676, 819481790, 819404364, 819337785, 819195092, 819001555, 818861902, 818784893, 818690658, 818566561, 818459749, 818359733]
2706.6H18359733j20223j34051j21951r2924j07586j22547p6473p5400j34408j56105
2727H17218065j51992j34348j07408q2731q1837j36257j59561q9944k1100l5524r8348
2749.4H16119015j40190j51932j67310j76251j32382j04130j32799j30832j05262j28865
2769.8H14749062j43647q9049q8931j71601j96755j59264j61052j84953j31190q2016
2790.2H13340604j54137k15471j54793j37031k78175l59297k45154j26958j48475k23160
2810.6H11297953k38120k49565l09408k97248k07365k08020k85089k86281k61724l27528
2831H08627605l93867l42488k80440m33564o95646p66337p19667p35640p33435o02365
2851.4H02924156m26173k99990j68205r6857j99556l03746k35378j40906j26660o1869
$$ y = [818359733, 818239510, 818105459, 817983508, 817890584, 817782998, 817660451, 817583978, 817508578, 817374170, 817218065, 817066073, 816931725, 816824317, 816741586, 816659749, 816523492, 816363931, 816273987, 816252887, 816217363, 816119015, 815978825, 815826893, 815659583, 815483332, 815350950, 815246820, 815114021, 814983189, 814877927, 814749062, 814605415, 814516366, 814427435, 814255834, 814059079, 813899815, 813738763, 813553810, 813422620, 813340604, 813186467, 812970996, 812816203, 812679172, 812400997, 812041700, 811796546, 811669588, 811521113, 811297953, 811059833, 810810268, 810500860, 810203612, 809996247, 809788227, 809503138, 809216857, 808955133, 808627605, 808233738, 807891250, 807610810, 807177246, 806481600, 805715263, 804995596, 804259956, 803526521, 802924156, 802497983, 802197993, 802029788, 801932931, 801733375, 801429629, 801194251, 801053345, 800926685, 800864816]
2871.8H00864816j8418j44601k36273j47700o3777j24276k57909l42190l81530m18663
2892.2G98729479l98338l59058l91900m39406m44174m29690m54902m96865m35471l35991
2912.6G94543684m27664o37591o72280n40078m00841k21372O1393K52545J74462J17779
2933G92250037K65777L40462K78056L26156M13776K53320o9380k15411j79410k94507
2953.4G93368876m49538k91586N424J72198K40504L04223L62873M22775N89788P55191
2973.8G95480728O57439M60744L82006K45870N0604K3723J31189K12908J44482l6061
2994.2G97753632p6353r3699k36869k45213j50264j38640r3103M1664L4511k23219
3014.5G96572447m50432m46856l64423l07560k72572k80023k69055k17140j49667k01702
$$ y = [800864816, 800846398, 800701797, 800465524, 800317824, 800254047, 800129771, 799871862, 799529672, 799148142, 798729479, 798331141, 797972083, 797580183, 797140777, 796696603, 796266913, 795812011, 795315146, 794879675, 794543684, 794116020, 793478429, 792806149, 792266071, 791865230, 791643858, 791705251, 791957796, 792132258, 792250037, 792515814, 792856276, 793134332, 793460488, 793874264, 794127584, 794058204, 793842793, 793663383, 793368876, 792919338, 792627752, 792633176, 792805374, 793045878, 793350101, 793712974, 794135749, 794725537, 795480728, 796138167, 796598911, 796980917, 797226787, 797277391, 797301114, 797432303, 797645211, 797789693, 797753632, 797677279, 797583580, 797346711, 797101498, 796951234, 796812594, 796719491, 796761155, 796795666, 796572447, 796122015, 795675159, 795310736, 795003176, 794730604, 794450581, 794181526, 793964386, 793814719, 793613017]
3034.9G93613017l77179l21805j25229k00808m43042m81844k89201k07723l02016l01958
3055.3G90562212k83479l64125l48508j72615j8537j21415l64661m02212k68400j03057
3075.7G88115203o55j22845l21508l96013m19021l87549l76582m89474m99904l32653
3096.1G84768999k27452l00884m33087m52936l36468k73824l65794l53396j85191j64628
3116.5G81675339l32594n82218p87497p70628o07849m83214m69089n33462n26964l87788
3136.9G76194036l58105n99026p83623p05361n60761m11570l52740n94377q77381q51989
3157.3G70099103p30395p08163o90519o93560p35998p43449p37727p68065p97629q09312
3177.7G62684286q32141q67367q94963r04084q83281q72671r11475r57489r99450j034618
$$ y = [793613017, 793235838, 792914033, 792788804, 792587996, 792144954, 791663110, 791373909, 791166186, 790864170, 790562212, 790278733, 789914608, 789566100, 789393485, 789374948, 789253533, 788888872, 788486660, 788218260, 788115203, 788114548, 787991703, 787670195, 787274182, 786855161, 786467612, 786091030, 785601556, 785101652, 784768999, 784541547, 784240663, 783807576, 783354640, 783018172, 782744348, 782378554, 782025158, 781839967, 781675339, 781342745, 780760527, 779973030, 779202402, 778594553, 778111339, 777642250, 777108788, 776581824, 776194036, 775835931, 775236905, 774453282, 773747921, 773187160, 772775590, 772422850, 771828473, 770951092, 770099103, 769368708, 768660545, 767970026, 767276466, 766540468, 765797019, 765059292, 764291227, 763493598, 762684286, 761852145, 760984778, 760089815, 759185731, 758302450, 757429779, 756518304, 755560815, 754561365, 753526747]
3198.1G53526747j025200r82821r61601r62854r66251r71913r78649j022994j049698
3216.5G44604766j004457j018763j098633j117467j087070j044214r37402q66473j028657
3234.8G35401630j232445j210809j067996r61899r33350r70780j020909r93430q79050
3253.2G26130962p78734p86543q73685r18567q62360p44224o05583m96030n92708q31783
3273.6G18640745r84013j027406r53078q74400q84712q84950q39233p78437q23259
3291.9G10591257j002014j170456j315237j357495j151443r47118j124799j567304
3308.2G00955391j852095j866818j803398j779258j769841j785338j801073j830459
3324.6F86467111k031624k274275k300739k207339k139747k150595k328992k532482
$$ y = [753526747, 752501547, 751518726, 750557125, 749594271, 748628020, 747656107, 746677458, 745654464, 744604766, 743600309, 742581546, 741482913, 740365446, 739278376, 738234162, 737296760, 736430287, 735401630, 734169185, 732958376, 731890380, 730928481, 729995131, 729024351, 728003442, 727010012, 726130962, 725352228, 724565685, 723692000, 722773433, 721911073, 721166849, 720561266, 720065236, 719472528, 718640745, 717656732, 716629326, 715676248, 714801848, 713917136, 713032186, 712192953, 711414516, 710591257, 709589243, 708418787, 707103550, 705746055, 704594612, 703647494, 702522695, 700955391, 699103296, 697236478, 695433080, 693653822, 691883981, 690098643, 688297570, 686467111, 684435487, 682161212, 679860473, 677653134, 675513387, 673362792, 671033800, 668501318]
3340.9F68501318k621055k705276k658725k483368k654552l080428l160179k933621
3357.2F46204114k826691k924382k957464k802252k771438l055155l397643l391803
3373.5F22077286l028631k727866k659261k666533k564192k305389j963734j668990
3389.8F02492690j703620k020120k064109j636386j321137j621068j996696j797735
3406.1E88331819j384676j197934j187623j275181j257480j011788q39472q23081o79552
3424.5E78675032l95120j96516j45495j967J85371M8279j97291o1870K97904N49376
3444.9E78757703O58810O54877O98805Q44717R86695J125991J240254J201987J215041
3463.2E87384880J510500J665414J329303R34899R55700J194537J453698J573741J342833
$$ y = [668501318, 665880263, 663174987, 660516262, 658032894, 655378342, 652297914, 649137735, 646204114, 643377423, 640453041, 637495577, 634693325, 631921887, 628866732, 625469089, 622077286, 619048655, 616320789, 613661528, 610994995, 608430803, 606125414, 604161680, 602492690, 600789070, 598768950, 596704841, 595068455, 593747318, 592126250, 590129554, 588331819, 586947143, 585749209, 584561586, 583286405, 582028925, 581017137, 580177665, 579354584, 578675032, 578279912, 578083396, 577937901, 577935934, 578121305, 578169584, 577972293, 577910423, 578208327, 578757703, 579416513, 580071390, 580770195, 581614912, 582601607, 583727598, 584967852, 586169839, 587384880, 588895380, 590560794, 591890097, 592824996, 593780696, 594975233, 596428931, 598002672, 599345505]
3481.6E99345505J197636J383543J446247J352370J411200J535892J549840J485825
3497.9F10708058J570463J696765J437009J134336J275837J568318J728177J678109
3514.2F22797072J533866J543820J740038J968265J846730J510561J447201J578867
3530.6F35966420J778960J976908J871764J641929J824201K155780K085329J632571
3546.9F50933862J410067J608550J710117J655281J774847J983881K023042J980066
3563.2F65079713K102375K189338J871348J616001J785695K028465K050341K061426
3579.5F80784702K170742K286732K289236J900851J451791J491248J745880J853347
3595.8F95974529J815676J728535J646102J721978J889348J960635J908064J838386
$$ y = [599345505, 600543141, 601926684, 603372931, 604725301, 606136501, 607672393, 609222233, 610708058, 612278521, 613975286, 615412295, 616546631, 617822468, 619390786, 621118963, 622797072, 624330938, 625874758, 627614796, 629583061, 631429791, 632940352, 634387553, 635966420, 637745380, 639722288, 641594052, 643235981, 645060182, 647215962, 649301291, 650933862, 652343929, 653952479, 655662596, 657317877, 659092724, 661076605, 663099647, 665079713, 667182088, 669371426, 671242774, 672858775, 674644470, 676672935, 678723276, 680784702, 682955444, 685242176, 687531412, 689432263, 690884054, 692375302, 694121182, 695974529, 697790205, 699518740, 701164842, 702886820, 704776168, 706736803, 708644867, 710483253]
3612.1G10483253J734197J642645J696944J640141J431227J570642K074062K579570
3628.5G24852681K418101K009094K102554K236008K278507K369463K434016K558469
3644.8G43258893K923251L148257K276540J351953J586914K193153K106547J758635
3661.1G60604143J733422J931370K130806K215445J938284J581251J411915R12368
3677.4G74459004O44505Q34287J080334J419484J825989J446485L84331J26421L52383
3695.8G82573223M26412M88281N44548M48644N45502R36746J232267R71258M58181
3714.1G88625062L53872M89354N33820L87668J77980L3676J04845M83572R37462Q16822
3734.5G92944133J3352m23491j92106J12534R6797J8120J15395q1539m85122l64125
$$ y = [710483253, 712217450, 713860095, 715557039, 717197180, 718628407, 720199049, 722273111, 724852681, 727270782, 729279876, 731382430, 733618438, 735896945, 738266408, 740700424, 743258893, 746182144, 749330401, 751606941, 752958894, 754545808, 756738961, 758845508, 760604143, 762337565, 764268935, 766399741, 768615186, 770553470, 772134721, 773546636, 774459004, 775103509, 775937796, 777018130, 778437614, 780263603, 781710088, 782094419, 782220840, 782573223, 782999635, 783487916, 784032464, 784481108, 785026610, 785963356, 787195623, 788166881, 788625062, 788978934, 789468288, 790002108, 790389776, 790567756, 790601432, 790706277, 791189849, 792127311, 792944133, 792957485, 792533994, 792341888, 792454422, 792551219, 792569339, 792684734, 792603195, 792118073, 791753948]
3754.9G91753948n9545j16527l36171j94192O5983M4405j38998k89082k60532k7478
3775.3G90441811K28286J46150k24947l09170j93774j38998j06991p9810O4611K53916
3795.7G90081084K46882J41204o8903l14236l47555l75926l05474p987K52604K79010
3816.1G89580703J89543o140m05371m50253k20299j50204q1420J04547L30984L38793
3836.5G89230883p3552m39048m60982m06146k52783P4148L65555K23517l53157m46141
3856.9G87462294k01642P331M6253r1731q2255j6987j34409k61902l09885j76668P8022
3879.3G86318421J10865J3053q3804k27809k07543j92523k39432q4698J72079K71499
3899.7G85850108R9837k65538n95868n34773k15709k5988L7551J43648R5665j56522
$$ y = [791753948, 791694403, 791577876, 791241705, 791047513, 791113496, 791157901, 791018903, 790729821, 790469289, 790441811, 790670097, 790816247, 790591300, 790282130, 790088356, 789949358, 789842367, 789762557, 789827168, 790081084, 790327966, 790469170, 790400267, 790086031, 789738476, 789362550, 789057076, 789049089, 789301693, 789580703, 789770246, 789764106, 789358735, 788908482, 788688183, 788537979, 788456559, 788561106, 788892090, 789230883, 789157331, 788718283, 788257301, 787851155, 787598372, 787672520, 788038075, 788261592, 787908435, 787462294, 787260652, 787267983, 787314236, 787222505, 787140250, 787123263, 786988854, 786726952, 786417067, 786240399, 786318421, 786429286, 786442339, 786358535, 786130726, 785923183, 785730660, 785491228, 785406530, 785578609, 785850108, 785949945, 785684407, 785088539, 784553766, 784338057, 784312069, 784349620, 784493268, 784588933, 784432411]
3920.1G84432411k17974j02639n1439j9550k146o0082j67846k53856j58370M7684P3015
3942.5G83519208k4020k4855l8803j50740k07067j10089p75o3360j49727r3996l9161
3965G82616615p1943r1433o1989o0439p4446o0678n7280k8431K2590l5048j22666j25766
3989.5G81849086r2685k8610j7941j00196
3997.6G81609654
$$ y = [784432411, 784214437, 784111798, 784060359, 784040809, 784038663, 783978581, 783810735, 783556879, 783398509, 783446193, 783519208, 783495188, 783470333, 783431530, 783280790, 783073723, 782963634, 782962859, 782899499, 782749772, 782655776, 782616615, 782544672, 782453239, 782391250, 782330811, 782256365, 782195687, 782138407, 782109976, 782132566, 782097518, 781974852, 781849086, 781756401, 781727791, 781709850, 781609654]
##END=$$ End of the data block
