##TITLE=Wax liofilizado $$ Begin of the data block
##JCAMP-DX=5.00 $$ ACD/SpecManager v 10.08
##SPECTROMETER/DATA SYSTEM=Alpha
##DATE=02 Sep 2014 09:46:38
##DATA TYPE=INFRARED SPECTRUM
##DATA CLASS=XYDATA
##ORIGIN=
##OWNER=
##NPOINTS=1765
##FIRSTX=399.76428223
##LASTX=3997.64306641
##MAXX=3997.64306641
##MINX=399.76428223
##MAXY=0.86740470
##MINY=0.15985195
##XFACTOR=1.0000000000
##YFACTOR=1.000000000000000e-9
##FIRSTY=0.84664774
##DELTAX=2.03961372
##XUNITS=1/CM
##YUNITS=ARBITRARY UNITS
##XYDATA=(X++(Y..Y))
399.8H46647739J754821K545893j976311j086056L192603P7844m605055j286924K628267
$$ 846647739 848402560 850948453 848972142 847886086 851078689 851156533 846551478 845264554 847892821
418.1H47892821q87454k222836K223373K065897k896965k146840K241671K83778l048659
$$ 847892821 847005367 844782531 847005904 849071801 846174836 844027996 846269667 846553445 843504786
436.5H43504786P28608L957271n9187k348244J824617K529800k036333j847685K596260
$$ 843504786 844233394 848190665 848131478 845783234 847607851 850137651 848101318 846253633 848849893
454.8H48849893J060962l716051j251579K575517k93374k716720J189351L005326j430035
$$ 848849893 849910855 846194804 844943225 847518742 847225368 844508648 845697999 848703325 847273290
473.2H47273290k342820K126694J903951k585352j671910K335429K87831l321647l65258
$$ 847273290 844930470 847057164 848961115 846375763 844703853 847039282 847327113 844005466 843640208
491.5H43640208L001869j75595k513647R27806K104818k033114k899110L49700p03335
$$ 843640208 846642077 846466482 843952835 844880641 846985459 844952345 842053235 842402935 841699600
509.9H41699600m901588l851890K56955k67565k349079K08438K821326P66635l70085
$$ 841699600 836798012 832946122 833203077 832935512 830586433 830794871 833616197 834382832 834012747
528.3H34012747K895057L898859J77980j121045J569391J278460j964093j432299J493871
$$ 834012747 836907804 840806663 840984643 839863598 841432989 842711449 840747356 839315057 840808928
546.6H40808928L44217k467036j062394J222313n66483k350926k87056Q78572j713395
$$ 840808928 841153145 838686109 837623715 838846028 838279545 835928619 835641563 836520135 834806740
565H34806740k867281m79996J82032j969278j847267M54366n1319k184451q69095K183497
$$ 834806740 831939459 831459463 831641495 829672217 827824950 828279316 828227997 826043546 825174451 827357948
585.4H27357948K165198J145423K997219M508138K303541M58598J943826K455950l8326
$$ 827357948 829523146 830668569 833665788 838173926 840477467 840936065 842879891 845335841 845297515
603.7H45297515q97109R15408N90980k150595k341688p3969N3167j319110l51489J172841
$$ 845297515 844400406 845315814 845906794 843756199 841414511 841340542 841393709 840074599 839723110 840895951
624.1H40895951k42830j946568k50697K030790J576781J333296L552437M305601J810670
$$ 840895951 840653121 838706553 838455856 840486646 842063427 843396723 846949160 851254761 853065431
642.5H53065431O08027K125442K049148j73092k52604J551509J021087q85725j12116
$$ 853065431 853673458 855798900 857848048 857674956 857422352 858973861 859994948 859109223 858997107
660.8H58997107J633644M60446k005399o60240J807212m8995j593470j20104R56595
$$ 858997107 860630751 861091197 859085798 858425558 860232770 860183775 858590305 858470201 859426796
679.2H59426796m94062r30548R40025J346230m42922p30574O43551R9480j778900j515985
$$ 859426796 858932734 858002186 858942211 860288441 859845519 859114945 859758496 859857976 858079076 856563091
699.6H56563091l11494j586377l754676l841102m157364q476496j8103897l4481824
$$ 856563091 856251597 854665220 850910544 847069442 842912078 834435582 816331685 781849861
715.9G81849861m4683099k1254122J9522488K8433383M420340j9019902j0903656K3284375
$$ 781849861 737166762 715912640 735435128 763868511 768288851 749268949 738365293 761649668
732.2G61649668L9049626K5763213J1093438N518496K838016P93576P19189J276851
$$ 761649668 800699294 826462507 837555945 843074441 845912457 846706033 847425222 848702073
748.5H48702073K27392r82881m20213K34187p48038j730740j184464r01878k048075
$$ 848702073 848929465 847946584 847526371 847760558 847012520 845281780 844097316 843195438 841147363
766.9H41147363k368927r23514j62423r57429r58920N23865J498282J733721K896011
$$ 841147363 838778436 837854922 837692499 836735070 835776150 836300015 837798297 839532018 842428029
785.3H42428029M329323L874660K255857J825273K040446Q46684q86321j036406k57492
$$ 842428029 846757352 850632012 852887869 854713142 856753588 857600272 856713951 855677545 855420053
803.6H55420053j84774j66893N76615O70612o66261j755774j792192k744317n527735
$$ 855420053 855235279 855068386 855645001 856315613 855649352 853893578 852101386 849357069 843829334
822H43829334q080602q956909q754909o797433j469374N207420Q899629Q794784P547319
$$ 843829334 835748732 826791823 818036914 811239481 809770107 814977527 823877156 832671940 840219259
840.3H40219259O411135M597962K673626K245128K556205J695812L34620J88709O09040
$$ 840219259 846630394 851228356 853901982 856147110 858703315 860399127 860733747 860922456 861531496
858.7H61531496M11391M56155J439273J914680R41932N8949L26038L24785q00550j549005
$$ 861531496 861942887 862399042 863838315 865752995 866694927 866753876 867079914 867404699 866604149 865055144
879.1H65055144j277387j569510k661943k481520p25091K50399k78175o75201p46667
$$ 865055144 863777757 862208247 859546304 857064784 856339693 856590092 856311917 855636716 854890049
897.4H54890049j700521k965927l095508k789199l487408m397333m302204m294514
$$ 854890049 853189528 850223601 847128093 844338894 840851486 836454153 832151949 827857435
913.7H27857435n386293n706608l374279j22190J321972J413762J722336J569510L96907
$$ 827857435 822471142 816764534 813390255 813268065 814590037 816003799 817726135 819295645 819692552
932.1H19692552k31087K90036L62396n17785j060963j252890k279043l700912m034042
$$ 819692552 819461465 819751501 820113897 819596112 818535149 817282259 815003216 811302304 807268262
950.5H07268262l221870j603722J807570O701589R537816P932782M368365K155244
$$ 807268262 804046392 802442670 804250240 810951829 820489645 828422427 832790792 834946036
966.8H34946036J034141l12448j380801k055049l728211o068766o197274l119170K72155
$$ 834946036 835980177 835667729 834286928 832231879 828503668 822434902 816237628 813118458 813390613
985.1H13390613J663446J990497K006352Q58367r76086j905501k214849l104031m062295
$$ 813390613 815054059 817044556 819050908 819909275 818933189 817027688 814812839 811708808 807646513
1003.5H07646513m257560m672766n965769o660700o207883o329179p523179p747173
$$ 807646513 803388953 798716187 792750418 786089718 779881835 773552656 766029477 758282304
1019.8G58282304n669773k635479K8670K791464N353749N841136M124701K729893K850473
$$ 758282304 752612531 749977052 750005722 752797186 758150935 763992071 768116772 770846665 773697138
1038.2G73697138K743602J759886J492024J698494N25474j498818k509773k629876
$$ 773697138 776440740 778200626 779692650 781391144 781916618 780417800 777908027 775278151
1054.5G75278151k918422l081739k486289j807630j688003j201213K26558J339852
$$ 775278151 772359729 769277990 766791701 764984071 763296068 762094855 762321413 763661265
1070.8G63661265J401961J678825K742707K923370J416087j78158j035273k127648
$$ 763661265 765063226 766742051 769484758 772408128 773824215 773646057 772610784 770483136
1087.1G70483136l269195l160477k240479k109706k798141l045141k630174k350986
$$ 770483136 767213941 764053464 761812985 759703279 756905138 753859997 751229823 748878837
1103.4G48878837k164662j561582j041651q99255p3672J725674K919972K662420K201736
$$ 748878837 746714175 745152593 744110942 743211687 743138015 744863689 747783661 750446081 752647817
1121.8G52647817K421737K320766J353026Q25882J214862R77099l77000j438141j919210
$$ 752647817 755069554 757390320 758743346 759569228 760784090 761761189 761384189 759946048 758026838
1140.1G58026838k896726m416287n877852p879138j1259794j5211881j8329918k0281315
$$ 758026838 755130112 750713825 744835973 736956835 725697041 710485160 692155242 671873927
1156.5F71873927k0998776j9820034j6930879j4072537j1621058p265329k00808P219791
$$ 671873927 650875151 631055117 614124238 600051701 588430643 581165314 580964506 588184297
1172.8E88184297J3789594K0291209K4143756J9332707O666481k499461M09186R600341
$$ 588184297 601973891 622265100 646408856 665741563 672408044 669908583 670317769 679918110
1189.1F79918110J3625980R303868J284182m566610n281925j532972L097534M206538
$$ 679918110 693544090 702847958 704132140 699565530 694283605 692750633 695848167 700054705
1205.4G00054705K064705Q29101J271546J010537j4305j53363l9876q56399j347304
$$ 700054705 702119410 702948511 704220057 705230594 705216289 705062926 705023050 704166651 702819347
1223.8G02819347r86933j274169k611279l289104k227008j376689k050876l149867
$$ 702819347 701832414 700558245 697946966 694657862 692430854 691054165 689003289 685853422
1240.1F85853422m403889o025255o550551m390061j013517J144111K717614M695356
$$ 685853422 681449533 675424278 668873727 664483666 663470149 664614260 667331874 672027230
1256.4F72027230N496323N074263N941629P774413P838964O048620M335881L383874
$$ 672027230 677523553 682597816 688539445 696313858 704152822 710201442 714537323 717921197
1272.7G17921197K695322K001822J594246J640677J725376J742303K386749L854215
$$ 717921197 720616519 722618341 724212587 725853264 727578640 729320943 731707692 735561907
1289G35561907N618811O870866O639302M921436K474606K32935p17044j99020Q77142
$$ 735561907 741180718 748051584 754690886 759612322 762086928 762319863 761602819 761403799 762280941
1307.4G62280941K000451L015876L032625J652658N08248J134932K162219J531541
$$ 762280941 764281392 767297268 770329893 771982551 772490799 773625731 775787950 777319491
1323.7G77319491j88649j097441l1292K736509M848540M088282J324237p06852n26488
$$ 777319491 777130842 776033401 776002109 778738618 783587158 787675440 788999677 788292825 787766337
1342.1G87766337K33353l91603j604438j507520l36886K98023J37449r1613m70578
$$ 787766337 787999690 787608087 786003649 784496129 784159243 784457266 784594715 784503102 784032524
1360.4G84032524j282037j544356q84175r53853k721668m980445n415976k142489L138602
$$ 784032524 782750487 781206131 780321956 779368103 776646435 771665990 766250014 764107525 767246127
1378.8G67246127O650627O618261M603624K571285P44045q21233k061188k364159o22511
$$ 767246127 773896754 780515015 785118639 787689924 788433969 787612736 785551548 783187389 782564878
1397.1G82564878J890302K913356K410650J309991q77082m101932o557763n608261
$$ 782564878 784455180 787368536 789779186 791089177 790212095 786110163 779552400 773944139
1413.5G73944139j696407K020776L612399K820194J470983K58386q97765j997769l044426
$$ 773944139 772247732 774268508 777880907 780701101 782172084 782430470 781532705 779534936 776490510
1431.8G76490510l651500l987968m045725l632903l375769l154278l351628m786551
$$ 776490510 772839010 768851042 764805317 761172414 757796645 754642367 751290739 746504188
1448.1G46504188o647528p591724p748485j1444091k7215481m4492543l8791418l774405
$$ 746504188 739856660 732264936 724516451 713072360 685856879 641364336 602572918 598798513
1464.5E98798513K4593831J0783910j8703103k4064243J9054950N4545045N0517320
$$ 598798513 623392344 634176254 615473151 591408908 610463858 665008903 715526223
1478.7G15526223L4532309K2284090J3825417R018659O452561M681170L234148K121746
$$ 715526223 750058532 772342622 786168039 795186698 801639259 806320429 809554577 811676323
1495H11676323J053393n36442k339363m432618r023965j8117249k2387385k0657957
$$ 811676323 812729716 812193274 809853911 805421293 796397328 778280079 755892694 735234737
1511.4G35234737j3677597J547397J7088651K4170459K4946689J8643081J0399163
$$ 735234737 721557140 723104537 740193188 764363647 789310336 807953417 818352580
1525.6H18352580O042898L596484K603949K071797J149178Q45909J363516J002192
$$ 818352580 824395478 827991962 830595911 832667708 833816886 834662795 836026311 837028503
1542H37028503K61009K33472L09407R3997j24514M3809K10166Q5354m44353p01606
$$ 837028503 837289512 837522984 837832391 837926388 837801874 837845683 838055849 838141203 837696850 836995244
1562.4H36995244p98821j104713j482367j978338k628148l688872n264520o000519
$$ 836995244 836196423 835091710 833609343 831631005 829002857 825313985 820049465 814048946
1578.7H14048946o620467p436156o406427l344416j01030J263261k8551l530681q271754
$$ 814048946 807428479 799992323 793585896 790241480 790140450 791403711 791375160 787844479 779572725
1597G79572725j3172567j7274022j8298983j3161183j988232J0259032J6636372J5231431
$$ 779572725 766400158 749126136 730827153 717665970 715677738 725936770 742573142 757804573
1613.4G57804573J1393129P700026L110648l96252k991319m923999n961001n636156
$$ 757804573 769197702 776897728 780008376 779612124 776620805 771696806 765735805 760099649
1629.7G60099649l159284N58019M768371O664336O415725O189048N517900N242944
$$ 760099649 756940365 757498384 762266755 768931091 775346816 781535864 787053764 792296708
1646G92296708M696071L032744K729475L048778J625538R22024J030922J174092R31740
$$ 792296708 796992779 800025523 802754998 805803776 807429314 808351338 809382260 810556352 811488092
1664.3H11488092L26812k41220p35700j124442j724898k467394k610386k510786k919972
$$ 811488092 811814904 811573684 810837984 809713542 807988644 805521250 802910864 800400078 797480106
1682.7G97480106l869533l644824l043652l273308l413558l648281l807664m107118
$$ 797480106 793610573 789965749 786922097 783648789 780235231 776586950 772779286 768672168
1699G68672168n326032n851746o865680q540631q518099p287085n434394k988935K35319
$$ 768672168 763346136 757494390 750628710 742088079 733569980 726282895 720848501 717859566 718094885
1717.4G18094885K841354K453029q90374q033574j8581390k9662550l6795556m0174842
$$ 718094885 720936239 723389268 722498894 714465320 695883930 666221380 629425824 589250982
1733.7E89250982k6897431K634585L2310725N0622403M8734367L7750661K6476682
$$ 589250982 562353551 564988136 597298861 647921264 696655631 734406292 760882974
1748G60882974J8719613J2929201P984698N401254M337430L287375K463341J710414
$$ 760882974 779602587 792531788 800516486 805917740 810255170 813542545 816005886 817716300
1764.3H17716300J461268J396060J073301J049101J117766Q69393P05779Q95739J042008
$$ 817716300 819177568 820573628 821646929 822696030 823813796 824683189 825388968 826284707 827326715
1782.6H27326715Q87752N92053O33120Q98063Q45850M59909M24922N92589M33147K22921
$$ 827326715 828214467 828806520 829439640 830337703 831183553 831643462 832068384 832660973 833094120 833317041
1803H33317041L15130M33266K80023K34485L56912L14892R9957J13010L69191L89397
$$ 833317041 833632171 834065437 834345460 834579945 834936857 835251749 835351706 835464716 835833907 836223304
1823.4H36223304J44065O4969K60114Q7977k54393j18673J65165M8756m3809L18170
$$ 836223304 836367369 836432338 836692452 836780429 836526036 836407363 836572528 836621284 836577475 836895645
1843.8H36895645L97622o8247k34187L8207J39654p0036j36197L8445j2278k61426
$$ 836895645 837293267 837225020 836990833 837029040 837168694 837098658 836962461 837000906 836988628 836727202
1864.2H36727202k16425M9592m8221m11927m04835k08497k96831n05209l87728j85073
$$ 836727202 836510777 836560369 836512148 836100221 835695386 835486889 835190058 834684849 834297121 834112048
1884.6H34112048k89023m08828k69294j76728k92599k89023k9206J49012O3300P7903
$$ 834112048 833823025 833414197 833144903 832968175 832675576 832386553 832357347 832506359 832569659 832647562
1905H32647562K63333K18511l6955o9976R6739J10805k8849k6643P3671o4313k43903
$$ 832647562 832910895 833129406 833092451 833022475 833119214 833230019 833201170 833174527 833248198 833183885 832939982
1927.5H32939982j59323k4378r8884j85430q2970l6895j75774k47121j14024n3525
$$ 832939982 832780659 832756281 832657397 832471967 832388997 832352102 832176328 831929207 831815183 831761658
1947.9H31761658j67906k12371j20283j12056k00272j36912J5438k0087j53065j10984
$$ 831761658 831593752 831381381 831261098 831149042 830948770 830811858 830827296 830807209 830654144 830543160
1968.3H30543160j1384j02103k33829j48952j6689q5950j61290m0353L3617j21712
$$ 830543160 830531776 830429673 830195844 830046892 830030203 829944253 829782963 829742610 829776227 829654515
1988.7H29654515k14279r9718p6771k02596k05934j05858j65403l53873m22299m06861
$$ 829654515 829440236 829340518 829263747 829061151 828855217 828749359 828583956 828230083 827807784 827400923
2009H27400923n37276p37012p15554m98771l54231k29239K2769J88708J31726Q2195
$$ 827400923 826863647 826126635 825411081 824912310 824558079 824328840 824351609 824540317 824672043 824754238
2029.4H24754238J56403J70111N7042R537Q3506R2864j19k4736L3259R597r2984r9063
$$ 824754238 824910641 825080752 825137794 825147331 825230837 825323701 825323582 825298846 825332105 825341702 825248718 825149655
2053.9H25149655j2278j8835j11044j08003m4763j16766k22504j72436j16408k00153
$$ 825149655 825137377 825118542 825007498 824899495 824854732 824737966 824515462 824343026 824226618 824026465
2074.3H24026465k44557j34826q8096j80840j63973O795R7811N5790N8711J34170J09255
$$ 824026465 823781908 823647082 823558986 823378146 823214173 823220968 823318779 823374569 823433280 823567450 823676705
2096.8H23676705K027o437M9829K5869l8207k146M0472n1260j37210r1613l5107p3552
$$ 823676705 823678732 823672295 823722124 823747993 823709786 823707640 823748112 823696852 823559642 823468029 823432922 823359370
2121.2H23359370r4116j6331p153j29401j55867m2617l1233j28209j17600m2737p7247
$$ 823359370 823265254 823248923 823241770 823112369 822956502 822913885 822882652 822754443 822636843 822594106 822516859
2143.7H22516859j61291j22428n066m351n6446Q524Q0883J3233o6519l0935N066m2379
$$ 822516859 822355568 822233140 822228074 822223723 822167277 822175801 822256684 822269917 822203398 822172463 822177529 822135150
2168.1H22135150m5478M2737M2796p7784j19031m2677l6835j09136p2420K5630k2411
$$ 822135150 822089672 822132409 822175205 822097421 821978390 821935713 821898878 821789742 821717322 821742952 821720541
2190.6H21720541j33336j02937k4200o0618j19328o6757k5630j04905j62899j08838
$$ 821720541 821587205 821484268 821460068 821399450 821280122 821213365 821187735 821082830 820919931 820811093
2211H20811093p9215j42812j57774q1122r1314k02537j82450n4657o7353j84238j63853
$$ 820811093 820731878 820589066 820431292 820350170 820258856 820056319 819873869 819819212 819751859 819567621 819403768
2233.4H19403768p4268j69098l22402k74121j69814k15411k52128j54972j01030j87278
$$ 819403768 819329500 819160402 818838000 818563879 818394065 818178654 817926526 817771554 817670524 817483246
2253.8H17483246k41398j65701j15753j77443k04801j28567j26362k65599l51727l00049
$$ 817483246 817241848 817076147 816960394 816782951 816578150 816449583 816323221 816057622 815705895 815405846
2274.2H15405846k49625j96099n0306K3424j21712l05116l05295k27869k67208l11076
$$ 815405846 815156221 814960122 814909816 814933240 814811528 814506412 814201117 813973248 813706040 813394964
2294.6H13394964k60771k84373m21226n05150n00142n45442o64652o85036n73754o01292
$$ 813394964 813134193 812849820 812428594 811923444 811423302 810877860 810213208 809528172 808954418 808353126
2315H08353126q85785j072824r28402p04765o59764p29024o76334m33028k67505k50042
$$ 808353126 807467341 806394517 805466115 804761350 804101586 803372562 802696228 802263200 801995695 801745653
2335.4H01745653j82688j13547J8656N57244J244784Q62360m07160j316130j415253
$$ 801745653 801562965 801449418 801468074 802025318 803270102 804132462 803725302 802409172 800993919
2353.7H00993919j098454o96063j03354M69267Q06809J010954J206458J330554J285196
$$ 800993919 799895465 799199402 799096048 799565315 800372124 801383078 802589536 803920090 805205286
2372.1H05205286J198470J142085R59873O74784M77314L39031J17004o4730o0916l0399
$$ 805205286 806403756 807545841 808505714 809180498 809657812 809996843 810113847 810049117 809988201 809957802
2392.5H09957802j17421k30849k38180j81079k01285k53081k25484k00749k51889k89857
$$ 809957802 809840381 809609532 809371352 809190273 808988988 808735907 808510423 808309674 808057785 807767928
2412.9H07767928k43426j79469j58906j08242j2637k1040j39356j63614p5758o1095
$$ 807767928 807524502 807345033 807186127 807077885 807065248 807044208 806904852 806741238 806665480 806604385
2433.3H06604385j13666q7797l6657r9600j96039j77860j14501j31667j81853j58370
$$ 806604385 806490719 806402922 806366265 806266665 806070626 805892766 805778265 805646598 805464745 805306375
2453.7H05306375j18017j72317k49863k45273k08318k34127k63572k31087k70367m07517
$$ 805306375 805188358 805016041 804766178 804520905 804312587 804078460 803814888 803583801 803313434 802905917
2474.1H02905917m05609j96696n0664j00136j53064j14084j30355k12788j97471j15513
$$ 802905917 802500308 802303612 802252948 802152812 801999748 801885664 801755309 801542521 801345050 801229537
2494.5H01229537j45078k30014j85073j03414j62184k63214k41638j87218k25842k77757
$$ 801229537 801084459 800854445 800669372 800565958 800403774 800140560 799898922 799711704 799485862 799208105
2514.9G99208105k77400l12865m28081m65512l30806j86741j32442m3153P8916M7088
$$ 799208105 798930705 798617840 798189759 797724247 797393441 797206700 797074258 797031105 797110021 797157109
2535.3G97157109j09315k00093k38597l51489m88818m96327m16697l84867l45468k53201
$$ 797157109 797047794 796847701 796609104 796257615 795768797 795272470 794855773 794470906 794125438 793872237
2555.6G93872237k08258k45214k66612k14636k29895l64423m21762l48687k98977l37065
$$ 793872237 793663979 793418765 793152153 792937517 792707622 792343199 791921437 791572750 791273773 790936708
2576G90936708l76880l76284m16636m90845m89950m37677m62412n38052n13017m23968
$$ 790936708 790559828 790183544 789766908 789276063 788786113 788348436 787886024 787347972 786834955 786410987
2596.4G86410987m07278m28736m06623l84748m21584m77135n13315n78821o82592p30634
$$ 786410987 786003709 785574973 785168350 784783602 784362018 783884883 783371568 782792747 782110155 781379521
2616.8G81379521p12156p20203p55608p40230o89686o93858p01725n72860l48211j64687
$$ 781379521 780667365 779947162 779191554 778451324 777761638 777067780 776366055 775793195 775444984 775280297
2637.2G75280297o0260j4127k2888j01387k00034k30670j87456j41561j15574o9916
$$ 775280297 775220037 775205910 775183022 775081635 774881601 774650931 774463475 774321914 774206340 774136424
2657.6G74136424l9279q9884j31548o9797J788N3168J42395K23398K08080R6798k5213
$$ 774136424 774097145 774007261 773875713 773805916 773807704 773860872 774003267 774226665 774434745 774531543 774506330
2680.1G74506330j24931k13265k70069k88188l07203l80099m85658n56112o06238o66619
$$ 774506330 774381399 774168134 773898065 773609877 773302674 772922575 772436917 771880805 771274567 770607948
2700.5G70607948o86586o41107o11961o59406p21932p24554p10487p38263p50780p61748
$$ 770607948 769921362 769280255 768668294 768008888 767286956 766562402 765851915 765113652 764362872 763601124
2720.9G63601124q42571r12309r08911q45611p21097n84066m89116m60445n00680n40018
$$ 763601124 762758553 761846244 760937333 760091722 759370625 758786559 758297443 757836998 757336318 756796300
2741.2G56796300m99665l84569l35038m48704o17266p48753q42810r31680j048327
$$ 756796300 756296635 755912066 755577028 755128324 754511058 753762305 752919495 751987815 750939488
2759.6G50939488j127660j160025j223267j296818j337707j380145j495123j712382
$$ 750939488 749811828 748651803 747428536 746131718 744794011 743413866 741918743 740206361
2775.9G40206361j935363k090156k227902k365351k488077k661586k908170l106832
$$ 740206361 738270998 736180842 733952940 731587589 729099512 726437926 723529756 720422924
2792.2G20422924l200710l264070l369987l541410l740191l948808m158735m381716
$$ 720422924 717222214 713958144 710588157 707046747 703306556 699357748 695199013 690817297
2808.6F90817297m763544n283177n718231o140053o768883p615447q656740r959459
$$ 690817297 686053753 680770576 675052345 668912292 662143409 654527962 645871222 635911763
2824.9F35911763j1571944j3577879j6186058j9689858k4416924l0762553l9238095
$$ 635911763 624339819 610761940 594575882 574886024 550469100 519706547 480468452
2839.1D80468452m9793512o0608416o6166401n6256041k4996549J6733780M8791498
$$ 480468452 430674940 370066524 303900123 247644082 222647533 239381313 288172811
2853.4B88172811O1224431N8147073M7730714L5368890K3622930J3871192O991268
$$ 288172811 349397242 407544315 455275029 490643919 514266849 528138041 535129309
2867.7E35129309L306389J848459K69651k993285p132352j0584056j2727320j3726682
$$ 535129309 538435698 540284157 540553808 537560523 530428171 519844115 507116795 493390113
2884D93390113j3936281j3614953j2984872j2292593j1753202j1561334j1838138j2649775
$$ 493390113 479453832 465838879 452854007 440561414 428808212 417246878 405408740 392758965
2900.3C92758965j4360427j7556250k2576094k9244036l6392003m0951356l8175225
$$ 392758965 378398538 360842288 338266194 309022158 272630155 231678799 193503574
2914.6A93503574k5765598p886023Q603394K0265803K6780352K8936044K8517276K7478724
$$ 193503574 167737976 159851953 168455347 188721150 215501502 244437546 272954822 300433546
2930.9C00433546K6735485K5916040K4331331K2167385K0307183J8693388J5900224
$$ 300433546 327169031 353085071 377416402 399583787 419890970 438584358 454484582
2945.2D54484582J0969549M972279M05312q68171J126408M917979Q800865J1699169
$$ 454484582 465454131 470426410 470831722 469963551 471089959 476007938 484808803 496507972
2961.5D96507972J3279230J3775647J3641774J3187945J2626767J1976362J1151909
$$ 496507972 509787202 523562849 537204623 550392568 563019335 574995697 586147606
2975.8E86147606J0321558R508252Q523643P505596O704807O100535N556345M886270
$$ 586147606 596469164 605977416 614501059 622006655 628711462 634811997 640368342 645254612
2992.1F45254612M109800L520489L055810K622843K405465K271533K062738J931488
$$ 645254612 649364412 652884901 655940711 658563554 660969019 663240552 665303290 667234778
3008.4F67234778J902879J729607J341999J012027R12488R07480Q54910P65443O73771
$$ 667234778 669137657 670867264 672209263 673221290 674133778 675041258 675896168 676661611 677335382
3026.8F77335382O05821N59270N26548M65155M27544N73277P64132P48276N56052M35770
$$ 677335382 677941203 678500473 679027021 679492176 679919720 680492997 681257129 682005405 682561457 682997227
3047.2F82997227M60744L72171J37568R53k7001l8206k563J21653K79367K45511M0472
$$ 682997227 683457971 683830142 683967710 683968663 683941662 683903456 683900893 684022546 684301913 684547424 684587896
3069.6F84587896J6093K45869N05090N66900L95059K47121K09630J60277K27093L32594
$$ 684587896 684603989 684849858 685354948 685921848 686316907 686564028 686773658 686933935 687161028 687493622
3090F87493622K40326J86622L47138M88341M12643K31802K44379M11928L49998R4533
$$ 687493622 687733948 687920570 688267708 688756049 689168692 689400494 689644873 690056801 690406799 690501332
3110.4F90501332J17004L31164K55525l5763l25501n50628n18918k74539j24633k22445
$$ 690501332 690618336 690949500 691205025 691169262 690843761 690293133 689774215 689499676 689375043 689152598
3130.8F89152598l92735l76939k18034k51413n31315o77109o03378n64516n29766m51862
$$ 689152598 688759863 688382924 688164890 687913477 687382162 686705053 686101675 685537159 685007393 684555531
3151.2F84555531o09041r00149r14335p59960p08401p52449p75277p42019p35283p73668
$$ 684555531 683946490 683046341 682132006 681372046 680663645 679911196 679135919 678393900 677658617 676884949
3171.6F76884949p95662p94590p96675q26836q69513q66293q20160p48039o65605o15537
$$ 676884949 676089287 675294697 674498022 673671186 672801673 671935380 671115220 670367181 669701576 669086039
3192F69086039o28471o33836n56707n01156n06759m97758m74632m75824m90546m80116
$$ 669086039 668457568 667823732 667267025 666765869 666259110 665761352 665286720 664810896 664320350 663840234
3212.4F63840234m65154m69566m73737m74751m68195m61340m58121l79384k13444j82688
$$ 663840234 663375080 662905514 662431777 661957026 661488831 661027491 660569370 660189986 659976542 659793854
3232.8F59793854l99292n22315l92437l03626k50399q6666q0585k96652l11137n9604
$$ 659793854 659394562 658872247 658479810 658176184 657925785 657839119 657758534 657461882 657150745 657091141
3253.2F57091141M1842j09076j90437q7083J3531L8683J19686K45989J54376r0123
$$ 657091141 657132983 657023907 656833470 656746387 656759918 656798601 656918287 657164276 657318652 657228529
3273.6F57228529j72078j34766j11997o9321k026J4424l934K5571K1159q3267k53201
$$ 657228529 657056451 656921685 656809688 656740367 656738341 656752765 656748831 656774402 656795561 656712294 656459093
3296F56459093m39644m36127j78337K8372j34766n67913q73447q66055o85335n75244
$$ 656459093 656019449 655583322 655404985 655433357 655298591 654730678 653857231 652991176 652305841 651730597
3316.4F51730597o14285p06792p14302o93322q75711j097202j087070r96828r38833
$$ 651730597 651116312 650409520 649695218 649001896 648126185 647028983 645941913 644945085 644006252
3334.8F44006252r08911j047015j255870j347065j368523j262068j123309j315117
$$ 644006252 643097341 642050326 640794456 639447391 638078868 636816800 635693491 634378374
3351.1F34378374j662314j691699j527608j508295j591981j574218j418054j351655
$$ 634378374 632716060 631024361 629496753 627988458 626396477 624822259 623404205 622052550
3367.4F22052550j550316j827419j844406j599610j377404j302362j315176j286447
$$ 622052550 620502234 618674815 616830409 615230799 613853395 612551033 611235857 609949410
3383.7F09949410j170635r83119p68066q00490j069129j069247p56741o53446r39488
$$ 609949410 608778775 607795656 607027590 606227100 605157971 604088724 603331983 602678537 601739049
3402.1F01739049j151741r61721p08699o60717p07329p59363p30276n75483m51624
$$ 601739049 600587308 599625587 598916888 598256171 597548842 596789479 596059203 595483720 595032096
3420.4E95032096m37498l88026k47956j39117j40667r3162K4140n6327k17378j44601
$$ 595032096 594594598 594206572 593958616 593819499 593678832 593585670 593609810 593553483 593336105 593191504
3440.8E93191504K6823J39176K39909K78115K91706L93211N75543P77602R31382R78172
$$ 593191504 593218327 593357503 593597412 593875527 594167233 594560444 595135987 595913589 596844971 597823143
3461.2E97823143R74536J022875J047492R49562Q49724Q75115Q94368Q19146Q01027
$$ 597823143 598797679 599820554 600868046 601817608 602667332 603542447 604436815 605255961 606056988
3479.6F06056988Q36611P79331P31349P71463P85410P69675Q35061R65059R62317R32455
$$ 606056988 606893599 607672930 608404279 609175742 609961152 610730827 611565888 612530947 613493264 614425719
3500F14425719J083374J098573Q98957R13859J144886J275122J173198J017392J035988
$$ 614425719 615509093 616607666 617506623 618420482 619565368 620840490 622013688 623031080 624067068
3518.3F24067068J208186J381040J312375J134992J158058J202762J237810J432598
$$ 624067068 625275254 626656294 627968669 629103661 630261719 631464481 632702291 634134889
3534.6F34134889J497566J280785J199067J386344J536012J372516J101196J213193
$$ 634134889 635632455 636913240 638112307 639498651 641034663 642407179 643508375 644721568
3551F44721568J450896J356304J252293J344800J309216J127541J458168K184272J942217
$$ 644721568 646172464 647528768 648781061 650125861 651435077 652562618 654020786 656205058 658147275
3569.3F58147275J179517J135885J447082J603365J682878J656055J500964J667440
$$ 658147275 659326792 660462677 661909759 663513124 665196002 666852057 668353021 670020461
3585.6F70020461K086103J715601J052260J143336J346410J176476J067758J014948
$$ 670020461 672106564 673822165 674874425 676017761 677364171 678540647 679608405 680623353
3601.9F80623353Q83221J179278J949191K190352J941383J729249J420200J741231
$$ 680623353 681506574 682685852 684635043 686825395 688766778 690496027 691916227 693657458
3618.3F93657458K108157J220285K37823N36799K246023K453029P52389L11792N37336
$$ 693657458 695765615 696985900 697223723 697760522 700006545 702459574 703211963 703523755 704061091
3636.6G04061091N53608N36919K86340K7538O72042K134621J843810l7074j18375R15706
$$ 704061091 704614699 705151618 705437958 705465496 706137538 708272159 710115969 710078895 709960520 710876226
3657G10876226O66917M1306j19269m07338l56019N57184N18918k92003O88374J019776
$$ 710876226 711543143 711584449 711465180 711057842 710701823 711259007 711777925 711485922 712174296 713194072
3677.4G13194072j33812m08709m41432l08812P93755J628459O80446k68817l57151
$$ 713194072 713060260 712651551 712210119 711901307 712695062 714323521 715003967 714735150 714377999
3695.8G14377999k61664N0306N62608K87056m26948l12924N99682J227558K87771p87258
$$ 714377999 714116335 714166641 714729249 715016305 714589357 714276433 714876115 716103673 716391444 715604186
3716.2G15604186p21216k40326k98Q8632P391n71549p66814M2618J001179J052916
$$ 715604186 714882970 714642644 714642346 714730978 714738369 714166820 713400006 713442624 714443803 715496719
3736.5G15496719j92464j425743o33895J155913K29955n67198R73701R88663n18203
$$ 715496719 715304255 713878512 713244617 714400530 714630485 714063287 715036988 716025651 715507448
3754.9G15507448o60956J13606J21415l81708k86281p9871J87755K80440k81096n54978
$$ 715507448 714846492 714960098 715081513 714699805 714413524 714333653 714521408 714801848 714520752 713965774
3775.3G13965774j20700L44575M2975l26276j28329o0320k33233m16219m44353k10404
$$ 713965774 713845074 714189649 714232624 713906348 713778019 713717699 713484466 713068247 712623894 712413490
3795.7G12413490l14593l8803P85828J6093m33028J60038n06103j245439o08027M56453
$$ 712413490 712098897 712060094 712845922 712862015 712428987 712589025 712082922 710837483 710229456 710685909
3816.1G10685909J92880K57254P52688k63513p27057m49717l36111k07841j72794L06666
$$ 710685909 710878789 711136043 711888731 711625218 710898161 710448444 710112333 709904492 709731698 710038364
3836.5G10038364P70807J41502l44932l35455p95663j454890j027166J506924K442718
$$ 710038364 710809171 710950673 710605741 710270286 709474623 708019733 706992567 708499491 710942209
3854.8G10942209l54111j540006r00209p0870M0114m42624l4570M62234J9610l62516
$$ 710942209 710588098 709048092 708147883 708077013 708117127 707674503 707639933 708102167 708121777 707759261
3875.2G07759261o89089k93315K16544k0742J78039j49012n50628J18316k8968q22127
$$ 707759261 707070172 706776857 706993401 706972659 707150698 707001686 706451058 706569374 706540406 705718279
3895.6G05718279n61297J80542M42684M46677Q2016n43594o31452m28199l28482j1325
$$ 705718279 705156982 705337524 705780208 706226885 706308901 705765307 705133855 704705656 704377174 704365849
3916G04365849K77818O6876j90973j14083j25707k54452L3856L81291J30414k65121
$$ 704365849 704643667 704710543 704519570 704405487 704279780 704025328 704059184 704440475 704570889 704305768
3936.4G04305768l20673j44839R1374N7339j08599o6817q1599j92761j83106j28150
$$ 704305768 703985095 703840256 703931630 703988969 703880370 703813553 703731954 703539193 703356087 703227937
3956.8G03227937j24335j12593j14918k05815k49982j98543j72496j21355m2557j14620
$$ 703227937 703103602 702991009 702876091 702670276 702420294 702221751 702049255 701927900 701885343 701770723
3977.2G01770723k35856j45435J6093j8954j11759m3630J8417o6220j32501j11163
$$ 701770723 701534867 701389432 701405525 701386571 701274812 701231182 701249599 701183379 701050878 700939715
3997.6G00939715
$$ 700939715
##END=$$ End of the data block
