##TITLE=Wax aquecido $$ Begin of the data block
##JCAMP-DX=5.00 $$ ACD/SpecManager v 10.08
##SPECTROMETER/DATA SYSTEM=Alpha
##DATE=02 Sep 2014 09:46:38
##DATA TYPE=INFRARED SPECTRUM
##DATA CLASS=XYDATA
##ORIGIN=
##OWNER=
##NPOINTS=1765
##FIRSTX=399.76428223
##LASTX=3997.64306641
##MAXX=3997.64306641
##MINX=399.76428223
##MAXY=0.85259998
##MINY=0.39111599
##XFACTOR=1.0000000000
##YFACTOR=1.000000000000000e-9
##FIRSTY=0.79178697
##DELTAX=2.03961372
##XUNITS=1/CM
##YUNITS=ARBITRARY UNITS
##XYDATA=(X++(Y..Y))
399.8G91786969q22127r24707L18468J089215k52068j276254n57185r9718q31425r61900
420.2G87469268k04265n32031q26300J68264L52621p88629n61475J031458J181722
438.5G87290633M09722Q59380J093924j92106n34177O02484L80993q18253n14447M9710
458.9G88627863j179218j996875m53592P99835J67787R7990P87199J32203q13484j81079
479.3G85988629L86774p07626j408637o57558l69668o41942J52648J106798L32475
497.7G84181893p77185l67701j98424j892626l371954l417254l993511m898369l473580
516G61791289o12438K79248o5267J170456K847374K953589L087043L869474K839983
534.4G78160751L73006l33965L85106k17081j210987l40998L27289j121223j887441
$$ y = [791786969, 790964842, 790040135, 790358603, 791447818, 791195750, 789919496, 789362311, 789262593, 788431168, 787469268, 787265003, 786732972, 785906672, 786074936, 786427557, 785638928, 785077453, 786108911, 787290633, 787700355, 788559735, 789653659, 789461553, 788927376, 789529860, 789910853, 789092600, 788578153, 788627863, 787448645, 785451770, 784998178, 785798013, 785965800, 786063790, 786850989, 786983192, 786169708, 785988629, 786375403, 785667777, 784259140, 783601582, 783231914, 782589972, 782742620, 783849418, 784181893, 783404708, 783037007, 782838583, 780945957, 777574003, 774156749, 770163238, 765264869, 761791289, 761178851, 761458099, 761392832, 762563288, 765410662, 768364251, 771451294, 775320768, 778160751, 778533757, 778199792, 778584898, 778367817, 777156830, 776815832, 777143121, 776021898, 774134457]
552.7G74134457n36382o7949j385868j591682o49274j261294k508640j740098n21362
571.1G63871908j178086j829862q48651m15087j227617l76582K245545L452718L147304
589.4G66841590L903270M997611L974140K337396K462149K535283Q95560l6001P24137
607.8G88635135M93407j147687j488626n35310p63178j737535j298666n53488j453579
626.2G80150473k051830l45886J784325K613127L459036M962206N026221L373564K694368
644.5H01665604L009975K010167N97536R04978J528918O05584j69337O74784J136959
662.9H11965168J03056p99179j16587K42353p44284q64446k6524j56998q24213k23637
683.3H08554709P33495L69310l52979k13086l39926j530766k286136k001465k486050
$$ y = [774134457, 773598075, 773530126, 772144258, 770552576, 769903302, 768642008, 766133368, 764393270, 763871908, 762693822, 760863960, 760015309, 759600222, 758372605, 757996023, 760241568, 763694286, 766841590, 770744860, 775742471, 779716611, 782054007, 784516156, 787051439, 787946999, 787910998, 788635135, 789128542, 787980855, 786492229, 785956919, 785193741, 783456206, 782157540, 781604052, 780150473, 778098643, 777752757, 779537082, 782150209, 785609245, 790571451, 795597672, 798971236, 801665604, 804675579, 806685746, 807283282, 808188260, 809717178, 810322762, 810153425, 810828209, 811965168, 812068224, 811269045, 811152458, 811394811, 810650527, 809786081, 809759557, 809602559, 808778346, 808554709, 809288204, 809657514, 809304535, 809091449, 808751523, 807220757, 804934621, 802933156, 800447106]
701.6H00447106m309475n739272o669223q999944j3953328k3904920m0352344m6113908
717.9F50404692j7237902K2752762K7582347P45058k2826850j2541175K4862766M5460582
734.3G19202280L5534620J9170463R466172M747688L067792K719998J665414J52290
750.6G95726717o9798K13624m53055j062870r38118j162887k214610k892792k132416
768.9G85013795r69112p42555q13901l00944L93868J291811L252685N710840O629050
787.3G99465537N648553M576862L976405K684474P85351n31793j260638j590252p62999
805.6H12991500Q81433J435340K06888j329124k182305l385067n911768q981287j1551440
824G82174170j3137996j2519181q256614r40919O380200J1116267J3070762J2601018
$$ y = [800447106, 796137631, 790398359, 783729136, 774729192, 760775864, 736870944, 696518600, 650404692, 633166790, 655919552, 683501899, 684246957, 661420107, 648878932, 673741698, 719202280, 754736900, 773907363, 783373535, 788121223, 791189015, 793909013, 795574427, 795726717, 795656919, 795870543, 795417488, 794354618, 793416500, 792253613, 790039003, 787146211, 785013795, 784044683, 783302128, 782488227, 782187283, 782581151, 783872962, 787125647, 792836487, 799465537, 805114090, 809690952, 813667357, 816351831, 817137182, 816605389, 815344751, 813754499, 812991500, 813872933, 815308273, 815515161, 814186037, 812003732, 808618665, 802706897, 793725610, 782174170, 769036174, 756516993, 748260379, 747319460, 753699660, 764815927, 777886689, 790487707]
840.3G90487707J0100126P344007N808115M896164L741622K731741K207756J454770
856.6H28772008M89653P34627K128005K775133K246260J677990J260281L99470p03931
875H39779496j417339j958251k867341l773868l936529l116667j559317N6624P67112
893.4H21973920r5308k023041l493309m007042m594326n528569n923748n831182o324947
911.7G84152448p515788q335888p739604n026460o29782L070831M033387L000021J920104
930.1G66929269J379430P29203o2525k60055j07288q08299k427459l603995m016280
948.4G57752001m629016m891276k537906L138602R507238J2951255J2049377Q018315
964.7G91358590L418267N96166j63556r65833l464282o652832q547127p980168m695475
$$ y = [790487707, 800587833, 807931840, 813739955, 818636119, 822377741, 825109482, 827317238, 828772008, 829261661, 829996288, 832124293, 834899426, 837145686, 838823676, 840083957, 840483427, 839779496, 838362157, 836403906, 833536565, 829762697, 825826168, 822709501, 821150184, 821206808, 821973920, 821878612, 819855571, 816362262, 812355220, 807760894, 802232325, 796308577, 790477395, 784152448, 776636660, 768300772, 760561168, 755534708, 754904926, 757975757, 762009144, 765009165, 766929269, 768308699, 769037902, 768975377, 768715322, 768608034, 767799735, 765372276, 761768281, 757752001, 753122985, 748231709, 745693803, 748832405, 758339643, 771290898, 783340275, 791358590, 794776857, 795373023, 795209467, 794243634, 790779352, 784126520, 775579393, 767599225, 762903750]
983.1G62903750r3460L173888L751516K546191J059294l64125k182364l996313m769504
1001.4G62028873m866540n679548p180155q022368p861495p780790q168399q191109
1017.8G04278469p295847n256176k000153J759946M810632O303847O059527M418611
1034.1G13078856K564431J853883K008378J962305J613378J046062K2411j445353k909899
1052.4G19794452l643870l393054k878487k680779k383947j599610n80788L67165J170337
1070.8G04171419J751363K211512K758562K923668K037167L52204j314402k444207
1087.1G12447286k878130k704263k168536j672446j732708k264320k483189k047360
1103.4F94496334j501978j382112j491130j160025o8128J277864K138257K323448K103508
$$ y = [762903750, 762810290, 765984178, 769735694, 772281885, 773341179, 772977054, 770794690, 766798377, 762028873, 757162333, 751482785, 744302630, 736280262, 728418767, 720637977, 712469578, 704278469, 696982622, 691726446, 689726293, 691486239, 696296871, 702600718, 708660245, 713078856, 715643287, 717497170, 719505548, 721467853, 723081231, 724127293, 724149704, 722704351, 719794452, 716150582, 712757528, 709879041, 707198262, 704814315, 703214705, 702633917, 703001082, 704171419, 705922782, 708134294, 710892856, 713816524, 715853691, 716205895, 714891493, 712447286, 709569156, 706864893, 704696357, 703023911, 701291203, 699026883, 696543694, 694496334, 692994356, 691612244, 690121114, 688961089, 688892961, 690170825, 692309082, 694632530, 696736038]
1121.8F96736038J830280J576364J173853Q53062Q27074N64873l15725j426936k358257
1140.1F99460626l119171l984094n339145p400573r878635j2225211j3982355j4638782
1156.5F28892660j3868868j1967778r752453p974505o436885m120350q70764K346814
1172.8E76247871N530834R955347J4211833J2836456M696548k035558J7107P485032
1189.1F28945470J1357009P844687Q00431l682316l487110m56095K682209L390253
1205.4F47394538J845956P73668J047731J239359Q02457M87924L05652j44839m04775
1223.8F53347671m87685r63688j835883k426684k003610j321137j410901k217651l398716
1242.1F37281716m376888m320741k769947n70536J087368K390504L591001L939867
$$ y = [696736038, 698566318, 700142682, 701316535, 702169597, 702996671, 703561544, 703245819, 701818883, 699460626, 696341455, 692357361, 687018216, 679617643, 669739008, 657513797, 643531442, 628892660, 615023792, 603056014, 593303561, 585329056, 578892171, 574771821, 573901057, 576247871, 581778705, 591734052, 605945885, 618782341, 623478889, 621443331, 621460438, 628945470, 640302479, 648147166, 648947597, 645265281, 641778171, 641322076, 644004285, 647394538, 649240494, 650014162, 651061893, 652301252, 653103709, 653591633, 653897285, 653752446, 653347671, 652859986, 651896298, 650060415, 647633731, 645630121, 644308984, 642898083, 640680432, 637281716, 632904828, 628584087, 625814140, 625243604, 626330972, 628721476, 632312477, 636252344]
1258.4F36252344L890276M827022O050408O030798N013347L784060K622545J954138
1274.8F70424938J782298J555443J286090J364409J709104K227366L238022N084455
1291.1F88672125O846786O758511M968822K852678Q78692m61638k61962J183152K606392
1309.4G14043558L369748L272414K167523J072348J525044K691567K140105j70291
1325.8G30112016j707792k44141L688813O255745M801035J301289q71420n81086K15769
1344.1G42970228m93884j885414j882434m42147O43492N45382l3080p31886j605630
1362.5G37084627j758814j042902j195371l240407o123006o911218k622366M503488
1378.8G18694031R288907R355486O725371L985285J503289n41210j986146k185464
$$ y = [636252344, 640142620, 644969642, 651020050, 657050848, 662064195, 665848255, 668470800, 670424938, 672207236, 673762679, 675048769, 676413178, 678122282, 680349648, 683587670, 688672125, 695518911, 702277422, 707246244, 710098922, 710977614, 710515976, 710254014, 711437166, 714043558, 717413306, 720685720, 722853243, 723925591, 725450635, 728142202, 730282307, 730112016, 728404224, 728160083, 731848896, 738104641, 742905676, 744206965, 743335545, 742754459, 742970228, 742476344, 740590930, 738708496, 738266349, 738909841, 739455223, 739422143, 738690257, 737084627, 735325813, 734282911, 733087540, 729847133, 723724127, 716812909, 714190543, 718694031, 727982938, 737338424, 744063795, 748049080, 749552369, 749011159, 747025013, 744839549]
1395.1G44839549K4974L173531M465162L443599J044333k753735p327616j0272324
1411.4G36637473q268058k440751K590478M454195L379405J688361J89781j334488
1427.7G36896396k941907m209220m635990n134880n410850m573763m019916l785014
1444.1G02184856m047990n524993p171750p753670p794678j1789203k4459004l2560707
1460.4F01082861k3204684J914680J8820822Q192778j1786044j6775667R893179L5751581
1476.7F23889506L9094508L3114910K5722325J8029928J2646734R662629P544577N385518
1493G75090635L650963K011776n59330l400862o239414j2262762k3401379k6050747
1509.3G08838880k1238029j2921512J834810J7118513K6821912L1866490K6520133
$$ y = [744839549, 744864523, 748038054, 752503216, 755946815, 756991148, 754237413, 746909797, 736637473, 728369415, 725928664, 728519142, 732973337, 736352742, 738041103, 738230884, 736896396, 733954489, 729745269, 725109279, 719974399, 714563549, 709989786, 705969870, 702184856, 698136866, 692611873, 685440123, 677686453, 669891775, 658102572, 633643568, 601082861, 577878177, 579792857, 598613679, 606806457, 595020413, 578244746, 588137925, 623889506, 662984014, 696098924, 721821249, 739851177, 752497911, 762160540, 769705117, 775090635, 778741598, 780753374, 780194044, 776793182, 770553768, 758291006, 734889627, 708838880, 687600851, 674679339, 676514149, 693632662, 720454574, 752321064, 778841197]
1523.6G78841197J6345382J0543764O844282M830956L733933K638042K249480K414763
1539.9H28441799J539230Q13544P20620M85361K09212K18213L95834K94268j95563
1558.3H32922518j022458j244485j563192k069234k757729m109621n196809o671071
1574.6H08287919r533287j0752379j1050463j1485815r548426n326569q47101J237035
1590.9G50980914p29442n989075j2125611j7306268k0790100k0474553j3948799k268433
1607.2F57348633J0068595J7397404J7495274J4462471J0092140L892481r05454m861295
1623.5G24990249p791639q897602p801354m077554O01828N945087R304642R738386
1639.9G22012043R566069Q917093Q998036Q082211N244732M613936M974723K785325
$$ y = [778841197, 795186579, 805730343, 812574625, 817405581, 821139514, 823777556, 826027036, 828441799, 829981029, 830794573, 831515193, 832000554, 832209766, 832427979, 832823813, 833118081, 832922518, 831900060, 830655575, 829092383, 827023149, 824265420, 820155799, 814958990, 808287919, 798754632, 788002253, 776951790, 765465975, 755917549, 750590980, 749743879, 750980914, 750251472, 744262397, 732136786, 714830518, 694040418, 673565865, 659617066, 657348633, 667417228, 684814632, 702309906, 716772377, 726864517, 730756998, 729851544, 724990249, 717198610, 708301008, 700499654, 696422100, 697023928, 702969015, 712273657, 722012043, 731578112, 740495205, 749493241, 757575452, 762820184, 767434120, 772408843, 775194168]
1656.2G75194168J599312J656115J665950R52780N1618n08726j233160k084971l071725
1674.5G74221361l842056l853440l922403m606307n790651n264938m347384m245936
1690.9G38348246l779769m051268m489601m355192n243123n823850o874681q263171
1707.2F95467591p829010o666899n052507k843082l62456J461029Q61288l044963j0682881
1725.5F61308110j9506514k5359154k5394619k2537529j2362897M094958K0937443
1739.8E81179798L4232974L7994027L5409331K9990256K4489701J8591225J2843907
1754.1G74731219R560644P489026N484641M466354L465415K552032K235711K258420
1770.4H12243462K283275J937747J777291K068818K248525K042592K026796K050817
$$ y = [775194168, 776793480, 778449595, 780115545, 781068325, 781119943, 780611217, 779378057, 777293086, 774221361, 770379305, 766525865, 762603462, 757997155, 752206504, 746941566, 742594182, 738348246, 734568477, 730517209, 726027608, 721672416, 716429293, 710605443, 703730762, 695467591, 687638581, 680971682, 675919175, 673076093, 672713637, 674174666, 675035954, 671990991, 661308110, 641801596, 616442442, 591047823, 568510294, 556147397, 560242355, 581179798, 615412772, 653406799, 688816130, 718806386, 743296087, 761887312, 774731219, 784291863, 791780889, 797265530, 801731884, 805197299, 807749331, 809985042, 812243462, 814526737, 816464484, 818241775, 820310593, 822559118, 824601710, 826628506, 828679323]
1786.7H28679323J808286J636028J708627J527369J173139J092612J207352J163363
1803H39996099Q95858Q36194R63688R48906O96718O34730P70867P26462N70297N92053
1823.4H47631872O67631M48704K12789J45971J20998M5001R5547L25977N09501N48303
1843.8H50752294M64082M01556L35872K20895J77920J87159O0200o1988l0101Q35r6023
1866.3H52412701k05458k58147l58939m61340n01156m70937n02049n99981o39140o25194
1886.7H47790360o98804p98941o51836l28720r4473Q7261L54051N10693M95911M63128
1907.1H47128630M75585M65393M04775L61026L42965K63274J39176J19448J01328L3379
1927.5H49834979P74p748k7955m2736n1677p2122p7963q7202r9718j25766j55926j46150
$$ y = [828679323, 830487609, 832123637, 833832264, 835359633, 836532772, 837625384, 838832736, 839996099, 840891957, 841728151, 842691839, 843640745, 844337463, 844972193, 845743060, 846469522, 847039819, 847631872, 848299503, 848748207, 848960996, 849106967, 849227965, 849272966, 849368513, 849694490, 850203991, 850752294, 851216376, 851617932, 851953804, 852174699, 852352619, 852539778, 852599978, 852537990, 852507889, 852508724, 852412701, 852207243, 851949096, 851590157, 851128817, 850627661, 850156724, 849654675, 849054694, 848415554, 847790360, 847091556, 846292615, 845640779, 845312059, 845217586, 845304847, 845658898, 846169591, 846665502, 847128630, 847604215, 848069608, 848474383, 848835409, 849178374, 849441648, 849580824, 849700272, 849801600, 849834979, 849835753, 849828005, 849800050, 849757314, 849705637, 849633515, 849555552, 849468350, 849368632, 849242866, 849086940, 848940790]
1951.9H48940790r7275n7578m4882j8418R536r059l9518j4067l338l2186k8968j192
1976.4H48603845N9j2636N364L3021Q822n1498n6506n1915j28568j97052j81139j81735
2000.9H47790062k91049m36485n53012p22468j017272j308024j337707j026869n52833
2019.2H40544343q7976K78592M45008M36604M18425M29451L94881L43740L37600L30866
2039.6H43871534K81811K16484J72078J52409J31786J18613J14501Q4698K8432q941
2060H45163405j3828m0472r8526j40310j80065k31028k68519k67565k18630j64926
2080.4H43539536j19686k8908J05917K17676K92421L73840M36604L94881L00050K55048
2100.8H45767379K21669J62244J14560J10209J05799N2511N246L8921O2108l516l2008
$$ y = [848940790, 848843515, 848785937, 848741055, 848722637, 848732173, 848723114, 848683596, 848669529, 848666191, 848634005, 848605037, 848603845, 848603904, 848591268, 848596632, 848629653, 848638475, 848586977, 848530471, 848478556, 848349988, 848152936, 847971797, 847790062, 847499013, 847062528, 846509516, 845787048, 844769776, 843461752, 842124045, 841097176, 840544343, 840456367, 840734959, 841179967, 841616571, 842034996, 842464447, 842859328, 843203068, 843540668, 843871534, 844153345, 844369829, 844541907, 844694316, 844826102, 844944715, 845059216, 845143914, 845172346, 845163405, 845149577, 845109105, 845010579, 844870269, 844690204, 844459176, 844190657, 843923092, 843704462, 843539536, 843419850, 843390942, 843496859, 843714535, 844006956, 844380796, 844817400, 845212281, 845512331, 845767379, 845989048, 846151292, 846265852, 846376061, 846481860, 846534371, 846539617, 846578538, 846640646, 846637130, 846605122]
2123.3H46605122K3425M5538p868l5644L994j4127j14321j17123l0637k0862m3273
2145.7H46294224L1650J35482J14858O8128J66833K82944K45452J91152K52544K70010
2166.1H48053277J48355Q4699J69635J72317M4226K9445J24693R5904k5869j2994R0600
2188.5H48974288N9187l7193J2755R2268L2067l1709L6835P3374l5704q2910J0312
2211H49103570j073j51575j69456m8339m2617j29283q1360J6272m7922j42336q3804
2233.4H48222077n9903k48790m33743l93331k72095k47001k04146j04964j29223k41697
2253.8H45887184k02715n5611p5460k28166k31803j46568k54690m58300n07117m84884
2274.2H43241870m68850k98977l1232M3809r3520j71363j05202j04666k13862k41339
$$ y = [846605122, 846628547, 846674085, 846666217, 846630573, 846634567, 846620440, 846506119, 846388996, 846358359, 846337497, 846294224, 846325874, 846461356, 846576214, 846644342, 846811175, 847094119, 847339571, 847530723, 847783267, 848053277, 848201632, 848286331, 848455966, 848628283, 848672509, 848701954, 848826647, 848922551, 848896682, 848883688, 848974288, 849033475, 848996282, 849009037, 849101305, 849133372, 849101663, 849138498, 849211872, 849176168, 849093258, 849103570, 849102497, 848950922, 848781466, 848733127, 848690510, 848561227, 848479867, 848496139, 848448217, 848305881, 848222077, 848162174, 847913384, 847479641, 847086310, 846814215, 846567214, 846363068, 846258104, 846128881, 845887184, 845684469, 845628858, 845553398, 845325232, 845093429, 844946861, 844692171, 844233871, 843726754, 843241870, 842773020, 842474043, 842442811, 842486620, 842393100, 842221737, 842116535, 842011869, 841798007, 841556668]
2294.6H41556668j95503k56658l54647l38376l54945n35548o86646o55770o16968p24136
2315H36837471q57115q89242q63969q23438p27952o10232n32329l84510j14858R2208
2335.4H31126034J96636L04699M32908N90027P40468N59211J89960N4360J55389L78013
2355.8H34727705O77645Q29875Q48592R01281Q83580P73966P16925O36696M37141K75433
2376.2H41708839K64943K55107J24276N543M471O973q4817j49667j15395j28031k40743
2398.6H41651499k91228k40028k68638l71456l66509l23951l90649m24862k64228j8417
2419H38691533J03533J03772J20937J01447j1384o3479k026j1683j00195o5208M828
2441.4H38872075r5189k00450j31726p4148j65999k43306j89841j72496k88725l38852
$$ y = [841556668, 841361165, 841104507, 840749860, 840411484, 840056539, 839520991, 838834345, 838178575, 837561607, 836837471, 835980356, 835091114, 834227145, 833403707, 832675755, 832065523, 831533194, 831148684, 831033826, 831126034, 831322670, 831627369, 832060277, 832650304, 833390772, 833949983, 834139943, 834194303, 834349692, 834727705, 835405350, 836235225, 837083817, 837985098, 838868678, 839642644, 840359569, 840996265, 841433406, 841708839, 841973782, 842228889, 842353165, 842358708, 842363179, 842370152, 842285335, 842135668, 842020273, 841892242, 841651499, 841360271, 841120243, 840851605, 840480149, 840113640, 839789689, 839399040, 838974178, 838709950, 838691533, 838795066, 838898838, 839019775, 839121222, 839109838, 839046359, 839044333, 839032650, 838932455, 838867247, 838872075, 838776886, 838576436, 838444710, 838370562, 838204563, 837961257, 837771416, 837598920, 837310195, 836971343]
2461.8H36971343k58148k88665m66586n61475o18697p43269o53446k26557R5665M292
2482.2H33254457j82510j27375l5048j53183k57552j67549j13606k02716j97768q4817
2502.6H31732333j45734l23474l26157k32160l11911m71294m93109n32925p15554p41064
2523H27438951m43519j34766l3915O2824K24947J82868n0068j88709l26037p04229
2543.4H26028347j084566j105309q57293o39081m79341l16560k75016l86357m46141
2561.8H20438683l58164l62098n64755o76453n59389m84050o20722p35522p21693p87198
2582.2H14568639q71420p92205p29800q82744j056254r77457p88271p38085p23779
2600.5H07008624o44922o58930p98106q71300q88765j067162j320064j361132j272678
$$ y = [836971343, 836713195, 836424530, 835957944, 835396469, 834777772, 834034503, 833381057, 833154500, 833250165, 833254457, 833071947, 832944572, 832909524, 832756341, 832498789, 832331240, 832217634, 832014918, 831817150, 831732333, 831586599, 831263125, 830936968, 830704808, 830392897, 829921603, 829428494, 828895569, 828180015, 827438951, 826995432, 826860666, 826826751, 826889575, 827114522, 827297390, 827247322, 827058613, 826732576, 826028347, 824943781, 823838472, 822981179, 822342098, 821862757, 821546197, 821271181, 820884824, 820438683, 820080519, 819718421, 819153666, 818477213, 817917824, 817433774, 816813052, 816077530, 815355837, 814568639, 813697219, 812905014, 812175214, 811292470, 810236216, 809258759, 808470488, 807732403, 807008624, 806363702, 805704772, 804906666, 804035366, 803146601, 802079439, 800759375, 799398243, 798125565]
2618.9G98125565j345634j520932j506508j371145j342892j233459q44121l78907q4281
2637.2G88497686P9990K23338K37227M4644j44065j75416j92106k19166p4625J46985
2657.6G88424492J63615O8843J50502K95639K76387K84969N17845P16806O32763M36127
2678G91967988L14116J45495j24812k97367l36647m61698o98030q31008q66175r94622
2698.4G87817240j169682j210570j159907j174688j193404j098156j038253j128733
2714.7G78643847j214862j226783j305640j460552j525104j466096j349985j171589
2731.1G67923236r38594p58291p36177p55071o37651m78685m27425m53829n48244p82490
2751.4G61406779j096189j305341j399160j521408j689792j786530j804114j883864
$$ y = [798125565, 796779931, 795258999, 793752491, 792381346, 791038454, 789804995, 788960874, 788581967, 788497686, 788577676, 788801014, 789038241, 789082885, 788938820, 788763404, 788571298, 788352132, 788277507, 788424492, 788588107, 788656950, 788807452, 789103091, 789379478, 789664447, 790182292, 790899098, 791531861, 791967988, 792282104, 792427599, 792302787, 792005420, 791668773, 791207075, 790509045, 789678037, 788811862, 787817240, 786647558, 785436988, 784277081, 783102393, 781908989, 780810833, 779772580, 778643847, 777428985, 776202202, 774896562, 773436010, 771910906, 770444810, 769094825, 767923236, 766984642, 766226351, 765490174, 764735103, 764097452, 763618767, 763191342, 762737513, 762189269, 761406779, 760310590, 759005249, 757606089, 756084681, 754394889, 752608359, 750804245, 748920381]
2767.8G48920381k052665k185106k291083k540231k875686l101825l303946l590047
2784.1G26979792l809392l928364m146993m432976m518151m417181m418910m596352
2800.4F92711473m724086m770338m907608n142451n437135n785942o122232o441951
2816.7F49379730o805241p298231q002043q860469r802341j0903895j2232065j3754726
2833E71720719j5460670j7380833j9603253k2018999k4104118k4563223k0098209p933081
2849.3D20558333Q199990K0095885K4105877K2828728J9514143J5408397J1004090
2863.6E41715443O900191L644824J655519P49588k35497k142251m388392o076694o922960
2882E34899771p047117o733536o220520n696416n253613m905790m753828m841119n114317
$$ y = [748920381, 746867716, 744682610, 742391527, 739851296, 736975610, 733873785, 730569839, 726979792, 723170400, 719242036, 715095043, 710662067, 706143916, 701726735, 697307825, 692711473, 687987387, 683217049, 678309441, 673166990, 667729855, 661943913, 655821681, 649379730, 642574489, 635276258, 627274215, 618413746, 608611405, 597707510, 585475445, 571720719, 556260049, 538879216, 519275963, 497256964, 473152846, 448589623, 428491414, 420558333, 428758323, 448854208, 472960085, 495788813, 515302956, 530711353, 541715443, 548615634, 552260458, 553915977, 554665565, 554430068, 552287817, 547899425, 541822731, 534899771, 527852654, 521119118, 514898598, 509202182, 503948569, 499042779, 494288951, 489447832, 484333515]
2900.3D84333515n681693o804556q642167j1116326j3895958j6135842j5953690j1455029
2916.6C94648254l532261M266829R366899J1515886J1628270J0852933J0028571R560823
2933D58336204R357304R019345Q467883Q070856P849306P077396N137860K468825K80619
2951.3E16065598n21899J69218J872897L879130N576014O701649P341623P649660P764876
2969.7E56498766P873952P998646Q027911P976293P805109P386983O838381O356716
2986F16762757N914927N486786M965186M267574L687501L267645K867461K610981K436340
3004.4F52267158K247095K151609K107083J889527J480699J128614R69231R28521R23455
3022.7F66092992Q67486P32541O59943O60419O19650N44965N57363P51376R54569R70840
$$ y = [484333515, 478651822, 471847266, 463205099, 452088773, 438192815, 422056973, 406103283, 394648254, 391115993, 395382822, 404749721, 416265607, 427893877, 438746810, 448775381, 458336204, 467693508, 476712853, 485180736, 493251592, 501100898, 508178294, 513316154, 515784979, 516065598, 515543699, 515712917, 517585814, 521464944, 527040958, 533742607, 541084230, 548733890, 556498766, 564372718, 572371364, 580399275, 588375568, 596180677, 603567660, 610406041, 616762757, 622677684, 628164470, 633129656, 637397230, 641084731, 644352376, 647219837, 649830818, 652267158, 654514253, 656665862, 658772945, 660662472, 662143171, 663271785, 664241016, 665169537, 666092992, 666960478, 667693019, 668352962, 669013381, 669633031, 670177996, 670735359, 671486735, 672441304, 673412144]
3043.1F73412144Q23736O66619N94616M53829K25425P9155k9981q7440J7941J98603
3063.5F76354647L24368K71499J15991J35541L46363O21676P64430N75482L45827L34501
3083.9F80190325L59297M44769N62847N29230N22256O63280P70450O79791M71174M37856
3104.3F85631275O15299O32822L48509K14398L65674L37839K3663l76284o38365n66662
3124.7F86588168l75688l47733m46082n30362n05805m18961m96149q00848j016915
3143F81649625j010835r50277q32379p52627r66967j264512j321018j262128j223207
3161.4F72065675j174390j143694j187563j248419j254678j278102j329244j321673
3177.7F62127912j304567j351774j370549j296639j202882j166820j162708j101971
$$ y = [673412144, 674235880, 674902499, 675497115, 675950944, 676176369, 676255524, 676225543, 676138103, 676156044, 676354647, 676679015, 676950514, 677066505, 677202046, 677548409, 678170085, 678934515, 679509997, 679855824, 680190325, 680549622, 680994391, 681557238, 682086468, 682608724, 683272004, 684042454, 684722245, 685193419, 685631275, 686246574, 686879396, 687227905, 687442303, 687807977, 688145816, 688169479, 687793195, 687154830, 686588168, 686212480, 685864747, 685418665, 684888303, 684382498, 683963537, 683467388, 682666540, 681649625, 680638790, 679688513, 678856134, 678103507, 677136540, 675872028, 674551010, 673288882, 672065675, 670891285, 669747591, 668560028, 667311609, 666056931, 664778829, 663449585, 662127912, 660823345, 659471571, 658101022, 656804383, 655601501, 654434681, 653271973, 652170002]
3194F52170002r98795r51230r73344r68158r40860r59932r45151q45432p79331q25644
3214.4F42982125q73148q58665q67784q69631q15630p68543p40766o52313n52476o47128
3234.8F35336041p96854p38323n91039m95077m11331l91305m71234m67181l35753k42591
3255.2F30395353k58744k98500k74301k19583j87099j12176J1265n6147k85924m05371
3275.6F28308773l78609k84135k59280l26395l57628l14474k15948k25127m26888o07073
3296F24913216p27117p94113o17564l78012n53489j064599j388788j397610j310050
3314.4F16681874j268149j295924j352489j348674j335740j524568j793325j875460
3330.7F04887545j839042j766204j702309j842380k091586k203465k276063k255320
$$ y = [652170002, 651171207, 650219977, 649246633, 648278475, 647337615, 646377683, 645432532, 644587100, 643807769, 642982125, 642108977, 641250312, 640382528, 639512897, 638697267, 637928724, 637187958, 636535645, 635983169, 635336041, 634539187, 633800864, 633209825, 632714748, 632303417, 631912112, 631440878, 630973697, 630637944, 630395353, 630136609, 629838109, 629563808, 629344225, 629157126, 629044950, 629056215, 629000068, 628714144, 628308773, 627930164, 627646029, 627386749, 627060354, 626702726, 626388252, 626172304, 625947177, 625520289, 624913216, 624186099, 623391986, 622774422, 622396410, 621842921, 620778322, 619389534, 617991924, 616681874, 615413725, 614117801, 612765312, 611416638, 610080898, 608556330, 606763005, 604887545, 603048503, 601282299, 599579990, 597737610, 595646024, 593442559, 591166496, 588911176]
3347E88911176k073229k167880k517462k598524k429426k335667k433837k490818k287507
3365.4E67576826k139151k332390k599060k555550k284109k092123k028287k032816
3381.7E49513340j993597j835465j601100j381397j465082j773298j722098j307249
3398E36434054j141607j456798j754939j604676j297355j172721j168549j210332j205862
3416.3E24421215j036763q73506q40247p57038n75781m46737m20571l14056j23799
3434.7E19032717j56820l51489l24785r9421Q4877K01166L04878M49836O06179P63416
3455.1E20510554R87590J239538J354813J392246J524865J573861J352131J135528
3471.4E31071126J192987J340449J424969J444578J363039J280009J338363J428008
$$ y = [588911176, 586837947, 584670067, 582152605, 579554081, 577124655, 574788988, 572355151, 569864333, 567576826, 565437675, 563105285, 560506225, 557950675, 555666566, 553574443, 551546156, 549513340, 547519743, 545684278, 544083178, 542701781, 541236699, 539463401, 537741303, 536434054, 535292447, 533835649, 532080710, 530476034, 529178679, 528005958, 526837409, 525627077, 524421215, 523384452, 522510946, 521670699, 520913661, 520337880, 519891143, 519470572, 519156516, 519032717, 518875897, 518524408, 518199623, 518100202, 518185079, 518386245, 518691123, 519140959, 519747138, 520510554, 521498144, 522737682, 524092495, 525484741, 527009606, 528583467, 529935598, 531071126, 532264113, 533604562, 535029531, 536474109, 537837148, 539117157, 540455520, 541883528]
3487.7E41883528J437843J431227J449644J536429J611591J668095J755953J687467
3504E54461777J533628J618683J883149K082288K021790J819789J817108K012670K220571
3522.4E71471453K216160K096415K125501K202213K282858K481043K538800K371789
3538.7E89786232K451121K764106K855182K581060K372741K554059K769769K749800
3555F10884070K763689K900958K869368K688169K846062L391981L426195K985060K933621
3573.4F37689173L175438L288090L335476L360510L269911L284811L447831L229320
3589.7F64080560K747059K609074K573669K314449K058327K092361K410293K966940
3606F83852732L759206M195153M162729L978848L617704L733278L965795L238082K378702
$$ y = [541883528, 543321371, 544752598, 546202242, 547738671, 549350262, 551018357, 552774310, 554461777, 555995405, 557614088, 559497237, 561579525, 563601315, 565421104, 567238212, 569250882, 571471453, 573687613, 575784028, 577909529, 580111742, 582394600, 584875643, 587414443, 589786232, 592237353, 595001459, 597856641, 600437701, 602810442, 605364501, 608134270, 610884070, 613647759, 616548717, 619418085, 622106254, 624952316, 628344297, 631770492, 634755552, 637689173, 640864611, 644152701, 647488177, 650848687, 654118598, 657403409, 660851240, 664080560, 666827619, 669436693, 672010362, 674324811, 676383138, 678475499, 680885792, 683852732, 687611938, 691807091, 695969820, 699948668, 703566372, 707299650, 711265445, 714503527, 716882229]
3624.4G16882229K416789L532470L681242K349138J906693J997650J947761J930296
3640.7G36644268J783371J565516J905560K964080K941608J483918J123726J844406
3657G52256453J723170J091838Q63612P36713P15554J158297J123548M89533R44674
3675.4G61103392J229584O03676N31494N62787M93169J038492J521349Q60274K07185
3693.7G68151402J44065K18511L99351P10427O00338J81795J64687N68927R05573M35293
3714.1G72480369k07246j86622J48952K87712K32279J38521j42157l01778N8830O07609
3734.5G73116469P52569N6684q61943n60224O93619L38435l88026L70383N80430k21908
3754.9G73876488l98874N5194J53959j76490j91927o6578Q6009J94073p3850k53975
$$ y = [716882229, 719299018, 722831488, 726512730, 728861868, 730768561, 732766211, 734713972, 736644268, 738427639, 739993155, 741898715, 744862795, 747804403, 749288321, 750412047, 752256453, 753979623, 755071461, 755935073, 756671786, 757387340, 758545637, 759669185, 760158718, 761103392, 762332976, 762936652, 763468146, 764030933, 764524102, 765562594, 767083943, 767944217, 768151402, 768295467, 768513978, 768913329, 769623756, 770224094, 770405889, 770570576, 771139503, 772045076, 772480369, 772273123, 772086501, 772235453, 772523165, 772755444, 772893965, 772751808, 772450030, 772508860, 773116469, 773869038, 773925722, 773063779, 772503555, 773197174, 773535609, 773147583, 773517966, 774098396, 773876488, 773477614, 773532808, 773686767, 773510277, 773318350, 773251772, 773337781, 773531854, 773458004, 773204029]
3775.3G73204029j6511K37823K1875k26737j37329j20341j93656k59578l06845j35839
3795.7G72066891j31190j05083K66493j60158m96924j29461m12822q58784n00440K53021
3816.1G69791543K04385J61409M91798p0870m61638l17812j72972m3035p9393J10566
3836.5G69613981M24683R2209k61605k37823m14371q06034p39336O30141J483440m3273
3856.9G69742012r17912o26742k08438j66476m33325k11895J32442j00434k72811l78012
3877.3G66558409k14160J4484q2552J40547m708l67284j7762n1737n62966m40478J9669
3899.7G64991462J90675K43783Q8871k96116l89993k91765k50935j0074K46764R4294
3920.1G64616966j16288p868P4088m0888Q8930L64780K62082j5438j17361q5473L1292
$$ y = [773204029, 773187518, 773425341, 773447216, 773220479, 773083150, 772962809, 772769153, 772509575, 772202730, 772066891, 771935701, 771830618, 772097111, 771936953, 771440029, 771310568, 770897746, 770038962, 769538522, 769791543, 769995928, 770157337, 770649135, 770578265, 770116627, 769798815, 769625843, 769582808, 769503415, 769613981, 770038664, 770130873, 769869268, 769631445, 769217074, 768411040, 767671704, 768301845, 769785285, 769742012, 768824100, 768197358, 767988920, 767822444, 767389119, 767177224, 767309666, 767209232, 766936421, 766558409, 766344249, 766358733, 766276181, 766416728, 766412020, 766044736, 766026974, 765975237, 765412271, 764971793, 764991462, 765182137, 765425920, 765514791, 765218675, 764828682, 764536917, 764285982, 764275908, 764522672, 764616966, 764500678, 764492810, 764566898, 764526010, 764614940, 764979720, 765241802, 765226364, 765109003, 765023530, 765054822]
3942.5G65054822N0306l6657R656P2003j1325j18136k06829k65658j95324j32263j88231
3965G64032364j97709j46389j70052k41816k58505k18749j42634K2292J85132J69754
3985.4G63033688R3937J13010J17302K4081m2856m9949
3997.6G63289213
$$ y = [765054822, 765105128, 765068471, 765078127, 765150130, 765138805, 765020669, 764813840, 764548182, 764352858, 764220595, 764032364, 763834655, 763688266, 763518214, 763276398, 763017893, 762799144, 762656510, 762678802, 762863934, 763033688, 763127625, 763240635, 763357937, 763382018, 763339162, 763289213]
##END=$$ End of the data block
