##TITLE=Videira - Marcela $$ Begin of the data block
##JCAMP-DX=5.00 $$ ACD/SpecManager v 10.08
##SPECTROMETER/DATA SYSTEM=Alpha
##DATE=24 Oct 2013 10:57:42
##DATA TYPE=INFRARED SPECTRUM
##DATA CLASS=XYDATA
##ORIGIN=
##OWNER=
##NPOINTS=1765
##FIRSTX=399.75695801
##LASTX=3997.56933594
##MAXX=3997.56933594
##MINX=399.75695801
##MAXY=0.81337035
##MINY=0.15903729
##XFACTOR=1.0000000000
##YFACTOR=1.000000000000000e-9
##FIRSTY=0.47060698
##DELTAX=2.03957629
##XUNITS=1/CM
##YUNITS=ARBITRARY UNITS
##XYDATA=(X++(Y..Y))
399.8D70606983n925477l289610q65489L20494M24594O22868J198173J733660J206935
418.1D66033131j045227k676547l217846l359556k940327k643108k435625j786590
434.4D45928305r88066r3370J544386L489971M364729M151165L551364K582669J462639
452.8D65993792O50316j06245j258016k051293k421320k913505l438532l643155l675372
471.1D47136670l900706l554941k581685j842052j245409n81533j96487j34408k77281
489.5D32822168p22647j171857j345813j509965j761943k121180k554506k851010l058642
507.9D15724605l322750l811151m306376m482597m615337m543125l695786k381057
524.2C84566426j128941L5315J117111K156227L495038N094796O230682O198138M873038
$$ plain form
399.8 470606983 464681506 461391896 460526407 460846901 461271495 461894363 463092536 464826196 466033131
418.1 466033131 464987904 462311357 459093511 455733955 452793628 450150520 447714895 445928305
434.4 445928305 444940239 444846869 446391255 449881226 454245955 458397120 461948484 464531153 465993792
452.8 465993792 466644108 466537863 465279847 463228554 460807234 457893729 454455197 450812042 447136670
471.1 447136670 443235964 439681023 437099338 435257286 434011877 433430344 433233857 433099449 432822168
489.5 432822168 432099521 430927664 429581851 428071886 426309943 424188763 421634257 418783247 415724605
507.9 415724605 412401855 408590704 404284328 399801731 395186394 390643269 386947483 384566426
524.2 384566426 383437485 383472800 384589911 386746138 390241176 395335972 401566654 407764792 412637830
542.5D12637830K853155R33498l35753j097560j903862k875357l902853m870504n646140
560.9C95792454o243586o773263p210970p082373o024450m162342j715660R34363L522754
579.2C61036927N784094P277012P820964P310032N839825M024357K345204J099467
595.6D02537882K76715k45571m77076m84913k24561L43293J114577J860708K550274
613.9D07251328L232897L796279M281610M871637N245983N031795M444569L713787
630.2D41869885L011793K494722K175600J892149J538366J219988J112878J226276
646.5D56541657J376123J362860J316875J300335J067847P96855P60823Q73029J293153
664.9D66689557K615601K721220L55184K34783J102745J563162J707107J617580J365215
$$ plain form
542.5 412637830 415490985 416424483 416088730 414991170 413087308 410211951 406309098 401438594 395792454
560.9 395792454 389548868 382775605 375564635 368482262 362457812 358295470 356579810 357514173 361036927
579.2 361036927 366821021 374098033 381918997 389229029 395068854 399093211 401438415 402537882
595.6 402537882 402814597 402569026 402091950 401607037 401382476 401725769 402840346 404701054 407251328
613.9 407251328 410484225 414280504 418562114 423433751 428679734 433711529 438156098 441869885
630.2 441869885 444881678 447376400 449552000 451444149 452982515 454202503 455315381 456541657
646.5 456541657 457917780 459280640 460597515 461897850 462965697 463762552 464523375 465396404 466689557
664.9 466689557 469305158 472026378 472381562 472616345 473719090 475282252 476989359 478606939 479972154
683.3D79972154J018882P48306N05448P3164n47439j447886k761066l977090m397392
701.6D69187081l967047l010511j660705k0295J629501L086925M438251N778402O996334
720D82457936P654369P570386P085025O415844N695283N005241M328310L477693K316058
738.3E32006145R22322p36773k404571l750086m802107n740285o510735o953478o978571
756.7D95051861o361634m913062k735525r0361K777279N569488P890015R464294J0359943
775E17012298J0619998J0123730R007513P561028O105543N028247M574597M675210
791.4E74708164N151808N707681O044090O012857N665481N203366M639864L981650
807.7F17114961L366590K735912J873315J022279N03302P3611o95467j823246l184080
$$ plain form
683.3 479972154 480991036 481739342 482244790 482317954 481770515 480322629 477561563 473584473 469187081
701.6 469187081 465220034 462209523 460548818 460528523 462158024 465244949 469683200 475461602 482457936
720 482457936 490112305 497682691 504767716 511183560 516878843 521884084 526212394 529690087 532006145
738.3 532006145 532928467 532191694 529787123 526037037 521234930 515494645 508983910 502030432 495051861
756.7 495051861 488690227 483777165 481041640 480951279 483728558 489298046 497188061 506652355 517012298
775 517012298 527632296 537756026 546763539 554324567 560430110 565458357 570032954 574708164
791.4 574708164 579859972 585567653 591611743 597624600 603290081 608493447 613133311 617114961
807.7 617114961 620481551 623217463 625090778 626113057 626616359 626689970 625994503 624171257 620987177
826F20987177m783869o409109p625877q089722p957637p657587p306755o663382n667329
844.4E58825910m618645l746032l132344k868354k901554k912641k228081M3929L999233
862.7E40461421Q401573J1761784J3344169J3028920J1141002Q308053N118608J892448
879.1F13457978j421869m672706p251144q777082r227156q775234p911861p082820
895.4E58338106o480515o222368o356358o915450p891178r121895j0349691j1427581
911.7D93573070j2201608j2304842j1445999r645015p188291m602879k405226p42823
928D33036387N99623J844167L043682M252970N500436O547421O594628M503101K9564
946.4D65951979n621344j0894596j4909417j7488658j8935800j9776165k0358861k0763933
$$ plain form
826 620987177 616203308 609794199 602168322 594078600 586120963 578463376 571156621 564493239 558825910
844.4 558825910 554207265 550461233 547328889 544460535 541558981 538646340 536418259 536462188 540461421
862.7 540461421 548862994 560624778 573968947 586997867 598138869 606446922 611565530 613457978
879.1 613457978 612036109 607363403 600112259 591335177 582108021 573332787 565420926 558338106
895.4 558338106 551857591 545635223 539278865 532363415 524472237 515350342 505000651 493573070
911.7 493573070 481371462 469066620 457620621 447975606 440787315 436184436 433779210 433036387
928 433036387 433636010 435480177 438523859 442776829 448277265 454824686 461419314 465922415 465951979
946.4 465951979 460330635 449436039 434526622 417037964 398102164 378325999 357967138 337203205
962.7C37203205k1009773k1138102k1074385k0620316j9688353j8286824j6342342
977A99043110j3859063j0951206p819012m838541k289594k48402J225889K129331K567932
995.3A64960444K673626K616972K435267K036407J481980R43035N16415K85625L73751
1013.7A78323522P46548J224146J662790K082468K492919K795249K960414K987757
1030A95275813K848029K511293K025932J556665J278430J244903J419529J711205K095565
1048.3B11967364K639338L346727M186570N148888O282106P668063R243295J0260403
1064.7B60742754R097576M398405k819061q911729j0821074q859426n438298k309218
1081B35079929L9846J748174L042147M049390M830227N249694N112529M374027L221839
$$ plain form
962.7 337203205 316193432 295055330 273980945 253360629 233672276 215385452 199043110
977 199043110 185184047 174232841 166413829 161575288 159285694 159037292 160263181 162392512 164960444
995.3 164960444 167634070 170251042 172686309 174722716 176204696 177147731 177664146 177949771 178323522
1013.7 178323522 179070070 180294216 181957006 184039474 186532393 189327642 192288056 195275813
1030 195275813 198123842 200635135 202661067 204217732 205496162 206741065 208160594 209871799 211967364
1048.3 211967364 214606702 217953429 222139999 227288887 233570993 241239056 250482351 260742754
1064.7 260742754 269840330 274238735 271419674 262507945 251686871 242827445 237389147 235079929
1081 235079929 235119775 236867949 239910096 243959486 248789713 254039407 259151936 263525963 266747802
1099.3B66747802K061010J336545J270532J740009K428204L050178L408313L428697
1115.6B85471290L143818K681195K311886K253025K572805L213674L932446M111558
1132C09691697L083557P99805k225965n205929p364422q335531q289963p591248o502330
1150.3B68059671n242705l978074k748013j514256k43842J082599K523333M196763
1166.6B62135476O115734Q129001J0073483J1861563J3345390J4363915J4872939J4859169
1182.9C55756670J4334381J3307899J1798859R913414P815481N718916L920794K673387
1199.3D25239801K101124K176404K753854L620922M545659N358457N896479O033034
1215.6D57725734N715072M904538L643125K166778P61301l26097r58443j239896j274794
$$ plain form
1099.3 266747802 268808812 270145357 271415889 273155898 275584102 278634280 282042593 285471290
1115.6 285471290 288615108 291296303 293608189 295861214 298434019 301647693 305580139 309691697
1132 309691697 312775254 313575059 311349094 306143165 298778743 290443212 282153249 274562001 268059671
1150.3 268059671 262816966 258838892 256090879 254576623 254332781 255415380 257938713 262135476
1166.6 262135476 268251210 276380211 286453694 298315257 311660647 326024562 340897501 355756670
1182.9 355756670 370091051 383398950 395197809 405111223 412926704 418645620 422566414 425239801
1199.3 425239801 427340925 429517329 432271183 435892105 440437764 445796221 451692700 457725734
1215.6 457725734 463440806 468345344 471988469 474155247 474916548 474590451 473632008 472392112 471117318
1233.9D71117318j116038q53061n08100m5300N54383J270950J962691K451629K700895
1252.3D77535367K729982K616823K502173K450019K465636K577066K705038K700805
1268.6D98282909K497912K073467J510560R48310M14372j00077n52237r11951j144171
1287E03019094j301646j515746j774669j973688k094358k080053j796991j313537q73298
1305.3D88295108o55085o87897r30816j360744j832366k201438k568334l023357l622919
1323.7D71412152m401833n131632n490303n284130m526169l456503k449304j786410
1340D38885868j356632r86665p40111o92725q42184j064748j289904j502335j569867
1358.3D28840697j446426j352370j269132r59903n47528p3493N56976J080632J287341
$$ plain form
1233.9 471117318 470001280 469148219 468640119 468594819 469149202 470420152 472382843 474834472 477535367
1252.3 477535367 480265349 482882172 485384345 487834364 490300000 492877066 495582104 498282909
1268.6 498282909 500780821 502854288 504364848 505313158 505727530 505627453 505075216 504163265 503019094
1287 503019094 501717448 500201702 498427033 496453345 494358987 492278934 490481943 489168406 488295108
1305.3 488295108 487640023 486952126 486021310 484660566 482828200 480626762 478058428 475035071 471412152
1323.7 471412152 467010319 461878687 456388384 451104254 446578085 443121582 440672278 438885868
1340 438885868 437529236 436542571 435802460 435109735 434267551 433202803 431912899 430410564 428840697
1358.3 428840697 427394271 426041901 424772769 423812866 423265338 423191845 423748821 424829453 426116794
1376.7D26116794J480997J699507K012611K787321L799707L963411L300965K792656
1393D47953969K030194P26342m36961j139731j392036j628131j922876j977205j939922
1411.4D40273643j842618j449466r62079q39919p47263k69353J54256M61936P44999
1429.7D35524136R00775J250058J885266J851320J250088J197159J146615P87645J33247
1448.1D45926309p08938j202524j178652j316458k048135j645714K981K055764L660351
1466.4D43544984M751921O678670R330720R811580Q799881Q472979Q540124Q501887
1482.8E08432746Q099377Q076191Q217454P387280N927325N906403O630003N793691
1499.1E64470470M558027M384994N720735O487727L812015K557695L141761L771782
$$ plain form
1376.7 426116794 427597791 429297298 431309909 434097230 437896937 441860348 445161313 447953969
1393 447953969 449984163 450710505 450273544 449133813 447741777 446113646 444190770 442213565 440273643
1411.4 440273643 438431025 436981559 436019480 435179561 434432298 434162945 434317201 434779137 435524136
1429.7 435524136 436424911 437674969 439560235 441411555 442661643 443858802 445005417 445793062 445926309
1448.1 445926309 445217371 444014847 442836195 441519737 439471602 437825888 437828869 439884633 443544984
1466.4 443544984 448296905 454975575 464306295 474117875 482917756 491390735 499930859 508432746
1482.8 508432746 516532123 524608314 532825768 540213048 546140373 552046776 558676779 564470470
1499.1 564470470 569028497 573413491 579134226 585621953 589433968 591991663 595133424 598905206
1515.4E98905206L962636L803849L761649K924621K277076K314628K211093K670527
1531.7F22831285K969503K361834K828241M096866K672016R28223R34243J411856J905918
1550.1F42939985K098918K318024K780497L401161J573622k96652M47988J350939J685203
1568.4F58299685J257121N93901J036167J251876J76132j66833K1219p6115l66569
1586.8F62026584o27160q65459j087070j451313j960516k410531k811790l174364l500462
1605.1F44137919l814995m303933m736721m672706m841507o083190o043911n124390
1621.4F04516566n350411n629242n491256n286932m331768l171146l278672l728807
1637.8E68248332k975166j875580p24911K45511L01480M69029K097547K659619R86815
$$ plain form
1515.4 598905206 602867842 606671691 610433340 613357961 615635037 617949665 620160758 622831285
1531.7 622831285 625800788 628162622 630990863 635087729 637759745 638687968 639622211 641034067 642939985
1550.1 642939985 645038903 647356927 650137424 653538585 655112207 654815555 655263543 656614482 658299685
1568.4 658299685 659556806 660150707 661186874 662438750 662614882 662448049 662469268 662393153 662026584
1586.8 662026584 661399424 660533965 659446895 657995582 656035066 653624535 650812745 647638381 644137919
1605.1 644137919 640322924 636018991 631282270 626609564 621768057 615684867 609640956 604516566
1621.4 604516566 599166155 593536913 588045657 582758725 578426957 575255811 571977139 568248332
1637.8 568248332 565273166 563397586 562672675 562918186 563219666 563688695 565786242 568445861 569432676
1656.1E69432676J287222K663135L715635L837525L715694M686594N221963M392445
1672.4E98952889M661024N035877M502058M722774N951405O659627M571736L505409
1688.8F38562799M051923M321754N255401N521059M756213M260301K863646K668321
1705.1F72261417L041804K710998K742350L066897L409446L330707K015352J222849
1721.4F93801820J653731K021492K078890K229453K450227K766550J853347J100719
1737.7G09956229J650572J749038J472831J628935J902759J888037J338363R29057
1754G22515821J179278J330436J331865J371801J044214J096547J474261J601279J358151
1772.4G34303653N80728K97964P64728J060128R28640P93099P02620Q53956J339435
$$ plain form
1656.1 569432676 570719898 573383033 577098668 580936193 584651887 589338481 594560444 598952889
1672.4 598952889 603613913 608649790 613151848 617874622 623826027 630485654 635057390 638562799
1688.8 638562799 642614722 646936476 652191877 657712936 662469149 666729450 669593096 672261417
1705.1 672261417 675303221 678014219 680756569 683823466 687232912 690563619 692578971 693801820
1721.4 693801820 695455551 697477043 699555933 701785386 704235613 707002163 708855510 709956229
1737.7 709956229 711606801 713355839 714828670 716457605 718360364 720248401 721586764 722515821
1754 722515821 723695099 725025535 726357400 727729201 728773415 729869962 731344223 732945502 734303653
1772.4 734303653 734884381 735182345 735947073 737007201 737935841 738728940 739431560 740285516 741624951
1790.7G41624951J292706N78225M60565Q28325Q92818O16789N37932P64311R51588
1809.1G48548210Q39233N39839M87626O34253P03692P68245R24289Q85963O86407N92709
1829.5G55610466K48611N3108L01897M22120L58343N61238P63297K47657k27034p7069
1849.9G58262634J44184K12014K01642J76609J83224K40028L84987O34789O77049J50562
1870.3G61267722k46525j8478K92719M01199L92198L71754L72947L87668M40717L31581
1890.7G63993502K05338K76625K48670J31250J07109J15812J43171K09271K51174J58012
1911.1G65839934L1293J25587K92539J89126P5996J14977N4896L2842P7248O0558O3181
1933.5G66958177J30594K20179L11256L59356J73092l7491K9027J80602K70546L07143
$$ plain form
1790.7 741624951 742917657 743495882 743956447 744784772 745677590 746294379 746832311 747596622 748548210
1809.1 748548210 749387443 749927282 750414908 751049161 751752853 752521098 753445387 754331350 755017757 755610466
1829.5 755610466 755859077 755912185 756214082 756636202 756994545 757555783 758319080 758566737 758339703 758262634
1849.9 758262634 758406818 758618832 758820474 758997083 759180307 759420335 759805322 760440111 761117160 761267722
1870.3 761267722 761021197 761002719 761295438 761696637 762088835 762460589 762833536 763221204 763661921 763993502
1890.7 763993502 764198840 764475465 764724135 764855385 764962494 765078306 765221477 765430748 765681922 765839934
1911.1 765839934 765871227 765996814 766289353 766478479 766554475 766669452 766724348 766757190 766834438 766894996 766958177
1933.5 766958177 767088771 767308950 767620206 767979562 768152654 768115163 768144190 768324792 768595338 768902481
1953.9G68902481K70843K20537K12491J94371K26497L07858K44975J06693J02043J36316
1974.3G70925105J08242J08957J51813J71423J53899J30534J15931J20998N2213p7724
1994.7G71961391p7784r835j7345q0824j41322j87934k26199k66195l10600l37719
2015.1G70305634l69370m52519m97520m44770m31418m96864n53847n53131n09739m83811
2035.5G65512645m80473m39465l72529l47495l36349k89142k25246j75893r7514j0728
2055.9G62737811M589o735K7776R2327J12593Q4281O9321P5042Q7797Q9169P0274P5698
2080.3G63519943R0182P9453Q9168J24514J44363J43647J38879J32739J45436J50442
2100.7G64758766J42991J58429J57178J38163J21236Q0288L2365L5226P8380Q6368
$$ plain form
1953.9 768902481 769173324 769393861 769606352 769800723 770027220 770335078 770580053 770686746 770788789 770925105
1974.3 770925105 771033347 771142304 771294117 771465540 771619439 771749973 771865904 771986902 772039115 771961391
1994.7 771961391 771883607 771873772 771856427 771775603 771634281 771446347 771220148 770953953 770643353 770305634
2015.1 770305634 769936264 769483745 768986225 768541455 768110037 767613173 767059326 766506195 765996456 765512645
2035.5 765512645 765032172 764592707 764220178 763872683 763536334 763247192 763021946 762846053 762748539 762737811
2055.9 762737811 762742400 762735665 762763441 762855768 762968361 763052642 763121963 763197005 763284802 763373971 763444245 763519943
2080.3 763519943 763610125 763689578 763778746 763903260 764047623 764191270 764330149 764462888 764608324 764758766
2100.7 764758766 764901757 765060186 765217364 765355527 765476763 765557051 765589416 765624642 765703022 765789390
2121.1G65789390L8266k563l636M589p74l457J6868J8716J8060K7597M232O198O3003
2147.7G65976489J02043J03473J08600J48773K23041K77519L11017L75092M51505N08070
2168G68585622N32627N10455M89413N25415N78642O15657O11007N63085N27441N22375
2188.4G74061739N25535N21242N22137N40137N43773N21839N07534N10513N24342N55218
2208.8G79334009N86986N77688N19336M54604M28975M48704M61399M42684M11689L81232
2229.2G84047306L27885K83360L15190L58045L52859L37005L04460K33949K11775K76863
2249.6G87048697L44337L56078L20077K98321L09944L22163L22998L21567L54886L93986
2270G90393054L39032K46942K30670K60830K83420K79069K84075L31581L72410L95715
$$ plain form
2121.1 765789390 765827656 765825093 765821457 765826046 765825272 765821815 765838683 765857399 765875459 765903056 765907288 765913486 765976489
2147.7 765976489 766078532 766182005 766290605 766439378 766662419 766939938 767250955 767626047 768077552 768585622
2168 768585622 769118249 769628704 770118117 770643532 771222174 771837831 772448838 773011923 773539364 774061739
2188.4 774061739 774587274 775108516 775630653 776170790 776714563 777236402 777743936 778254449 778778791 779334009
2208.8 779334009 779920995 780498683 781018019 781472623 781901598 782350302 782811701 783254385 783666074 784047306
2229.2 784047306 784375191 784658551 784973741 785331786 785684645 786021650 786326110 786560059 786771834 787048697
2249.6 787048697 787393034 787749112 788069189 788367510 788677454 788999617 789322615 789644182 789999068 790393054
2270 790393054 790732086 790979028 791209698 791470528 791753948 792033017 792317092 792648673 793021083 793416798
2290.4G93416798M39048M69923M66585M60625M57048M83096N77330P12991P94888P66098
2310.8G99044430O66619O15418P76946J121402J334906J132667P68899P33912Q64923
2329.2H07060122O21379J88827J71841L79145M06444J59025n06461j760900k294600
2347.5H04424822r12845J379252K957582K880991J886546P53999j98424j007974j663625
2365.9H10500324k143204k439440k500951k345383k109468j928091j771868j528799
2382.2G93733120j203299q66413n38826l07738k22624j95682k02179k60174k93255
2400.6G89642930k59340k42948k81871l40283l84867m08172m31419m42266m48466m71770
2421G85931528m92096n10812n54741o02305o06000n89073n85973n86271o05285o34611
$$ plain form
2290.4 793416798 793855846 794325769 794792354 795252979 795710027 796193123 796770453 797483444 798278332 799044430
2310.8 799044430 799711049 800326467 801103413 802224815 803559721 804692388 805461287 806195199 807060122
2329.2 807060122 807681501 807870328 808042169 808421314 808827758 808986783 808480322 806719422 804424822
2347.5 804424822 803511977 804891229 807848811 810729802 812616348 813370347 813171923 812163949 810500324
2365.9 810500324 808357120 805917680 803416729 801071346 798961878 797033787 795261919 793733120
2382.2 793733120 792529821 791663408 791124582 790816844 790594220 790398538 790196359 789936185 789642930
2400.6 789642930 789383590 789140642 788858771 788518488 788133621 787725449 787294030 786851764 786403298 785931528
2421 785931528 785439432 784928620 784373879 783771574 783165574 782576501 781990528 781404257 780798972 780164361
2441.3G80164361o35624o33776o29425n89609n60761n91159o22570o00219n51283n20230
2461.7G74229705n19871n10514m86612m93527n21004n16117m79102m50611m34458m27962
2482.1G69389927m40836m38034m00066l61383l21925k64406k30790k55942k91228l01182
2502.5G66084135k87295k53737k29776k31862k81334l54051l78609l70800l75510l82066
2522.9G62939095m03225m79519n49913n52952n51760n54383n57840o06477o42240o39439
2543.3G57401347o60658o80625o33180n62072n65171o19769o29068o09577o25014o46353
2563.7G51169860o29007n93663n71370n71906n86152n83292n39004m92156n01037n12123
2584.1G45590150m87864m84705m77492m28617l76642l72410m25816m91142n15520m93706
$$ plain form
2441.3 780164361 779528737 778894961 778265536 777675927 777115166 776524007 775901437 775301218 774749935 774229705
2461.7 774229705 773709834 773199320 772712708 772219181 771698177 771182060 770702958 770252347 769817889 769389927
2482.1 769389927 768949091 768511057 768110991 767749608 767427683 767163277 766932487 766676545 766385317 766084135
2502.5 766084135 765796840 765543103 765313327 765081465 764800131 764446080 764067471 763696671 763321161 762939095
2522.9 762939095 762535870 762056351 761506438 760953486 760401726 759847343 759289503 758683026 758040786 757401347
2543.3 757401347 756740689 756060064 755426884 754864812 754299641 753679872 753050804 752441227 751816213 751169860
2563.7 751169860 750540853 749947190 749375820 748803914 748217762 747634470 747095466 746603310 746102273 745590150
2584.1 745590150 745102286 744617581 744140089 743711472 743334830 742962420 742536604 742045462 741529942 741036236
2604.5G41036236n03719n76198o54876p34210q34405q92520q94726r42528j022220
2622.9G33980834j071691j140654j219571j254558j278460j297713j278460j271844
2639.2G24167883j317560j351834j341700j303256j247644j238525j272798j281201
2655.5G13813365j277328j257718j193463j125575j101851j107097j133382j144648
2671.8G04472303j097858j042664r98139r34064q54195q46266r16183r39310r29654
2690.2F95913970r52541r80497j010060j067102j123786j143813j142740j146436j164973
2708.5F86182022j206994j239777j219928j180589j156926j154721j173198j174867
2724.8F76675022j122237j042902j012564j025080j021922r91047r50634r42826r48787
$$ plain form
2604.5 741036236 740532517 739956319 739301443 738567233 737732828 736840308 735945582 735003054 733980834
2622.9 733980834 732909143 731768489 730548918 729294360 728015900 726718187 725439727 724167883
2639.2 724167883 722850323 721498489 720156789 718853533 717605889 716367364 715094566 713813365
2655.5 713813365 712536037 711278319 710084856 708959281 707857430 706750333 705616951 704472303
2671.8 704472303 703374445 702331781 701333642 700399578 699545383 698699117 697782934 696843624 695913970
2690.2 695913970 694961429 693980932 692970872 691903770 690779984 689636171 688493431 687346995 686182022
2708.5 686182022 684975028 683735251 682515323 681334734 680177808 679023087 677849889 676675022
2724.8 676675022 675552785 674509883 673497319 672472239 671450317 670459270 669508636 668565810 667617023
2743.2F67617023r31919r04679q41737p65562p39932p55071p73728p65622p19309o86824
2763.6F59732640p07865p18713p17938p87675q89063r18388r20296r72390j029849
2782F52070463j086533j188875j303494j359880j400768j482547j557350j618981j718998
2800.3F39353037j839817j896560j939297k061963k170980k219736k263069k323747
2816.6F22637868k423346k530992k625346k708674k762973k822638k921700l020168
2832.9F00822031l118216l254712l317237l283083l347517l543496l721654l764689
2849.3E73471427l749132l819347l975153m208266m481793m748225n097508n559206
2865.6E37832797o013096o400406o683409o733597o535530o198287n700052m987567
$$ plain form
2743.2 667617023 666685104 665780425 664938688 664173126 663433194 662678123 661904395 661138773 660419464 659732640
2763.6 659732640 659024775 658306062 657588124 656800449 655911386 654992998 654072702 653100312 652070463
2782 652070463 650983930 649795055 648491561 647131681 645730913 644248366 642691016 641072035 639353037
2800.3 639353037 637513220 635616660 633677363 631615400 629444420 627224684 624961615 622637868
2816.6 622637868 620214522 617683530 615058184 612349510 609586537 606763899 603842199 600822031
2832.9 600822031 597703815 594449103 591131866 587848783 584501266 580957770 577236116 573471427
2849.3 573471427 569722295 565902948 561927795 557719529 553237736 548489511 543392003 537832797
2865.6 537832797 531819701 525419295 518735886 512002289 505466759 499268472 493568420 488580853
2881.9D88580853m167527l354937k595931j909972j320213r09775o99043o35326p25985
2900.2D72262144r47267j237720j604527k031595k510726l007978l362179l534049
2916.6D54026103l579706l449827l101141k545058j812846r42051P5012J193404K251387
2934.9D42115277L156543L953159M653364N237669N735785O143093O439388O619662
2951.2D84053940O697028O680698O567984O394804O153107N819559N449950N134047
2967.6E32951117M904449M754066M698396M734814M780114M726469M583717M358410
2983.9E70491552L998220L590048L203988K810776K419054J989067J536608J122832
3000.2E91162145O91652K41757j58429n35190r23336j269996j528978j718402j894117
$$ plain form
2881.9 488580853 484413326 481058389 478462458 476552486 475232273 474322498 473623455 472988129 472262144
2900.2 472262144 471314877 470077157 468472630 466441035 463930309 460922331 457560152 454026103
2916.6 454026103 450446397 446996570 443895429 441350371 439537525 438595474 438670486 439863890 442115277
2934.9 442115277 445271820 449224979 453878343 459116012 464851797 470994890 477434278 484053940
2951.2 484053940 490750968 497431666 503999650 510394454 516547561 522367120 527817070 532951117
2967.6 532951117 537855566 542609632 547308028 552042842 556822956 561549425 566133142 570491552
2983.9 570491552 574489772 578079820 581283808 584094584 586513638 588502705 590039313 591162145
3000.2 591162145 591853797 592095554 591937125 591401935 590478599 589208603 587679625 585961223 584067106
3018.5E84067106k110958k354383k535165k636611k746105k872110k995312l095090
3034.9E62721372l143132l221810l330946l368020l367424l427684l520668l537595
3051.2E35804093l494859l492713l533363l565729l563106l554642l612578l658593
3067.5E07328510l609419l604292l663064l649801l588914l577412l594338l592611
3083.8D78448659l577530l557027l516256l464759l437757l403455l358633l368497
3100.1D50764745l421008l446818l391265l270805l193051l175199l148854l141731
3116.4D24576014l167122l162861l114551l062904l015995k958924k907038k877712
3132.8D00308907k837121k777786k751231k737522k688378k623916k585291k556056
$$ plain form
3018.5 584067106 581956148 579601765 577066600 574429989 571683884 568811774 565816462 562721372
3034.9 562721372 559578240 556356430 553025484 549657464 546290040 542862356 539341688 535804093
3051.2 535804093 532309234 528816521 525283158 521717429 518154323 514599681 510987103 507328510
3067.5 507328510 503719091 500114799 496451735 492801934 489213020 485635608 482041270 478448659
3083.8 478448659 474871129 471314102 467797846 464333087 460895330 457491875 454133242 450764745
3100.1 450764745 447343737 443896919 440505654 437234849 434041798 430866599 427717745 424576014
3116.4 424576014 421408892 418246031 415131480 412068576 409052581 406093657 403186619 400308907
3132.8 400308907 397471786 394694000 391942769 389205247 386516869 383892953 381307662 378751606
3149.1C78751606k507389k450466k413362k403438k372653k316534k264470k209395
3165.4C59813899k151430k101689k056152k017796j978040j918584j867294j838058
3181.7C43884856j798720j769542j752794j697213j638442j609564j581162j566768
3198C30470651j547724j481324j407892j352220j307488j286655j284779j266211j212150
3216.4C18324208j170069j154899j149059j150220j096547r87887r30637r54599r87380
3234.7C08742911r57370r05812q99643q64356p85083p67916q02577p81566p04586o80536
3255.1C00593466o98299o83397o49839o19889n99265n68211n35369n45174n90056n99563
3275.5B94504404n69016n81562n92023n39780m91738m95375n24014n33998n29796n17815
$$ plain form
3149.1 378751606 376244217 373793751 371380389 368976951 366604298 364287764 362023294 359813899
3165.4 359813899 357662469 355560780 353504628 351486832 349508792 347590208 345722914 343884856
3181.7 343884856 342086136 340316594 338563800 336866587 335228145 333618581 332037419 330470651
3198 330470651 328922927 327441603 326033711 324681491 323374003 322087348 320802569 319536358 318324208
3216.4 318324208 317154139 315999240 314850181 313699961 312603414 311615527 310684890 309730291 308742911
3234.7 308742911 307785541 306879729 305980086 305115730 304330647 303562731 302760154 301978588 301274002 300593466
3255.1 300593466 299895167 299211770 298561931 297942042 297342777 296774566 296239197 295694023 295103967 294504404
3275.5 294504404 293935388 293353826 292761803 292222023 291730285 291234910 290710896 290176898 289647102 289129287
3295.9B89129287n01305m91142m84169n12004n59657n60969n51433n97477o38455o19084
3316.3B83613592n95361n83052n63830n71281o11872o25461o17951o30468o20127o20603
3336.7B77573586o51092o55562o46293o36100o14882o10918o60002p09504o94841o44505
3357.1B71049887o23733o39528o62029o49422o22958o66261p16597o65366n93037n75542
3377.5B64635414n71042n84931n61177m63903l60966l34859m21941n09173m80741l44575
3397.9B60002106k63035l48002m15235l29346l03149l63886l40730k78294k05428j46091
3418.3B57008910j58518j76162j41829j09941o4313J7970Q2016P1645l6061j01625
3438.7B56392092j3114J13965J93119K08050J38729J01954J65731K52038L01004L04252
$$ plain form
3295.9 289129287 288627982 288136840 287652671 287140667 286581010 286020041 285468608 284871131 284232676 283613592
3316.3 283613592 283018231 282435179 281871349 281300068 280688196 280062735 279444784 278814316 278194189 277573586
3336.7 277573586 276922494 276266932 275620639 274984539 274369657 273758739 273098737 272389233 271694392 271049887
3357.1 271049887 270426154 269786626 269124597 268475175 267852217 267185956 266469359 265803993 265210956 264635414
3377.5 264635414 264064372 263479441 262918264 262454361 262093395 261758536 261336595 260827422 260346681 260002106
3397.9 260002106 259739071 259391069 258975834 258646488 258343339 257979453 257638723 257360429 257155001 257008910
3418.3 257008910 256850392 256674230 256532401 256422460 256358147 256376117 256458133 256529778 256493717 256392092
3438.7 256392092 256378978 256492943 256686062 256894112 257032841 257134795 257300526 257552564 257853568 258157820
3459.1B58157820K85893L12686M12226M50969L38554K44617L05683L88294M07160M18007
3479.5B61721909M30554M39763M68672M39882L89188M40032M99308N09262M97788N42969
3499.9B66379327O10679N44339M48317M93735N89132O49989O59406N96613N82546O90758
3520.3B72244841Q09342P92235P18742O94365P32719Q23886Q70436Q59439Q83312R86427
3540.7B80415744J088827J117558J055896J011372J055687J140625J214742J313269
3557B89413720J440198J485586J539469J755923J911610J730978J633376J809627J997560
3575.3C04718047K135992K271355K368062K433986K641022K876431K736121K561867
3591.7C24742883K784700L005713L031701L083676L128201L138005L306538L611982
$$ plain form
3459.1 258157820 258443713 258756399 259168625 259619594 259958148 260202765 260508448 260896742 261303902 261721909
3479.5 261721909 262152463 262592226 263060898 263500780 263889968 264330000 264829308 265338570 265836358 266379327
3499.9 266379327 266990006 267534345 267982662 268476397 269065529 269715518 270374924 270971537 271554083 272244841
3520.3 272244841 273054183 273846418 274565160 275259525 275992244 276816130 277686566 278546005 279429317 280415744
3540.7 280415744 281504571 282622129 283678025 284689397 285745084 286885709 288100451 289413720
3557 289413720 290853918 292339504 293878973 295634896 297546506 299277484 300910860 302720487 304718047
3575.3 304718047 306854039 309125394 311493456 313927442 316568464 319444895 322181016 324742883
3591.7 324742883 327527583 330533296 333564997 336648673 339776874 342914879 346221417 349833399
3608C49833399L643453L529370L543168L574252L834844L963858L529400L312915L727943
3626.3C82492602M558444M421562L467500L402978L675074L763228L852189L914535
3642.6D13548112M014999M506468N104125M477143L329307L473938M142850L919035
3659D46515977L640056L757745L743589L894091M470676M314840L643751L963142L617079
3677.3D81560946K628922K573997K794474L103674L798633L923566K813398K045572
3693.6E05243182K143026K455949K713263K778173K348483K002477K307356K755522
3709.9E24747431K516449J650631J373887J785994K122104K103686J960636J817345
3726.3E40078163J619697J750290K281249K372086J640141Q04007P05838J607597K412081
$$ plain form
3608 349833399 353476852 357006222 360549390 364123642 367958486 371922344 375451744 378764659 382492602
3626.3 382492602 387051046 391472608 394940108 398343086 402018160 405781388 409633577 413548112
3642.6 413548112 417563111 422069579 427173704 431650847 434980154 438454092 442596942 446515977
3659 446515977 450156033 453913778 457657367 461551458 466022134 470336974 473980725 477943867 481560946
3677.3 481560946 484189868 486763865 489558339 492662013 496460646 500384212 503197610 505243182
3693.6 505243182 507386208 509842157 512555420 515333593 517682076 519684553 521991909 524747431
3709.9 524747431 527263880 528914511 530288398 532074392 534196496 536300182 538260818 540078163
3726.3 540078163 541697860 543448150 545729399 548101485 549741626 550545633 551251471 552859068 555271149
3744.6E55271149J631498J330078J892924J201689M77493Q74519J383186J275360J066327
3763E66404223J261831J400828J394451J181841Q32855R36687J315654J431942J128316
3781.3E77288628R07063J007080J033306R90451J001477J123965J345634J279414J339793
3799.7E87316811J512647Q41498O46711R14096M93408M32968J094997J605451J265704
3818E96124291J142204J079023L53038K67804N72026Q13484J042128J039147J187801
3836.4F03620946J259387P03216K89201K24829J50681L23653J129389K346932J618207
3854.8F11666441l76344m75168L90530R84549Q81910N63980Q85665R87649L70204J00434
3875.2F15979850K31862O95169Q19087N18442O51121M82917L10421N86688L29077O3539
$$ plain form
3744.6 555271149 556902647 558232725 560125649 561327338 561804831 562679350 564062536 565337896 566404223
3763 566404223 567666054 569066882 570461333 571643174 572476029 573412716 574728370 576160312 577288628
3781.3 577288628 578195691 579202771 580236077 581226528 582228005 583351970 584697604 585977018 587316811
3799.7 587316811 588829458 589670956 590317667 591231763 591725171 592158139 593253136 594858587 596124291
3818 596124291 597266495 598345518 598698556 598966360 599538386 600351870 601393998 602433145 603620946
3836.4 603620946 604880333 605583549 605872750 606097579 606248260 606571913 607701302 610048234 611666441
3854.8 611666441 611290097 610814929 611205459 612190008 613071918 613635898 614521563 615509212 615879416 615979850
3875.2 615979850 616211712 616906881 617725968 618244410 618895531 619378448 619688869 620275557 620604634 620668173
3895.5F20668173N68569J045882R38952O30200J67191k08258r3163J70529L77298O61909
3915.9F24927282O94990L63052K13981L58284L35931K15471L54350M47631K46405J30236
3936.3F28287613K38836L94047M58717L46064L13223L87370K99097J79708J94430K43962
3956.7F31343067K85387L32713L24070K83480K83837L17335L09408K34544J91749K08556
3977.1F34114146K44379L01540L04699K13742K04087K95937K67386K07305K82288L07977
3997.5F36743486
$$ plain form
3895.5 620668173 621236742 622282624 623221576 623851776 624018967 623810709 623717546 623888075 624265373 624927282
3915.9 624927282 625622272 625985324 626199305 626557589 626893520 627108991 627463341 627910972 628157377 628287613
3936.3 628287613 628526449 628920496 629379213 629725277 630038500 630425870 630724967 630904675 631099105 631343067
3956.7 631343067 631628454 631961167 632285237 632568717 632852554 633169889 633479297 633713841 633905590 634114146
3977.1 634114146 634358525 634660065 634964764 635178506 635382593 635678530 635945916 636153221 636435509 636743486
3997.5 636743486
##END=$$ End of the data block
