##TITLE=Videira - Marcela $$ Begin of the data block
##JCAMP-DX=5.00 $$ ACD/SpecManager v 10.08
##SPECTROMETER/DATA SYSTEM=Alpha
##DATE=24 Oct 2013 10:57:42
##DATA TYPE=INFRARED SPECTRUM
##DATA CLASS=XYDATA
##ORIGIN=
##OWNER=
##NPOINTS=1765
##FIRSTX=399.75695801
##LASTX=3997.56933594
##MAXX=3997.56933594
##MINX=399.75695801
##MAXY=0.81335521
##MINY=0.15896749
##XFACTOR=1.0000000000
##YFACTOR=1.000000000000000e-9
##FIRSTY=0.46894643
##DELTAX=2.03957629
##XUNITS=1/CM
##YUNITS=ARBITRARY UNITS
##XYDATA=(X++(Y..Y))
399.8D68946427n151808l025532j312256p2092P77454J327931J212448R49532O39856
$$ 468946427 463794619 460769087 459456831 459384739 460162193 461490124 462702572 463652104 464291960
418.1D64291960q12411k175093k640545l032595l050655k625943k201706j829356j144051
$$ 464291960 463479549 461304456 458663911 455631316 452580661 449954718 447753012 445923656 444779605
436.5D44779605N2124J599431L097326L863483L925145L621876K781451J578480N32061
$$ 444779605 444831729 446431160 449528486 453391969 457317114 460938990 463720441 465298921 465830982
454.8D65830982k41310j106947j869083k396405k864062l289402l553927l774792m023224
$$ 465830982 465589672 464482725 462613642 460217237 457353175 454063773 450509846 446735054 442711830
473.2D42711830l582269k511531j697868j251161p75784k43575N5254j10090o26952
$$ 442711830 439129561 436618030 434920162 433669001 432893217 432649642 432704896 432594806 431967854
491.5D31967854j152008j355320j422048j727700k137095k459943k840132l203899
$$ 431967854 430815846 429460526 428038478 426310778 424173683 421713740 418873608 415669709
507.9D15669709l340184l611148m109323m594952m928827m643082l633619k317250
$$ 415669709 412329525 408718377 404609054 400014102 395085275 390442193 386808574 384491324
524.2C84491324j029044J08749J126885K110660L339648M989267O262749O151766M854858
$$ 384491324 383462280 383571029 384697914 386808574 390148222 395137489 401400238 407552004 412406862
542.5D12406862L076255J108676o07609j501203j926690k718687l746778m595697n461335
$$ 412406862 415483117 416591793 415984184 414482981 412556291 409837604 406090826 401495129 396033794
560.9C96033794o410599p042021p239550p060438o146342m297703j736075J161277
$$ 396033794 389623195 382581174 375341624 368281186 362134844 357837141 356101066 357262343
577.2C57262343L793061N824745P305324P933825P336974N709320L857822K306670
$$ 357262343 361055404 366880149 374185473 382119298 389456272 395165592 399023414 401330084
593.5D01330084J092970K14666k95967n19067n07891r0867N86271J236558J883388
$$ 401330084 402423054 402637720 402341753 401822686 401314795 401223928 401810199 403046757 404930145
611.9D04930145K544790L164679L757506M325390M969716N397082N143285M421353
$$ 404930145 407474935 410639614 414397120 418722510 423692226 429089308 434232593 438653946
628.2D38653946L574788K913476K567201K226413J795619J531303J346797J148522
$$ 438653946 442228734 445142210 447709411 449935824 451731443 453262746 454609543 455758065
644.5D55758065J118034J258046J388818J447618J351416J025676P83772Q30769R88931
$$ 455758065 456876099 458134145 459522963 460970581 462321997 463347673 464131445 464962214 465951145
662.9D65951145J296103K364129K570748M57316K32667J174480J716077J718521J572818
$$ 465951145 467247248 469611377 472182125 472639441 472872108 474046588 475762665 477481186 479054004
681.2D79054004J372635J016498O75827M16428O8218m97103j434326k713472l848612
$$ 479054004 480426639 481443137 482118964 482535392 482603610 482106507 480672181 477958709 474110097
699.6D74110097m295737l891438k942354j682102j40161J490742L052652M559130N943387
$$ 474110097 469814360 465922922 462980568 461298466 461158305 462649047 465701699 470260829 476204216
717.9D76204216P065535P601917P560193P190645O454647N621791M957854M344821
$$ 476204216 483269751 490871668 498431861 505622506 512077153 517698944 522656798 527001619
734.2E27001619L554821K383590R13680p09415k343774l806650m991591n898059o534516
$$ 527001619 530556440 532940030 533853710 533144295 530800521 526993871 522002280 516104221 509569705
752.6E09569705o941259o943852o328464m969567k792000p3076K817631N574167P859558
$$ 509569705 502628446 495684594 489356130 484386563 481594563 481521487 484339118 489913285 497772843
771D97772843R447127J0383368J0679662J0171771Q977413P478416O100416N127430
$$ 497772843 507219970 517603338 528283000 538454771 547432184 554910600 561011016 566138446
787.3E66138446M649341M665554N123973N706191O073475O081879N717039N154133
$$ 566138446 570787787 575453341 580577314 586283505 592356980 598438859 604155898 609310031
803.6F09310031M563987L985346L362715K646208J789510J016915N06997M9710o52671
$$ 609310031 613874018 617859364 621222079 623868287 625657797 626674712 627181709 627231419 626578748
821.9F26578748j718104l208577m979611o522000p585764q109331q092999p798910
$$ 626578748 624860644 621652067 616672456 610150456 602564692 594455361 586362362 578563452
838.3E78563452p365167o643534n667210m650712l730416l061712k796471k888620
$$ 578563452 571198285 564554751 558887541 554236829 550506413 547444701 544648230 541759610
854.6E41759610k947926k196491J72913M093349Q389175J1694133J3254702J2957037
$$ 541759610 538811684 536615193 536788106 540881455 549270630 560964763 574219465 587176502
870.9E87176502J1075377Q178950M990458J866818j399041m705131p352710q885264
$$ 587176502 598251879 606430829 611421287 613288105 611889064 607183933 599831223 590945959
887.2E90945959r269416q752287p868945p060290o500005o226361o331563o949067
$$ 590945959 581676543 572924256 565055311 557995021 551495016 545268655 538937092 531988025
903.5E31988025p995785r205102j0364593j1403411j2154013j2248129j1404067r595752
$$ 531988025 523992240 514787138 504422545 493019134 480865121 468616992 457212925 447617173
919.8D47617173p143765m623384k449959p41095O25253J874328L069967M243374N480945
$$ 447617173 440473408 435850024 433400065 432658970 433284223 435158551 438228518 442471892 447952837
938.2D47952837O528437O522268M419386p420n661309j0952622j4938980j7485380
$$ 447952837 454481274 461003542 465422928 465415508 459754199 448801577 433862597 416377217
954.5D16377217j8917054j9758135k0375252k0812571k1054119k1121532k0972848
$$ 416377217 397460163 377702028 357326776 336514205 315460086 294338554 273365706
968.8B73365706k0511746j9633740j8257559j6304463j3794809j0861710p748991m794136
$$ 273365706 252853960 233220220 214962661 198658198 184863389 174001679 166252688 161458552
985.1A61458552k249971k41086J199171K093837K557262K690256K596274K390400K039834
$$ 161458552 159208581 158967495 160166666 162260503 164817765 167508021 170104295 172494695 174534529
1003.5A74534529J504928R18627M80697L22863M51580P45550J155585J665547K170310
$$ 174534529 176039457 176958084 177438781 177761644 178213224 178958774 180114359 181779906 183950216
1021.8A83950216K552673K806321K965927K966389K791419K480358K041549J569807
$$ 183950216 186502889 189309210 192275137 195241526 198032945 200513303 202554852 204124659
1038.1B04124659J279608J243010J411140J737907K139539K639457L333956M193932
$$ 204124659 205404267 206647277 208058417 209796324 211935863 214575320 217909276 222103208
1054.5B22103208N157605O304503P724076R272978J0225206R056390M379749k828389
$$ 222103208 227260813 233565316 241289392 250562370 260787576 269843966 274223715 271395326
1070.8B71395326q911759j0798097q803248n392745k315983O839J701504K984539M015803
$$ 271395326 262483567 251685470 242882222 237489477 235173494 235180333 236881837 239866376 243882179
1089.1B43882179M812062N235106N109578M355759L200322K090275J412362J320630
$$ 243882179 248694241 253929347 259038925 263394684 266595006 268685281 270097643 271418273
1105.4B71418273J744658K438605L065944L402829L408313L145992K731264K347678
$$ 271418273 273162931 275601536 278667480 282070309 285478622 288624614 291355878 293703556
1121.8B93703556K209455K501160L190577L926188M088103L081084P88837k273559
$$ 293703556 295913011 298414171 301604748 305530936 309619039 312700123 313488960 311215401
1138.1C11215401n215258p315546q288205q260280p570177o496101n223960l942013
$$ 311215401 306000143 298684597 290396392 282136112 274565935 268069834 262845874 258903861
1154.4B58903861k740025j529396k52038J103073K567709M202067O058634Q094370
$$ 258903861 256163836 254634440 254382402 255485475 258053184 262255251 268313885 276408255
1170.7B76408255J0127604J1922091J3338447J4342755J4874339J4859975J4322668
$$ 276408255 286535859 298457950 311796397 326139152 341013491 355873466 370196134
1185C70196134J3303757J1820465R931892P816941N723744L917545K656848K096146
$$ 370196134 383499891 395320356 405252248 413069189 418792933 422710478 425367326 427463472
1201.3D27463472K194822K768337L612310M535556N374759N946041O070464N711556
$$ 427463472 429658294 432426631 436038941 440574497 445949256 451895297 457965761 463677317
1217.6D63677317M885107L620923K141475P54208l24875r88096j261682j261711j087486
$$ 463677317 468562424 472183347 474324822 475079030 474754155 473766059 472504377 471242666 470155180
1236D70155180q09968m88043m8965N78225J309365J987367K465725K703816K723575
$$ 470155180 469345212 468857169 468808204 469386429 470695794 472683161 475148886 477852702 480576277
1254.3D80576277K597987K471209K446681K506495K605289K685577K659142K459794
$$ 480576277 483174264 485645473 488092154 490598649 493203938 495889515 498548657 501008451
1270.6E01008451K065837J529932R52185M08351r5785n61595r30190j147330j294016
$$ 501008451 503074288 504604220 505556405 505964756 505868971 505307376 504377186 503229856 501935840
1289E01935840j483322j721978j944422k081216k061188j792967j338423r07302o74724
$$ 501935840 500452518 498730540 496786118 494704902 492643714 490850747 489512324 488605022 487930298
1307.4D87930298p11322r87202j405746j813620k161860k546370l006757l610194m401624
$$ 487930298 487218976 486231774 484826028 483012408 480850548 478304178 475297421 471687227 467285603
1325.7D67285603n130171n465568n258143m543989l546775k542049j756966j260042
$$ 467285603 462155432 456689864 451431721 446887732 443340957 440798908 439041942 437781900
1342D37781900r51618p57575o98298q13931j044452j309246j519621j599818j547843
$$ 437781900 436830282 436072707 435374409 434560478 433516026 432206780 430687159 429087341 427539498
1360.4D27539498j424462j197815q59141n15998j21265M49061J061767J403213J578242
$$ 427539498 426115036 424917221 424058080 423542082 423420817 423869878 424931645 426334858 427913100
1378.7D27913100J718819J977205K701938L729165L995806L310948K646715J872360
$$ 427913100 429631919 431609124 434311062 438040227 442036033 445346981 447993696 449866056
1395.1D49866056P20501l28749j008749j353264j629054j848400j910955j933187j847297
$$ 449866056 450586557 450257808 449249059 447895795 446266741 444418341 442507386 440574199 438726902
1413.4D38726902j529336j166582r24856o21199j62363K15709M82053P38531R19849
$$ 438726902 437197566 436030984 435106128 434484929 434322566 434538275 435020328 435758859 436678708
1431.8D36678708J161575J686245J894981J486033J300156J127511P47115J18792o88255
$$ 436678708 437840283 439526528 441421509 442907542 444207698 445335209 446082324 446201116 445512861
1450.1D45512861j258790j446963j683026j974643j246482J69277K006114L677815
$$ 445512861 444254071 442807108 441124082 439149439 437902957 438072234 440078348 443756163
1466.4D43756163M756212O429851R028346R852439R052604Q680135Q635342Q498371
$$ 443756163 448512375 454942226 463970572 473823011 482875615 491555750 500191092 508689463
1482.8E08689463P954598P772743P996440P547438O186009N851090O427824N845785
$$ 508689463 516644061 524416804 532413244 539960682 546146691 551997781 558425605 564271390
1499.1E64271390M720808M216432N036593O064355M294336L059387L245890L541947
$$ 564271390 568992198 573208630 578245223 584309578 588603914 591663301 594909191 598451138
1515.4E98451138L661811L552973L668666L190160K593160K558708K357781K556026
$$ 598451138 602112949 605665922 609334588 612524748 615117908 617676616 620034397 622590423
1531.7F22590423K872765K381921K412199L403187K764941J563012J458228J635253
$$ 622590423 625463188 627845109 630257308 633660495 636425436 637988448 639446676 641081929
1548F41081929J909971K000511K023757K124846K710521K101064O39021P98404J338840
$$ 641081929 642991900 644992411 647016168 649141014 651851535 653952599 654591620 655390024 656728864
1566.4F56728864J552701J304090P24375Q52108J105785M93884J69814J28090q5294
$$ 656728864 658281565 659585655 660310030 661162138 662267923 662761807 662931621 663059711 662974417
1584.7F62974417l71575o19054q85427j149058j492977j936019k358079k787650l196954
$$ 662974417 662602842 661983788 661098361 659949303 658456326 656520307 654162228 651374578 648177624
1603.1F48177624l523469l797472m256069m692316m776955n138338o126880n772174
$$ 648177624 644654155 640856683 636600614 631908298 627131343 621993005 615866125 610093951
1619.4F10093951n071938n445957n577981n376697n169272m349411l513038l556788
$$ 610093951 605022013 599576056 593998075 588621378 583452106 579102695 575589657 572032869
1635.7E72032869l433108k596558j786351r55760j17898K92062N22137J740635K727031
$$ 572032869 568599761 566003203 564216852 563261092 563143194 563435256 563957393 565698028 568425059
1654.1E68425059J708746J703084K670586L625393L905117L695965M406572N068779
$$ 568425059 570133805 571836889 574507475 578132868 582037985 585733950 590140522 595209301
1670.4E95209301M450142M680991N178571M650473M502535N391538O477178N040824
$$ 595209301 599659443 604340434 609519005 614169478 618672013 624063551 630540729 635581553
1686.7F35581553L897130M221976M182995M745841N030393M503966M413128L258407
$$ 635581553 639478683 643700659 647883654 652629495 657659888 662163854 666576982 669835389
1703F69835389K870857L223777K910793K726376K771199K955913L150046K435565J721144
$$ 669835389 672706246 675930023 678840816 681567192 684338391 687294304 690444350 692879915 694601059
1721.4F94601059J867950K057910J967549J936615K014219K471746K121567J401782
$$ 694601059 696469009 698526919 700494468 702431083 704445302 706917048 709038615 710440397
1737.7G10440397J650214J724184J496315J555741J692772J774490J592636J242101
$$ 710440397 712090611 713814795 715311110 716866851 718559623 720334113 721926749 723168850
1754G23168850J249433J291751J250029J348495J156867J069248J245200J327753J273752
$$ 723168850 724418283 725710034 726960063 728308558 729465425 730534673 731779873 733107626 734381378
1772.4G34381378Q69572O26266Q45194J005351R19462Q38398P53999P38502J041353
$$ 734381378 735250950 735877216 736722410 737727761 738647223 739485621 740239620 740978122 742019475
1790.7G42019475J236319Q21590N71490P54654Q72255P57575O76930P55667Q64744
$$ 742019475 743255794 744077384 744648874 745403528 746275783 747033358 747710288 748465955 749330699
1809.1G49330699Q34525O41227N67078O56248P14540P07388P45714P23362N80310N45025
$$ 749330699 750165224 750806451 751373529 752029777 752744317 753451705 754197419 754920781 755501091 756046116
1829.5G56046116M20034K83897L76046M22895L14116L52502N28276L27408K0981O9619
$$ 756046116 756466150 756750047 757126093 757548988 757863104 758215606 758743882 759071290 759092271 759161890
1849.9G59161890J92284K18511J94072J74046J90020K30074L00765M16875M90188K72274
$$ 759161890 759354174 759572685 759766757 759940803 760130823 760360897 760661662 761078537 761568725 761840999
1870.3G61840999L8445J30117K79903L65258M13656L90112L39985L08812L51548L52264
$$ 761840999 761879444 762009561 762289464 762654722 763068378 763458490 763798475 764107287 764458835 764811099
1890.7G64811099K81810L02434K80559J50502R4831J17123J34289J75238K38717J90198
$$ 764811099 765092909 765395343 765675902 765826404 765921235 766038358 766172647 766347885 766586602 766776800
1911.1G66776800M5419M2319J86742K02775J36077J61171J48654J05142O2645L3021
$$ 766776800 766822219 766864538 767051280 767254055 767390132 767551303 767699957 767805099 767867744 767900765
1931.5G67900765Q7202J54674J94430K29239K58983J98066R2506J09911K05994K73645
$$ 767900765 767987967 768142641 768337071 768566310 768825293 769023359 769115865 769225776 769431770 769705415
1951.9G69705415K93851K65479K30133K10762J74284J68026K33292K75910K15590J40071
$$ 769705415 769999266 770264745 770494878 770705640 770879924 771047950 771281242 771557152 771772742 771912813
1972.3G71912813J15156J04964J16408J66476J93953J42098Q4221O1214P3671P2420
$$ 771912813 772027969 772132933 772249341 772415817 772609770 772751868 772836089 772897303 772970974 773043394
1992.6G73043394J5318j1622j0252m0234j02162j57773j93239k31981k71141l00646
$$ 773043394 773058712 773047090 773036838 772996604 772894442 772736669 772543430 772311449 772040308 771739662
2013G71739662l29018l67761m36127m70698m35888m40538m88103n20110n35309n28455
$$ 771739662 771410644 771042883 770606756 770136058 769700170 769259632 768771529 768251419 767716110 767187655
2033.4G67187655n05686m78566m38451l72231l25203l27528l10540k25842j46389j02937
$$ 767187655 766681969 766203403 765764952 765392721 765067518 764739990 764429450 764203608 764057219 763954282
2053.8G63954282n5313K38N3764Q7618R7394P7308M5657N3584Q2672Q3804O2287N8770
$$ 763954282 763898969 763899207 763952971 764040589 764137983 764215291 764260948 764314532 764397204 764481008 764543295 764602065
2078.3G64602065R8646J25110J07109J02461J18792J16825J19865J64211J80542J56641
$$ 764602065 764700711 764825821 764932930 765035391 765154183 765271008 765390873 765555084 765735626 765892267
2098.7G65892267J40012J40368J61171J62900J43230J11461P8737O4731N7220O6579
$$ 765892267 766032279 766172647 766333818 766496718 766639948 766751409 766830146 766894877 766952097 767018676
2119.1G67018676P4506N9485M0114L755l1769k4498N305K8670L0994K5630K1875J3411
$$ 767018676 767093182 767152667 767192781 767196536 767164767 767140269 767145574 767174244 767205238 767230868 767252743 767266154
2143.6G67266154P212K1518P3015J27078J56939J80721K04265K43723L12031L87430
$$ 767266154 767273366 767294884 767367899 767494977 767651916 767832637 768036902 768280625 768592656 768980086
2164G68980086M65214N16594N12242M97997N16534N52356N74708N99026O07491N77927
$$ 768980086 769445300 769961894 770474136 770972133 771488667 772041023 772615731 773214757 773822248 774400175
2184.4G74400175N43117N24700N26666N42164N52893N55515N44787N16951M91440M93467
$$ 774400175 774943292 775467992 775994658 776536822 777089715 777645230 778190017 778706968 779198408 779691875
2204.8G79691875N37336N81860N75781N35906M92811M57167M43995M52638M44055M29153
$$ 779691875 780229211 780811071 781386852 781922758 782415569 782872736 783316731 783769369 784213424 784642577
2225.2G84642577M29571M06802L43143L07262L29018L28779L08335L27706L29972K59459
$$ 784642577 785072148 785478950 785822093 786129355 786458373 786787152 787095487 787423193 787753165 788012624
2245.6G88012624K12848K59519L33368L60132L29554K94625K91646L29137L69012L42071
$$ 788012624 788225472 788484991 788818359 789178491 789508045 789802670 790094316 790423453 790792465 791134536
2265.9G91134536L16024L56734L34442K56180K60890K93374K72751K60412L04759L32832
$$ 791134536 791450560 791807294 792141736 792397916 792658806 792952180 793224931 793485343 793790102 794122934
2286.3G94122934L25799L50714M05490M39585M31537M14193M24445M71115N52773O69778
$$ 794122934 794448733 794799447 795204937 795644522 796076059 796490252 796914697 797385812 797938585 798608363
2306.7G98608363P69972P63119O36458N28932O80506J032948J204372J015127P38799
$$ 798608363 799378335 800141454 800777912 801306844 801987350 803020298 804224670 805239797 805978596
2325.1H05978596O93560P51376N47171K07543K11418L82840L60072J28090m38392j597523
$$ 805978596 806672156 807423532 807970703 808178246 808389664 808772504 809132576 809260666 808822274 807224751
2345.5H07224751k180040r61483J173616K671361K702891J906991Q17120j83820j019895
$$ 807224751 805044711 804083228 805256844 807928205 810631096 812538087 813355207 813171387 812151492
2363.8H12151492j655162k009213k174914k253055k208412k010405j764059j588106
$$ 812151492 810496330 808487117 806312203 804059148 801850736 799840331 798076272 796488166
2380.2G96488166j407087j094162p46668m98712l37422k23577j62601j68324k40505
$$ 796488166 795081079 793986917 793240249 792741537 792404115 792180538 792017937 791849613 791609108
2398.5G91609108l07619l09467k89321k87950l11315l42727l81589m26114m54604m67182
$$ 791609108 791301489 790992022 790702701 790414751 790103436 789760709 789379120 788953006 788498402 788031220
2418.9G88031220m79042m95195n09441n51165n91635n82576n75244n89431n89192o02126
$$ 788031220 787552178 787056983 786547542 785996377 785404742 784822166 784246922 783657491 783068299 782466173
2439.3G82466173o36816o49929o42061o08146n66364n53846n69463n90563n91218n76198
$$ 782466173 781829357 781179428 780537367 779929221 779362857 778809011 778239548 777648985 777057767 776481569
2459.7G76481569n56350n31673n02527m84884m88281m96864n02944m95553m60566m28438
$$ 776481569 775925219 775393546 774891019 774406135 773917854 773420990 772918046 772422493 771961927 771533489
2480.1G71533489m17709m06683m14848m28140l82781k99513k61128k49267k40207k64168
$$ 771533489 771115780 770709097 770294249 769866109 769483328 769183815 768922687 768673420 768433213 768169045
2500.5G68169045k86042k85685k54870k18928k33411k87652l60311l94105l57509l37601
$$ 768169045 767883003 767597318 767342448 767123520 766890109 766602457 766242146 765848041 765490532 765152931
2520.9G65152931l84569m42028m89414n32150n47409n45919n40018n49615n98073o53266
$$ 765152931 764768362 764326334 763836920 763304770 762757361 762211442 761671424 761121809 760523736 759870470
2541.3G59870470o67394o46174o30200o16073n91517n89490o10947o20663o24121o32584
$$ 759870470 759203076 758556902 757926702 757310629 756719112 756129622 755518675 754898012 754273891 753641307
2561.7G53641307o23464n73695n44667n82099o11961o04570n75960n39660n23090n15223
$$ 753641307 753017843 752444148 751899481 751317382 750705421 750100851 749524891 748985231 748462141 747946918
2582.1G47946918m99606m87507m80532m41432l89934l73125m04477m62294m74274m55141
$$ 747946918 747447312 746959805 746479273 746037841 745647907 745274782 744870305 744408011 743933737 743478596
2602.5G43478596m69267n10037n66721o45042p46846q47459q89480q90314r41515j030445
$$ 743478596 743009329 742499292 741932571 741287529 740540683 739693224 738803744 737913430 736971915 735941470
2622.9G35941470j080394j137138j223385j264751j290440j322210j308918j279950
$$ 735941470 734861076 733723938 732500553 731235802 729945362 728623152 727314234 726034284
2639.2G26034284j279533j295626j297057j290858j277387j255035j249195j254856
$$ 726034284 724754751 723459125 722162068 720871210 719593823 718338788 717089593 715834737
2655.5G15834737j256645j234233j192570j138389j084507j102388j165449j154721
$$ 715834737 714578092 713343859 712151289 711012900 709928393 708826005 707660556 706505835
2671.8G06505835j059234r78947r70006r50217q71122q52764r20295r61721r53198
$$ 706505835 705446601 704467654 703497648 702547431 701676309 700823545 699903250 698941529 697988331
2690.2F97988331r40084r59516j013875j070678j095414j107097j133919j168966j206219
$$ 697988331 697048247 696088731 695074856 694004178 692908764 691801667 690667748 689498782 688292563
2708.5F88292563j235724j259863j236915j151383j114488j161933j192212j161933
$$ 688292563 687056839 685796976 684560061 683408678 682294190 681132257 679940045 678778112
2724.8F78778112j102030j039207j012147j019716j009107r62317r27090r31442r32694
$$ 678778112 677676082 676636875 675624728 674605012 673595905 672633588 671706498 670775056 669842362
2743.2F69842362r28282r26495q74698p92623p66992p77722p43925p02918p00056p01487
$$ 669842362 668914080 667987585 667112887 666320264 665553272 664775550 664031625 663328707 662628651 661927164
2763.6F61927164o93739o99580p57336q50976q97884q67724q72612r83835j064777
$$ 661927164 661233425 660533845 659776509 658925533 658027649 657159925 656287313 655303478 654238701
2782F54238701j082242j160144j291335j366019j386762j450479j548588j634479j724839
$$ 654238701 653156459 651996315 650704980 649338961 647952199 646501720 644953132 643318653 641593814
2800.3F41593814j813233j874864j957119k096712k173722k168357k222896k355278
$$ 641593814 639780581 637905717 635948598 633851886 631678164 629509807 627286911 624931633
2816.6F24931633k475976k548159k611756k684116k750397k817392k928317l073335
$$ 624931633 622455657 619907498 617295742 614611626 611861229 609043837 606115520 603042185
2832.9F03042185l173589l242135l256202l250838l378510l574073l718198l783047
$$ 603042185 599868596 596626461 593370259 590119421 586740911 583166838 579448640 575665593
2849.3E75665593l797114l869176m040002m247725m457534m741073n155444n623757
$$ 575665593 571868479 567999303 563959301 559711576 555254042 550512969 545357525 539733768
2865.6E39733768o049157o442606o761253o803513o547391o169319n677998n024970
$$ 539733768 533684611 527242005 520480752 513677239 507129848 500960529 495282531 490257561
2881.9D90257561m260063l402382k574980j923681j383990r40591o86437o26474p16359
$$ 490257561 485997498 482595116 480020136 478096455 476712465 475771874 475085437 474458963 473742604
2900.2D73742604r09418j200705j601637k052247k546966l040105l384740l574997
$$ 473742604 472833186 471632481 470030844 467978597 465431631 462391526 459006786 455431789
2916.6D55431789l625661l453791l061921k512276j818746r62883P0601J175732K209574
$$ 455431789 451806128 448352337 445290416 442778140 440959394 439996511 440067112 441242844 443452418
2934.9D43452418L170132M032434M702031N234242N734264O160200O462395O636441
$$ 443452418 446622550 450654984 455357015 460591257 466325521 472485721 478948116 485584557
2951.2D85584557O705999O702483O613314O432653O172836N860924N516172N190670
$$ 485584557 492290556 498993039 505606353 512039006 518211842 524072766 529588938 534779608
2967.6E34779608M966140M824460M740893M757464M812897M792511M667401M426361
$$ 534779608 539745748 544570208 549311101 554068565 558881462 563673973 568341374 572767735
2983.9E72767735M070937L659606L244341K845227K456665K035022J587451J132905
$$ 572767735 576838672 580498278 583742619 586587846 589044511 591079533 592666984 593799889
3000.2E93799889O84559K95103q6844n13554r40382j317442j554667j690329j871764
$$ 593799889 594484448 594779551 594692707 594179153 593238771 591921329 590366662 588676333 586804569
3018.5E86804569k084851k308488k535284k689242k766848k837777k969265l092110
$$ 586804569 584719718 582411230 579875946 577186704 574419856 571582079 568612814 565520704
3034.9E65520704l138960l223061l347635l398419l392696l386855l414810l494084
$$ 565520704 562381744 559158683 555811048 552412629 549019933 545633078 542218268 538724184
3051.2E38724184l564000l584862l570497l549039l564358l612936l657341l650963
$$ 538724184 535160184 531575322 528004825 524455786 520891428 517278492 513621151 509970188
3067.5E09970188l604829l605247l642678l648043l630906l622711l604829l584117
$$ 509970188 506365359 502760112 499117434 495469391 491838485 488215774 484610945 481026828
3083.8D81026828l578722l549814l497422l473461l488749l492713l442556l391623
$$ 481026828 477448106 473898292 470400870 466927409 463438660 459945947 456503391 453111768
3100.1D53111768l415257l436178l381908l320604l276080l230960l190517l174186
$$ 453111768 449696511 446260333 442878425 439557821 436281741 433050781 429860264 426686078
3116.4D26686078l186702l183157l141910l081142l017068k952874k909452k915025
$$ 426686078 423499376 420316219 417174309 414093167 411076099 408123225 405213773 402298748
3132.8D02298748k909332k861470k819985k766609k685905k616495k580195k546788
$$ 402298748 399389416 396527946 393707961 390941352 388255447 385638952 383058757 380511969
3149.1C80511969k512276k501786k476990k424866k382576k347350k293796k224803
$$ 380511969 377999693 375497907 373020917 370596051 368213475 365866125 363572329 361347526
3165.4C61347526k149373k081066k068371k080947k025455j946152j906484j869023
$$ 361347526 359198153 357117087 355048716 352967769 350942314 348996162 347089678 345220655
3181.7C45220655j834035j815110j764149j682281j656234j680196j627415j525521
$$ 345220655 343386620 341571510 339807361 338125080 336468846 334788650 333161235 331635714
3198C31635714j504839j500726j440733j379997j356959j348466j317680j259267j221776
$$ 331635714 330130875 328630149 327189416 325809419 324452460 323103994 321786314 320527047 319305271
3216.4C19305271j221478j158685j092672j120478j110881j034350r85324r73135r89676
$$ 319305271 318083793 316925108 315832436 314711958 313601077 312566727 311581403 310608268 309618592
3234.7C09618592r87321r33289q94845q69602q40872q35747q18104p65442p14332p06107
$$ 309618592 308631271 307697982 306803137 305933535 305092663 304256916 303438812 302673370 301959038 301252931
3255.1C01252931p01427o62387o25520o03229n92798o06180o20216o18100o10590n76377
$$ 301252931 300551504 299889117 299263597 298660368 298067570 297461390 296841174 296223074 295612484 295036107
3275.5B95036107n53518n70834n59002n10335m87953n07385n28455n40972n63770n70446
$$ 295036107 294482589 293911755 293352753 292842418 292354465 291847080 291318625 290777653 290213883 289643437
3295.9B89643437n33849m95524m86999n04792n48661n91665o19501o13809n86301n89669
$$ 289643437 289109588 288614064 288127065 287622273 287073612 286481947 285862446 285248637 284662336 284072667
3316.3B84072667n97834n73427n70416o07073o38664o46383o30617o14405n97536n97477
$$ 284072667 283474833 282901406 282330990 281723917 281085253 280438870 279808253 279193848 278596312 277998835
3336.7B77998835o53476p28547p23422o29723n75095o04153o72340p26521p16746o78063
$$ 277998835 277345359 276616812 275893390 275263667 274688572 274084419 273412079 272685558 271968812 271290749
3357.1B71290749o57648o54757o59406o24001o13451p02083p70986p30395o36101n79596
$$ 271290749 270633101 269978344 269318938 268694937 268081486 267379403 266608417 265878022 265241921 264662325
3377.5B64662325n42104n15759n32091n15013m09425l14206l67313n02050n00113l65704
$$ 264662325 264120221 263604462 263072371 262557358 262147933 261833727 261466414 260964364 260464251 260098547
3397.9B60098547k96295l53962m26591l98278l32206k76029k25008k30223k59459k47329
$$ 260098547 259802252 259448290 259021699 258623421 258291215 258015186 257790178 257559955 257300496 257053167
3418.3B57053167j97918j58906j19447o9350k5422l010N693K056m3899o9797K0683
$$ 257053167 256855249 256696343 256576896 256507546 256482124 256479114 256484807 256486863 256442964 256373167 256393850
3440.7B56393850J56343K12133J85728J05738Q3209J53750K23875L04669L72678L28422
$$ 256393850 256550193 256762326 256948054 257053792 257137001 257290751 257514626 257819295 258191973 258520395
3461.1B58520395K77489L61472M70519M16667K55286K41071L50088M36723M57526M00454
$$ 258520395 258797884 259159356 259629875 260046542 260301828 260542899 260892987 261329710 261787236 262187690
3481.5B62187690L81708M39584M60505M69387N10722N06223M95493M84407M96954N60999
$$ 262187690 262569398 263008982 263469487 263938874 264449596 264955819 265451312 265935719 266432673 266993672
3501.9B66993672N50568M95583M93973N53519O63697P01815O38396O19709P06822Q11130
$$ 266993672 267544240 268039823 268533796 269087315 269751012 270452827 271091223 271710932 272417754 273228884
3522.3B73228884P70986O69628O77586P65979Q60810Q90583Q51363Q70079R93907J091212
$$ 273228884 273999870 274669498 275347084 276113063 276973873 277864456 278715819 279585898 280579805 281671017
3542.7B81671017J108319J058102J023531J099884J225025J274377J322090J448244
$$ 281671017 282779336 283837438 284860969 285960853 287185878 288460255 289782345 291230589
3559B91230589J527131J529872J627833J841247J851857J756310J852423K047032K177328
$$ 291230589 292757720 294287592 295915425 297756672 299608529 301364839 303217262 305264294 307441622
3577.4C07441622K278894K387464K443016K546787K768904K813548K694935K812176
$$ 307441622 309720516 312107980 314550996 317097783 319866687 322680235 325375170 328187346
3593.7C28187346L023357L124773L201127L239125L180027L209353L483295L636033
$$ 328187346 331210703 334335476 337536603 340775728 343955755 347165108 350648403 354284436
3610C54284436L601968L596067L561080L792405M045427L708631L391385L650814M475683
$$ 354284436 357886404 361482471 365043551 368835956 372881383 376590014 379981399 383632213 388107896
3628.4C88107896M504651L605246L515512L776491L849506L915072L881216L810167
$$ 388107896 392612547 396217793 399733305 403509796 407359302 411274374 415155590 418965757
3644.7D18965757M165292M884272M651279L659695L649920M216195M028737L724247
$$ 418965757 423131049 428015321 432666600 436326295 439976215 444192410 448221147 451945394
3661D51945394L768176L686428L730864M256367M195839L539682L872722L789753K957284
$$ 451945394 455713570 459399998 463130862 467387229 471583068 475122750 478995472 482785225 485742509
3679.4D85742509K836287K877593K919496L428757L737271L036975K378822K321899
$$ 485742509 488578796 491456389 494375885 497804642 501541913 504578888 506957710 509279609
3695.7E09279609K442062K572178K681494K399624K004802K099693K520442K589762
$$ 509279609 511721671 514293849 516975343 519374967 521379769 523479462 525999904 528589666
3712E28589666J933634J515746J763881K052784K056837J935541J800776J586258J563788
$$ 528589666 530523300 532039046 533802927 535855711 537912548 539848089 541648865 543235123 544798911
3730.3E44798911J896798K148450J926541J179993O96600J311361K241970J691401
$$ 544798911 546695709 548844159 550770700 551950693 552647293 553958654 556200624 557892025
3746.7E57892025J257061J873553J563371P94231R27926J427054J400113J097202J195908
$$ 557892025 559149086 561022639 562586010 563380241 564308167 565735221 567135334 568232536 569428444
3765E69428444J367032J426697J309812R78172R43780J221895J393914J187921R75907
$$ 569428444 570795476 572222173 573531985 574510157 575453937 576675832 578069746 579257667 580233574
3783.4E80233574J063585J046837R30011R75370J115918J205206J048744J121283J419425
$$ 580233574 581297159 582343996 583274007 584249377 585365295 586570501 587619245 588740528 590159953
3801.7E90159953R67383P84099J060009P01487M70996Q96514J353681J087069J005232
$$ 590159953 591127336 591911435 592971444 593672931 594143927 595040441 596394122 597481191 598486423
3820.1E98486423J160861O44385M99607O70373P44283Q93712R05335J039982J183629
$$ 598486423 599647284 600291669 600791276 601461649 602205932 603099644 604004979 605044961 606228590
3838.4F06228590P62463M49478M65334L32236K42293O89328J854956J768350J10150
$$ 606228590 606991053 607440531 607905865 608238101 608480394 609169722 611024678 612793028 612903178
3856.8F12903178k70903K95698Q07107Q37207N89192P95662R08494N14924L76106L56793
$$ 612903178 612632275 612927973 613735080 614572287 615161479 615957141 616865635 617380559 617756665 618113458
3877.2F18113458N70059P25389N18321O03676N10753L86357P15315N68927J29878L07918
$$ 618113458 618683517 619408906 619927227 620530903 621041656 621428013 622143328 622712255 622842133 623150051
3897.6F23150051P21931Q25107P24316M19259O1452L9637J98603L37720N23508N77509
$$ 623150051 623871982 624697089 625421405 625840664 625902116 625941753 626140356 626478076 627001584 627579093
3918F27579093L63588K33293L75390L67701K04802L24904M93408L61681K09331K30313
$$ 627579093 627942681 628175974 628551364 628919065 629123867 629448771 629942179 630303860 630513191 630743504
3938.4F30743504L28481M29630M09603L64125L68833K81513J80662K10702K75135L05713
$$ 630743504 631071985 631501615 631911218 632275343 632644176 632925689 633106351 633317053 633592188 633897901
3958.8F33897901L47852L40879K95222K95997L22640L25441K85268K22385J80900J97887
$$ 633897901 634245753 634586632 634881854 635177851 635500491 635825932 636111200 636333585 636514485 636712372
3979.2F36712372K63810L02554K71022K37822K51055K46644K18869K30014K43544
$$ 636712372 636976182 637278736 637549758 637787580 638038635 638285279 638504148 638734162 638977706
3997.5F38977706
$$ 638977706
##END=$$ End of the data block
