##TITLE=Videira - Marcela $$ Begin of the data block
##JCAMP-DX=5.00 $$ ACD/SpecManager v 10.08
##SPECTROMETER/DATA SYSTEM=Alpha
##DATE=24 Oct 2013 10:57:42
##DATA TYPE=INFRARED SPECTRUM
##DATA CLASS=XYDATA
##ORIGIN=
##OWNER=
##NPOINTS=1765
##FIRSTX=399.75695801
##LASTX=3997.56933594
##MAXX=3997.56933594
##MINX=399.75695801
##MAXY=0.81331718
##MINY=0.15898663
##XFACTOR=1.0000000000
##YFACTOR=1.000000000000000e-9
##FIRSTY=0.46841255
##DELTAX=2.03957629
##XUNITS=1/CM
##YUNITS=ARBITRARY UNITS
##XYDATA=(X++(Y..Y))
399.8D68412548m821330k812058j296729q6724P57187J444340J341701R39697M50670
418.1D64329302j225829k477914k817869l101558k983510k534479k052873j637996
434.4D45497274j028597J59502J545101K876491M027337M262298L454208K473057J765728
452.8D65032399P82788k83599j136363j809448k319932k786785l251523l725112m086256
471.1D46416169m080504l331601k282381j658440j241326o44982k42889j98335k89976
489.5D32445735o13481j037031j309336j500994j700610k013713k410680k762973l128529
507.9D15968388l457516l775656m085660m444242m835188m677594l776401k458781
524.2C84457350j115054J27852J284182K213240L259599M790693O217659O403506N011499
$$ plain form
399.8 468412548 463591218 460779160 459482431 459395707 460152894 461597234 462938935 463878632 464329302
418.1 464329302 463103473 460625559 457807690 454706132 451722622 449188143 447135270 445497274
434.4 445497274 444468677 444628179 446173280 449049771 453077108 457339406 460793614 463266671 465032399
452.8 465032399 465815187 465531588 464395225 462585777 460265845 457479060 454227537 450502425 446416169
471.1 446416169 442335665 439004064 436721683 435063243 433821917 433176935 432934046 432735711 432445735
489.5 432445735 431832254 430795223 429485887 427984893 426284283 424270570 421859890 419096917 415968388
507.9 415968388 412510872 408735216 404649556 400205314 395370126 390692532 386916131 384457350
524.2 384457350 383342296 383470148 384754330 386967570 390227169 395017862 401235521 407639027 412650526
542.5D12650526K915889R96559m92841j394182j930237k732366l719181m560739n374551
560.9C96358877o203562o890028p374972p271111o220729m388630j876801R91046L611744
579.2C60735834N798190P456810Q024722P325351N752594L947168K383054J191020
595.6D02614743L37481k10226m38630m76897k32905M35591J280784J972378K554416
613.9D07836735L205151L854483M365176M854888N247861N134463M535020L746747
630.2D42780524L007830K463609K172291J979262J644671J218140J000076J108498
646.5D57374901J313090J366258J346349J324714J128256Q31604P48247R21786J312494
664.9D67667699K361953K452999M80205L86685J254738J757145J810431J629055J347273
$$ plain form
542.5 412650526 415566415 416562974 416070133 414675951 412745714 410013348 406294167 401733428 396358877
560.9 396358877 390155315 383265287 375890315 368619204 362398475 358009845 356133044 357124090 360735834
579.2 360735834 366534024 373990834 382015556 389340907 395093501 399040669 401423723 402614743
595.6 402614743 402952224 402741998 402303368 401826471 401593566 402029157 403309941 405282319 407836735
613.9 407836735 411041886 414896369 419261545 424116433 429364294 434498757 439033777 442780524
630.2 442780524 445788354 448251963 450424254 452403516 454048187 455266327 456266403 457374901
646.5 457374901 458687991 460054249 461400598 462725312 463853568 464685172 465433419 466355205 467667699
664.9 467667699 470029652 472482651 472962856 473349541 474604279 476361424 478171855 479800910 481148183
683.3D81148183R72629O46263M00901P3731m97192j421273k697229l866941m351973
701.6D70407099l988654l010005j677900m9591J666397L205269M586667N866140P043213
720D84048635P709205P593334P089108O462872N753696M972339M190683L424704K459407
738.3E33703983J057565p47859k507747l916561m970193n818367o520689p003128p071764
756.7D96205240o401479m889816k702385p4446K766847N551666P925928R612620J0527849
775E18522024J0636628J0050416Q998275P570147O120026N116225M699230M783928
791.4E76496899N191386N689502O060063O038428N642414N145729M600584M029810
807.7F18894815L407062K635359J706899R12129M62830L9638p24256j870990l369928
$$ plain form
683.3 481148183 482120812 482767075 483167976 483241707 482744515 481323242 478626013 474759072 470407099
701.6 470407099 466418445 463408440 461730540 461680949 463347346 466552615 471139282 477005422 484048635
720 484048635 491757840 499351174 506440282 512903154 518656850 523629189 527819872 531244576 533703983
738.3 533703983 534761548 534013689 531505942 527589381 522619188 516800821 510280132 503277004 496205240
756.7 496205240 489803761 484913945 482211560 482137114 484903961 490455627 498381555 507994175 518522024
775 518522024 529158652 539209068 548207343 555777490 561897516 567013741 571712971 576496899
791.4 576496899 581688285 587377787 593437850 599476278 605118692 610264421 614865005 618894815
807.7 618894815 622301877 624937236 626644135 627556264 628019094 628058732 627334476 625463486 622093558
826F22093558n044818o539225p637024q162618q119225p780731p320762o654858n698920
844.4E59135377m610300l695130l080726k800166k870083k921164k161503J99199M152715
862.7E41348219Q484840J1715770J3162911J2837589J1029064Q216501M988968J715481
879.1F13499343j611828m826665p360161q832335r256065q833587p963062p054507
895.4E57761133o420791o237448o463527p031918p920206r067833j0334372j1456639
911.7D92828399j2145102j2188494j1383057r627223p181644m605920k394586p06315
928D32596058O45339J890332L107696M329473N512089O436258O414920M349947p0125
946.4D65211987n693465j0953754j4950901j7526389j8974930j9793212k0361126k0759284
$$ plain form
826 622093558 617048740 610509515 602872491 594709873 586590648 578809917 571489155 564834297 559135377
844.4 559135377 554525077 550829947 547749221 544949055 542078972 539157808 536996305 537195504 541348219
862.7 541348219 549833059 561548829 574711740 587549329 598578393 606794894 611783862 613499343
879.1 613499343 611887515 607060850 599700689 590868354 581612289 572778702 564815640 557761133
895.4 557761133 551340342 545102894 538639367 531607449 523687243 514619410 504285038 492828399
911.7 492828399 480683297 468494803 457111746 447484523 440302879 435696959 433302373 432596058
928 432596058 433241397 435131729 438239425 442568898 448080987 454517245 460932165 465282112 465211987
946.4 465211987 459518522 448564768 433613867 416087478 397112548 377319336 356958210 336198926
962.7C36198926k1010876k1138251k1004408k0493001j9586608j8211245j6254828
977A98499709j3741091j0814428p707372m758433k241343k50414J208082K116740K556160
995.3A64867610K687618K624899K411127K052456J525387R24200M73082K92614M05416
1013.7A78264409P32407J189217J710490K168789K504051K743438K907827K964914
1030A95185542K849594K525762K052068J585290J284450J216397J400158J756534K174929
1048.3B12030724K684742L353357M160896N102039O282240P757201R314701J0204733
1064.7B60890633Q994162M358709k782583q833558j0769367q863494n439997k294793
1081B35259712L0666J708627K980113L986940M791781N238265N116105M388124L262102
$$ plain form
962.7 336198926 315188050 294049799 273045391 252552390 232965782 214754537 198499709
977 198499709 184758618 173944190 166236818 161478385 159237042 158986628 160194710 162311450 164867610
995.3 164867610 167555228 170180127 172591254 174643710 176169097 177093297 177566379 177858993 178264409
1013.7 178264409 178996816 180186033 181896523 184065312 186569363 189312801 192220628 195185542
1030 195185542 198035136 200560898 202612966 204198256 205482706 206699103 208099261 209855795 212030724
1048.3 212030724 214715466 218068823 222229719 227331758 233613998 241371199 250685900 260890633
1064.7 260890633 269884795 274243504 271460921 262627363 251857996 242994502 237554505 235259712
1081 235259712 235290378 236999005 239979118 243966058 248757839 253996104 259112209 263500333 266762435
1099.3B66762435K117724J362383J265764J755387K456158L050387L394246L429145
1115.6B85593629L173441K736270K334625K202868K503455L193110L954649M135758
1132C09827805L084361P57039k296865n248875p352620q310020q262962p522494o435662
1150.3B68239707n228639l971368k713680j467526k18094J078427K522290M199654
1166.6B62440771O072283Q058816J0075062J1938155J3391912J4348894J4856965J4860213
1182.9C56043071J4332473J3306379J1816174R946912P821113N689800L910810K695382
1199.3D25562114K132862K216250K782643L627181M550189N374998N930960O068796
1215.6D58245993N710333M839897L566504K143741P90566l08842r71824j225769j222402
$$ plain form
1099.3 266762435 268880159 270242542 271508306 273263693 275719851 278770238 282164484 285593629
1115.6 285593629 288767070 291503340 293837965 296040833 298544288 301737398 305692047 309827805
1132 309827805 312912166 313669205 311372340 306123465 298770845 290460825 282197863 274675369 268239707
1150.3 268239707 263011068 259039700 256326020 254858494 254640400 255718827 258241117 262440771
1166.6 262440771 268513054 276571870 286646932 298585087 311976999 326325893 341182858 356043071
1182.9 356043071 370375544 383681923 395498097 405445009 413266122 418955922 422866732 425562114
1199.3 425562114 427694976 429911226 432693869 436321050 440871239 446246237 452177197 458245993
1215.6 458245993 463956326 468796223 472362727 474506468 475297034 474988192 474016368 472790599 471568197
1233.9D71568197j079589q55297n15133j6630O10978J303643J947850K425551K686650
1252.3D78076220K729266K636105K511233K453506K500594K598941K675623K644360
1268.6D98825848K445459K049149J513004R64999M36068p6473n30005r00447j159906
1287E03567696j335919j498938j688898j899570k058744k067983j827717j362056q84473
1305.3D88943398o33389p04854j014025j426011j841783k193988k530485k963245l585219
1323.7D72050399m390508n126447n453795n236119m534334l527164k520860j774072
1340D39487100j279205r42052p46280p01666q27729j066983j318276j518101j613587
1358.3D29473221j562625j437932j221806q67844m91321r6291M34578J025289J408934
$$ plain form
1233.9 471568197 470488608 469633311 469118178 469101548 469712526 471016169 472964019 475389570 478076220
1252.3 478076220 480805486 483441591 485952824 488406330 490906924 493505865 496181488 498825848
1268.6 498825848 501271307 503320456 504833460 505798459 506234527 506158054 505628049 504727602 503567696
1287 503567696 502231777 500732839 499043941 497144371 495085627 493017644 491189927 489827871 488943398
1305.3 488943398 488310009 487605155 486591130 485165119 483323336 481129348 478598863 475635618 472050399
1323.7 472050399 467659891 462533444 457079649 451843530 447309196 443782032 441261172 439487100
1340 439487100 438207895 437265843 436519563 435817897 434990168 433923185 432604909 431086808 429473221
1358.3 429473221 427910596 426472664 425250858 424383014 423891693 423795402 424229980 425255269 426664203
1376.7D26664203J610518J723975J963734K668828L695339L995657L305435K601326
1393D48229015J832515P28935l03447r77427j325041j609832j834601j930476j980155
1411.4D40829486j882732j547426j174212q95381n67496j28686K36928N05329P49379
1429.7D36125189Q99941J130849J692921J924634J473605J288265J151771P68065J26779
1448.1D46582019o75290j237810j436144j705587k011150j256734J69932K004683L688276
1466.4D44122195M761279O410777R019524R873897R062857Q676976Q637785Q505226
1482.8E09070516P975995P783532P949293P512093O199598N837440O408513N886495
1499.1E64623475M764319M190146M943908O025791M361033L109336L263116L544033
$$ plain form
1376.7 426664203 428274721 429998696 431962430 434631258 438326597 442322254 445627689 448229015
1393 448229015 450061530 450790465 450487018 449509591 448184550 446574718 444740117 442809641 440829486
1411.4 440829486 438946754 437399328 436225116 435329735 434762239 434633553 434870481 435375810 436125189
1429.7 436125189 437025130 438155979 439848900 441773534 443247139 444535404 445687175 446455240 446582019
1448.1 446582019 445906729 444668919 443232775 441527188 439516038 438259304 438429236 440433919 444122195
1466.4 444122195 448883474 455294251 464313775 474187672 483250529 491927505 500565290 509070516
1482.8 509070516 517046511 524830043 532779336 540291429 546491027 552328467 558736980 564623475
1499.1 564623475 569387794 573577940 578521848 584547639 588908672 592018008 595281124 598825157
1515.4E98825157L645301L514051L619492L193915K666056K636254K389610K541721
1531.7F23031557K843320K358377K346516L319144K797127J640439J518011J681268
1548F41535759J913071J979053K012789K092123K655029K159536P39038Q33929J311838
1566.4F57232165J489103J304686P74622Q49128J123607N73278J94549J17958p9155
1584.7F63579941l81828o36696q76725j131773j493991j943349k356828k770543l149628
1603.1F48838580l493965l810346m243672m648387m760385n162120o127953n726695
1619.4F10865057n057633n466402n566835n318046n111992m355729l579020l581822
1635.7E72827578l333211k476931j736224r81092j58608L26335N71549J719117K757073
$$ plain form
1515.4 598825157 602470458 605984509 609604001 612797916 615463972 618100226 620489836 623031557
1531.7 623031557 625874877 628233254 630579770 633898914 636696041 638336480 639854491 641535759
1548 641535759 643448830 645427883 647440672 649532795 652187824 654347360 655086398 655920327 657232165
1566.4 657232165 658721268 660025954 660800576 661649704 662773311 663346589 663541138 663659096 663579941
1584.7 663579941 663198113 662561417 661684692 660552919 659058928 657115579 654758751 651988208 648838580
1603.1 648838580 645344615 641534269 637290597 632642210 627881825 622719705 616591752 610865057
1619.4 610865057 605807424 600341022 594774187 589456141 584344149 579988420 576409400 572827578
1635.7 572827578 569494367 567017436 565281212 564300120 564141512 564467847 565039396 566758513 569515586
1654.1E69515586J831710J763702K667546L641903L970206L733456M387021N054772
1670.4E96565902M454077M673600N175054M645645M479468N337477O424904N064785
1686.7F36820912L941238M244864M174054M672587M946589M461825M387617L256619
1703F70906305K878130L255665K945900K722025K736986K893448L109872K476752J758516
1721.4F95683599J856982K033591J935423J900613J987636K440572K113879J392066
1737.7G11344361J627744J738667J517952J554667J697600J798988J609027J234055
1754G24123061J230418J284719J253426J358867J176476J049221J171469J259149J284539
1772.4G35191345R40979O53326Q28803J010537R45806Q39711P28905P15017J015187
$$ plain form
1654.1 569515586 571347296 573110998 575778544 579420447 583390653 587124109 591511130 596565902
1670.4 596565902 601019979 605693579 610868633 615514278 619993746 625331223 631756127 636820912
1686.7 636820912 640762150 645007014 649181068 653853655 658800244 663262069 667649686 670906305
1703 670906305 673784435 677040100 679986000 682708025 685445011 688338459 691448331 693925083 695683599
1721.4 695683599 697540581 699574172 701509595 703410208 705397844 707838416 709952295 711344361
1737.7 711344361 712972105 714710772 716228724 717783391 719480991 721279979 722889006 724123061
1754 724123061 725353479 726638198 727891624 729250491 730426967 731476188 732647657 733906806 735191345
1772.4 735191345 736132324 736785650 737614453 738624990 739570796 740410507 741139412 741854429 742869616
1790.7G42869616J203715Q27134O05822P59482Q59857P84278P30991P78556Q44002
1809.1G50263453Q14855O41882N59747O33478O90580O91175P33078P09236N78999N54621
1829.5G56871104M41075L12268L82662M10199L10779L53277N17428L30090N2393J09493
1849.9G60090768K21432K22206J74403J51873J82986K35140K99692L92556M70043L02672
1870.3G62743771O6221J20163K80618L74079M01974L67105L23713L01718L41774L53634
1890.7G65674770K99632K95937K66552J95623J52767J10209J07526J62185K22444J99556
1911.1G67687201P9275M6968J45912J55032J15633J74344J74343J21832Q6606N9187
1931.5G68846333Q9169J59025K16067K27511K30848J60694N5969J03593K28226K94209
$$ plain form
1790.7 742869616 744073331 744900465 745506287 746265769 747125626 747909904 748640895 749419451 750263453
1809.1 750263453 751078308 751720190 752279937 752913415 753603995 754295170 755028248 755737484 756316483 756871104
1829.5 756871104 757312179 757624447 758007109 758417308 758728087 759081364 759598792 759928882 759981275 760090768
1849.9 760090768 760312200 760534406 760708809 760860682 761043668 761278808 761578500 761971056 762441099 762743771
1870.3 762743771 762809992 762930155 763210773 763584852 763986826 764353931 764677644 764979362 765321136 765674770
1890.7 765674770 765974402 766270339 766536891 766732514 766885281 766995490 767103016 767265201 767487645 767687201
1911.1 767687201 767766476 767813444 767959356 768114388 768230021 768404365 768578708 768700540 768787146 768846333
1931.5 768846333 768935502 769094527 769310594 769538105 769768953 769929647 769985616 770089209 770317435 770611644
1951.9G70611644K93195K55346K36929K27809J80542J71900K34544K65539K11775J50204
1972.3G72839427J25349J19865J46508J77979J81437J43170P3016K7835N7042Q0466
1992.6G73972094L3855Q941J7882k5452j22428j83105j96517k02953k28703k89679
2013G72783935l36289l65854m38451m88758m55499m26352m55260n22256n62132n36680
2033.4G68196404m90189m66644m33863l57210l04580l00705k92719k48074j69933q5473
2053.8G65047014k7836O318L3141N3048Q1420Q7738O8664O0201N8770Q4043J15156
2076.3G65667677J03891Q9943R1553R0182J10209J42216J50443J33931J25647J41561
2096.7G66847253J70469J67668J44601J56879J61827J42515J27792R7215N8532M5240
$$ plain form
1951.9 770611644 770904839 771160185 771397114 771624923 771805465 771977365 772211909 772477448 772689223 772839427
1972.3 772839427 772964776 773084641 773231149 773409128 773590565 773733735 773806751 773834586 773891628 773972094
1992.6 773972094 774005949 774014890 774032772 774007320 773884892 773701787 773505270 773302317 773073614 772783935
2013 772783935 772447646 772081792 771643341 771154583 770699084 770272732 769817472 769295216 768733084 768196404
2033.4 768196404 767706215 767239571 766805708 766448498 766143918 765843213 765550494 765302420 765132487 765047014
2053.8 765047014 765019178 765025496 765058637 765111685 765193105 765280843 765349507 765409708 765468478 765552521 765667677
2076.3 765667677 765771568 765861511 765953064 766043246 766153455 766295671 766446114 766580045 766705692 766847253
2096.7 766847253 767017722 767185390 767329991 767486870 767648697 767791212 767919004 768016219 768074751 768119991
2117.1G68119991N2333O6042N9724L2544J1205j2397k3783K384M1068M0650K2114K0325
2141.5G68432200N364o616L3736J05381J38224J32262J58310K24650K75135L18170
2161.9G69816816L98695M73738M97878M99785N08427N27740N54383N67913N76615N95331
2182.3G75017321N89013N48005N18024N25236N51105N58495N44429N28336N09381M86791
2202.7G80376136M92096N38111N82397O00696N82993N26309M57883M10556M14789M41849
2223.1G85423815M56214M42207L98696L50654L22282L31044L44634L34323L13937K93851
2243.5G89011657K69413K45869K58267L10779L39508L22223L17812L21209L14176L34859
2263.9G92045772L47376L42309L54529L23355K58565K41756K65718K89738K83599K84612
$$ plain form
2117.1 768119991 768172324 768238366 768298090 768330634 768341839 768329442 768305659 768308043 768349111 768389761 768411875 768432200
2141.5 768432200 768437564 768430948 768464684 768570065 768708289 768840551 768998861 769223511 769498646 769816816
2161.9 769816816 770215511 770689249 771187127 771686912 772195339 772723079 773277462 773845375 774421990 775017321
2182.3 775017321 775606334 776154339 776672363 777197599 777748704 778307199 778851628 779379964 779889345 780376136
2202.7 780376136 780868232 781406343 781988740 782589436 783172429 783698738 784156621 784567177 784981966 785423815
2223.1 785423815 785880029 786322236 786720932 787071586 787393868 787724912 788069546 788403869 788717806 789011657
2243.5 789011657 789281070 789526939 789785206 790095985 790435493 790757716 791075528 791396737 791710913 792045772
2263.9 792045772 792393148 792735457 793089986 793413341 793671906 793913662 794179380 794469118 794752717 795037329
2284.3G95037329L30210L59952L46482L59893M16458M45246M34697M14670M22775N11885
2304.7G99079597O37054P18952P18116O05524N06341O57082R80795J134932R86337
2323.1H06024730P23303O23822O59466M92930J91510K02834L51966K73645L8147m17829
2343.5H09164524j445949j982450q21770J201093K512217K331018J605928P52569j71423
2361.8H13145757r41634j506806j867413k065719k107381k007664j834333j661002
2378.1G99153805j509309j303673j025975p31527m74871l06665k08974j55270j68205
2396.5G93269336k46525l18706l17871k75493k68638l14116l52860l74973m24683m73797
2416.9G89901674m68970m37080m50135n14149n74053n86509n73635n82278n95093n92113
$$ plain form
2284.3 795037329 795367539 795727491 796073973 796433866 796850324 797295570 797730267 798144937 798567712 799079597
2304.7 799079597 799716651 800435603 801153719 801759243 802265584 802922666 803903461 805038393 806024730
2323.1 806024730 806748033 807371855 808031321 808524251 808715761 808918595 809270561 809544206 809582353 809164524
2343.5 809164524 807718575 805736125 804914355 806115448 808627665 810958683 812564611 813317180 813145757
2361.8 813145757 812204123 810697317 808829904 806764185 804656804 802649140 800814807 799153805
2378.1 799153805 797644496 796340823 795314848 794583321 794108450 793801785 793592811 793437541 793269336
2396.5 793269336 793022811 792704105 792386234 792110741 791842103 791527987 791175127 790800154 790375471 789901674
2416.9 789901674 789432704 788995624 788545489 788031340 787457287 786870778 786297143 785714865 785119772 784527659
2437.3G84527659o00397o23226o43015o43432o12259n85318n81443n79179n78463n86331
2457.7G78494596n78045n40495n21004n22912m94003m73261n03659n03183m59552m38988
2478.1G73459494m34458m19140m07875m21524m21166l57926k77758k53319k43187k36512
2498.5G69986629k81095l19958k93612k39253k22802k43664k82407l42131l62694l32653
2518.9G67066360l43502l96490m38929m88698n30124n34832n39661n52654n49376n70715
2539.2G62121379o35266o72698o63102o45041o16968n83410n87106o21557o19829o09576
2559.6G55866826o43135o40451n67258n29706n76139o09636n81384n45800n18143m94182
2580G50160992m97699n30719n43714m93050m08172l65377l70800l99172m54844m88281
$$ plain form
2437.3 784527659 783927262 783304036 782661021 782017589 781405330 780820012 780238569 779659390 779080927 778494596
2457.7 778494596 777916551 777376056 776855052 776332140 775838137 775364876 774861217 774358034 773898482 773459494
2478.1 773459494 773025036 772605896 772198021 771776497 771355331 770997405 770719647 770466328 770223141 769986629
2498.5 769986629 769705534 769385576 769091964 768852711 768629909 768386245 768103838 767761707 767399013 767066360
2518.9 767066360 766722858 766326368 765887439 765398741 764868617 764333785 763794124 763241470 762692094 762121379
2539.2 762121379 761486113 760813415 760150313 759505272 758888304 758304894 757717788 757096231 756476402 755866826
2559.6 755866826 755223691 754583240 754015982 753486276 752910137 752300501 751719117 751173317 750655174 750160992
2580 750160992 749663293 749132574 748588860 748095810 747687638 747322261 746951461 746552289 746097445 745609164
2600.4G45609164m75287m61936m91083n65946o49273p36952q32200q88109r09448r44972
2620.8G38653958r89199j048565j147270j241922j272321j260817j273751j303316
2637.1G29116797j299798j284659j303136j319766j294971j266360j260460j249909
2653.5G18837738j249850j257717j216829j156092j126528j119435j116514j125455
2669.8G09469318j130223j089454j035273r98079r32217q38280q33630r20177r44078
2688.1G00747907r29475r60290r77039r91762j045048j079858j096427j123607j171291
2706.5F91373110j242101j262069j216293j168608j139105j153230j175106j150369
2722.8F81866229j135767j134574j088500j024902r99511r99748r81212r49502r26792
$$ plain form
2600.4 745609164 745133877 744671941 744180858 743614912 742965639 742228687 741396487 740508378 739598930 738653958
2620.8 738653958 737664759 736616194 735468924 734227002 732954681 731693864 730420113 729116797
2637.1 729116797 727816999 726532340 725229204 723909438 722614467 721348107 720087647 718837738
2653.5 718837738 717587888 716330171 715113342 713957250 712830722 711711287 710594773 709469318
2669.8 709469318 708339095 707249641 706214368 705216289 704284072 703445792 702612162 701691985 700747907
2688.1 700747907 699818432 698858142 697881103 696889341 695844293 694764435 693668008 692544401 691373110
2706.5 691373110 690131009 688868940 687652647 686484039 685344934 684191704 683016598 681866229
2722.8 681866229 680730462 679595888 678507388 677482486 676482975 675483227 674502015 673552513 672625721
2741.2F72625721r09150r13143r16958q50439p65503p60436p96795p80880p33495o91950
2761.6F64506972o42836o52790p29442p77900q15094q84533r06288q99017r60231j033485
2782F56205356j073718j157522j283527j347839j376570j453519j565635j679063j747965
2800.3F43519998j795769j872659j966476k084971k167940k195775k262652k352536
2816.6F26821220k436102k524495k607345k691031k766907k832949k936661l071905
2832.9F04953825l164231l231168l253996l253401l394961l621698l736794l748059
2849.3E77549517l799617l918350m056215m249573m503131m802763n190134n642116
2865.6E41387618o092549o506145o781816o807447o611645o266773n742311n025983
$$ plain form
2741.2 672625721 671716571 670803428 669886470 669036031 668270528 667510092 666713297 665932417 665198922 664506972
2761.6 664506972 663864136 663211346 662481904 661704004 660888910 660004377 659098089 658199072 657238841 656205356
2782 656205356 655131638 653974116 652690589 651342750 649966180 648512661 646947026 645267963 643519998
2800.3 643519998 641724229 639851570 637885094 635800123 633632183 631436408 629173756 626821220
2816.6 626821220 624385118 621860623 619253278 616562247 613795340 610962391 608025730 604953825
2832.9 604953825 601789594 598558426 595304430 592051029 588656068 585034370 581297576 577549517
2849.3 577549517 573749900 569831550 565775335 561525762 557022631 552219868 547029734 541387618
2865.6 541387618 535295069 528788924 522007108 515199661 508588016 502321243 496578932 491552949
2881.9D91552949m218459l412098k645761j948386j364738r41276o82950o04928p17342
2900.2D75017011r60260j261741j610369k042919k551139l031313l397077l605783
2916.6D56556410l620118l438890l101707k595305j847446r17554J16736J209199K228886
2934.9D44590211L165901M006564M675597N256027N778998O201804O512374O642759
2951.2D86830235O673514O717980O654263O444990O197751N919576N588829N256355
2967.6E36283493N006433M862248M804910M824280M851699M806102M679918M468441
2983.9E74587524M134238L730535L312409K910137K531708K073347J581550J149714
3000.2E96011162P26640L15905o1036m46081q63373j254857j526534j700342j881182
$$ plain form
2881.9 491552949 487334490 483922392 481276631 479328245 477963507 477022231 476339281 475734353 475017011
2900.2 475017011 474056751 472795010 471184641 469141722 466590583 463559270 460162193 456556410
2916.6 456556410 452936292 449497402 446395695 443800390 441952944 441035390 441152126 442361325 444590211
2934.9 444590211 447756112 451762676 456438273 461694300 467473298 473675102 480187476 486830235
2951.2 486830235 493503749 500221729 506875992 513320982 519518733 525438309 531027138 536283493
2967.6 536283493 541289926 546152174 550957084 555781364 560633063 565439165 570119083 574587524
2983.9 574587524 578721762 582452297 585764706 588674843 591206551 593279898 594861448 596011162
3000.2 596011162 596737802 597053707 596992671 596546590 595683217 594428360 592901826 591201484 589320302
3018.5E89320302k095997k319634k503217k641975k781094k890646k967298l053129
3034.9E68067312l136933l220796l303468l359020l397227l429710l466905l504514
3051.2E41248739l527642l545403l573835l606558l598690l589630l647149l682851
3067.5E12476981l648937l648758l689826l675818l630400l625780l624827l604740
3083.8D83327895l593802l579795l543675l508658l503620l481657l414154l398597
3100.1D55303937l461897l478736l409713l345281l305584l253043l214479l207117
3116.4D28628087l210992l204822l153235l070175l006399k990306l000170k972334
3132.8D04019654k890200k829164k829760k828986k779722k702415k621561k565712
$$ plain form
3018.5 589320302 587224305 584904671 582401454 579759479 576978385 574087739 571120441 568067312
3034.9 568067312 564930379 561709583 558406115 555047095 551649868 548220158 544753253 541248739
3051.2 541248739 537721097 534175694 530601859 526995301 523396611 519806981 516159832 512476981
3067.5 512476981 508828044 505179286 501489460 497813642 494183242 490557462 486932635 483327895
3083.8 483327895 479734093 476154298 472610623 469101965 465598345 462116688 458702534 455303937
3100.1 455303937 451842040 448363304 444953591 441608310 438302726 435049683 431835204 428628087
3116.4 428628087 425417095 422212273 419059038 415988863 412982464 409992158 406991988 404019654
3132.8 404019654 401129454 398300290 395470530 392641544 389861822 387159407 384537846 381972134
3149.1C81972134k551168k529293k493352k451450k381712k324074k302438k257616
3165.4C62681031k169400k125293k121836k089471k036184j965076j908719j910269
3181.7C46354783j922608j859963j749962j692474j670420j645506j625150j582742
3198C32605958j543641j526237j465797j368433j349747j384438j335293j253515j229465
3216.4C20149392j235396j236647j206130j141906j077890j030833r88781r78500j013100
3234.7C10240209j004875r39786q90434q59052q39770q54402q74013q15064p06255
3253.1C02456558o69241o98090p03215o65039o24091o10679n91844n62579n84513o15388
3273.5B96131879n98252n70655n62220n77450n82874n53876n10365m92871n17070n44071
$$ plain form
3149.1 381972134 379420966 376891673 374398321 371946871 369565159 367241085 364938647 362681031
3165.4 362681031 360511631 358386338 356264502 354175031 352138847 350173771 348265052 346354783
3181.7 346354783 344432175 342572212 340822250 339129776 337459356 335813850 334188700 332605958
3198 332605958 331062317 329536080 328070283 326701850 325352103 323967665 322632372 321378857 320149392
3216.4 320149392 318913996 317677349 316471219 315329313 314251423 313220590 312231809 311253309 310240209
3234.7 310240209 309235334 308295548 307405114 306546062 305706292 304851890 303977877 303162813 302456558
3253.1 302456558 301787317 301089227 300386012 299720973 299096882 298486203 297894359 297331780 296747267 296131879
3273.5 296131879 295533627 294962972 294400752 293823302 293240428 292686552 292176187 291683316 291166246 290622175
3293.9B90622175n68122n71668n17964m93050n39243n88060o07162o09637o27845o23346
3314.3B84876078n85585n60463n41836n58913o19948o75916o79225o33299o20991o37740
3334.7B78762162o42121o61880o80655o76870o62268o34521o34015o78539p18504p37995
3355.1B72034794p28339o66708o01917o19024o74457o81817o66618p04170p41481o87033
3375.5B65263230n90265n48303n78642n64128m81606l87460l34084m10825n10633m58032
3395.9B60399252l29554l00795l70800m37856m16368l55423l15815k77907k79545k64377
3416.3B57050812j84476j58787j93030j63465q0407k6882r656L0637M6998k4706o7770
3438.7B56219268q255Q0943J46150J68711J53989J77026K18629K37197K84702L30418
$$ plain form
3293.9 290622175 290054053 289482385 288964421 288471371 287932128 287344068 286736906 286127269 285499424 284876078
3314.3 284876078 284290493 283730030 283188194 282629281 282009333 281333417 280654192 280020893 279399902 278762162
3334.7 278762162 278120041 277458161 276777506 276100636 275438368 274803847 274169832 273491293 272772789 272034794
3355.1 272034794 271306455 270639747 270037830 269418806 268744349 268062532 267395914 266691744 265950263 265263230
3375.5 265263230 264672965 264124662 263546020 262981892 262500286 262112826 261778742 261367917 260857284 260399252
3395.9 260399252 260069698 259768903 259398103 258960247 258543879 258188456 257872641 257594734 257315189 257050812
3416.3 257050812 256866336 256707549 256514519 256351054 256270647 256243765 256234109 256264746 256311744 256287038 256219268
3438.7 256219268 256211013 256291956 256438106 256606817 256760806 256937832 257156461 257393658 257678360 258008778
3459.1B58008778L00288K90841L76642M49479M16725L18855K81513L21925M07249M48942
3479.5B61621237M05282M16040M87208M71920M30226M91053N51850N34415M96537N13911
3499.9B66419679N52773N29051M81576N11855O12557O81579O75827O24538O05285O98417
3520.3B72393137Q41469Q26210O94811O49512P38382Q86560R59485R26107R14723R91464
3540.7B80821860J057982J080871J073837J098186J182765J253247J265347J297444
3557B90131539J404733J498162J523763J657546J931995J938254J815945J894295K038538
3575.3C05834770K158612K288103K392859K455711K612144K857119K854704K696276
3591.7C26150298K826184L064811L139317L174425L231853L232360L310889L565103
$$ plain form
3459.1 258008778 258309066 258599907 258976549 259426028 259842753 260161608 260443121 260765046 261172295 261621237
3479.5 261621237 262026519 262442559 262929767 263401687 263831913 264322966 264874816 265409231 265905768 266419679
3499.9 266419679 266972452 267501503 267983079 268494934 269107491 269789070 270464897 271089435 271694720 272393137
3520.3 272393137 273234606 274060816 274755627 275405139 276143521 277030081 277989566 278915673 279830396 280821860
3540.7 280821860 281879842 282960713 284034550 285132736 286315501 287568748 288834095 290131539
3557 290131539 291536272 293034434 294558197 296215743 298147738 300085992 301901937 303796232 305834770
3575.3 305834770 307993382 310281485 312674344 315130055 317742199 320599318 323454022 326150298
3591.7 326150298 328976482 332041293 335180610 338355035 341586888 344819248 348130137 351695240
3608C51695240L655105L617168L635973L594338L821850M088611L748446L396541L588438
3626.3C84841710M398436M554510L720134L591508L834635L886580L922880L881633
3642.6D16632026L801585M141539M869849M688709L703058L656090M229843M081190
3659D49803889L785014L782332L656804L697336M230172M204720L543973L866196L848493
3677.3D84418929K991378K819925K915830K979070L391504L642529L032267K453328
3693.6E08644760K388656K457499K559007K664506K375126K018571K146363K506971
3709.9E27761459K512992J921057J584292J808703K014160J987517J918018J843691
3726.3E43351889J654386J584232J822293K032816J853645J227439P98940J287163
$$ plain form
3608 351695240 355350345 358967513 362603486 366197824 370019674 374108285 377856731 381253272 384841710
3626.3 384841710 389240146 393794656 397514790 401106298 404940933 408827513 412750393 416632026
3642.6 416632026 420433611 424575150 429444999 434133708 437836766 441492856 445722699 449803889
3659 449803889 453588903 457371235 461028039 464725375 468955547 473160267 476704240 480570436 484418929
3677.3 484418929 487410307 490230232 493146062 496125132 499516636 503159165 506191432 508644760
3693.6 508644760 511033416 513490915 516049922 518714428 521089554 523108125 525254488 527761459
3709.9 527761459 530274451 532195508 533779800 535588503 537602663 539590180 541508198 543351889
3726.3 543351889 545006275 546590507 548412800 550445616 552299261 553526700 554325640 555612803
3742.6E55612803K101957J699090J386047J920163J556397Q34822R72867J417339J373530
3760.9E68875015J117170J208424J325071J383305J338958J053512R52840J157105
3777.3E78411400J336992J206517J065314J147986J104235R73881R35852R84311J156807
3795.6E88323295J143575J173973J355886R12846P90655J065135O88434M81128R00805
3814E96835732J291991J018405R86397J147211O27875M84466O59645P50184Q82685
3832.3F04684591Q97527J078367J222015Q07225N16892N02407L40343K65479P29144
3850.7F11043990J812040J599610M7386j73271M12882Q59081Q35360M99069O64830
3869F17600977R01998N82635L96728L71278N74767O95527N48303P04825N72324L81589
$$ plain form
3742.6 555612803 557714760 559413850 560799897 562720060 564276457 565111279 566084146 567501485 568875015
3760.9 568875015 569992185 571200609 572525680 573908985 575247943 576301455 577254295 578411400
3777.3 578411400 579748392 580954909 582020223 583168209 584272444 585246325 586182177 587166488 588323295
3795.6 588323295 589466870 590640843 591996729 592909575 593700230 594765365 595453799 595934927 596835732
3814 596835732 598127723 599146128 600132525 601279736 601907611 602392077 603051722 603801906 604684591
3832.3 604684591 605582118 606660485 607882500 608689725 609206617 609709024 610049367 610314846 611043990
3850.7 611043990 612856030 614455640 614503026 614329755 614742637 615601718 616437078 616936147 617600977
3869 617600977 618502975 619085610 619482338 619853616 620428383 621123910 621672213 622377038 622949362 623330951
3889.4F23330951O30021M61459J59621M14551P22050P56800P15971M17531Q5652J39832
3909.8F27834439K48730K78652M61400N72324L82721K42054M00961M42862K66493L07739
3930.2F31438375M27365L25560K19703K37107L33786M52459M05073L01898L10779K97784
3950.6F34749889K55525K50936K38597K86878L85820L65079K69592K40028K73466L17394
3971F37633204L08335K21670J93536K64108K97606K69294K38002K46405L00884K84672
3991.4F40257716J99676K16543K63215
3997.5F40937150
$$ plain form
3889.4 623330951 623960972 624422431 624582052 624996603 625718653 626475453 627191424 627608955 627694607 627834439
3909.8 627834439 628083169 628361821 628823221 629395545 629778266 630020320 630421281 630864143 631130636 631438375
3930.2 631438375 631865740 632191300 632411003 632648110 632981896 633434355 633839428 634141326 634452105 634749889
3950.6 634749889 635005414 635256350 635494947 635781825 636167645 636532724 636802316 637042344 637315810 637633204
3971 637633204 637941539 638163209 638356745 638620853 638918459 639187753 639425755 639672160 639973044 640257716
3991.4 640257716 640457392 640673935 640937150
3997.5 640937150
##END=$$ End of the data block
