##TITLE=VR - 05 $$ Begin of the data block
##JCAMP-DX=5.00 $$ ACD/SpecManager v 10.08
##SPECTROMETER/DATA SYSTEM=Alpha
##DATE=25 Nov 2015 09:11:28
##DATA TYPE=INFRARED SPECTRUM
##DATA CLASS=XYDATA
##ORIGIN=
##OWNER=
##NPOINTS=1667
##FIRSTX=599.64648438
##LASTX=3997.64306641
##MAXX=3997.64306641
##MINX=599.64648438
##MAXY=1.08785582
##MINY=0.44445238
##XFACTOR=1.0000000000
##YFACTOR=0.000000010000000
##FIRSTY=0.92857957
##DELTAX=2.03961372
##XUNITS=1/CM
##YUNITS=ARBITRARY UNITS
##XYDATA=(X++(Y..Y))
599.6 92857957 94722611 94898814 93175131 92364424 94656599 98341858 100953484 102256536 102893627
618 102893627 103217804 103358841 103410733 103434491 103317416 103011632 102868164 103076315 103098178 102074754
638.4 102074754 99904686 98368043 99281794 101639557 103443241 104347813 104881871 105350888 105799389
656.8 105799389 106171560 106431139 106590116 106550908 106242287 106185198 106564856 106811750 106866014 106885397
677.2 106885397 106934130 106991374 107022655 107025361 107024384 107055819 107092440 107091820 107079387 107094216 107130456 107154179 107161510
703.7 107161510 107157493 107121634 107033896 106904757 106758797 106641221 106586063 106569791 106542826 106454027 106284451
726.1 106284451 106039429 105737054 105419540 105123127 104871750 104689753 104604566 104658973 104860508 105131161
746.5 105131161 105372179 105498862 105370510 104797113 103858674 103161776 103147495 103358030 103300035 103396308
766.9 103396308 104112554 105050230 105646563 105875826 105962265 106016350 106023276 105956089 105812216 105609298 105397415
789.3 105397415 105241799 105165148 105089331 104914963 104632151 104261947 103775847 103116405 102270043 101300013
809.7 101300013 100324082 99483925 98844254 98326719 97719914 96691382 94848728 91884029 87887692
828.1 87887692 83553231 79924077 77925760 78034508 80130523 83534086 87277395 90549994 92944318
846.4 92944318 94391912 95048130 95215505 95326203 95883012 97184849 99065614 101041079 102713263
864.8 102713263 103958488 104827428 105425262 105868089 106248939 106596196 106892097 107136071 107342458 107508349
885.2 107508349 107628632 107720423 107804537 107877243 107921624 107945621 107971907 107995439 108008385 108017647 108022070 108018351
909.7 108018351 107997382 107946384 107859612 107729483 107557559 107370639 107193398 107017744 106826305 106616294
930.1 106616294 106426263 106323409 106312692 106337023 106364274 106407738 106484270 106599188 106744003 106890833 107026744
952.5 107026744 107151473 107244623 107296956 107318640 107312870 107287669 107257223 107231402 107202494 107159472 107105327 107032108
977 107032108 106926429 106787217 106621814 106434941 106216168 105951238 105653119 105347788 105015099 104588890
997.4 104588890 104010284 103234792 102240610 101055336 99686503 98066300 96100777 93695992 90807438
1015.7 90807438 87609041 84542137 82083309 80510855 79846406 79892886 80350029 80964690 81604791
1034.1 81604791 82254660 83042681 84268069 86214495 88874519 91910577 94859922 97362190 99280638
1052.4 99280638 100671756 101646483 102312124 102770460 103087914 103290606 103377843 103356910 103253984 103086627
1072.8 103086627 102866018 102601171 102276957 101854062 101281154 100500381 99475348 98202264 96722299
1091.2 96722299 95209312 93992013 93347138 93215138 93151951 92590410 91263604 89656335 88873786
1109.6 88873786 89569533 91277337 93089312 94473886 95319849 95723194 95877641 95970178 96083039
1127.9 96083039 96148831 95994359 95454746 94469577 93056393 91213238 88917476 86176664 83080518
1146.3 83080518 79811710 76427841 72512102 67322356 60928214 55005300 51709628 52170521 56076229
1164.6 56076229 61631942 66337729 68793440 69448251 69441754 69326288 69119340 69075394 69825155 71754104
1185 71754104 74575883 77562809 80075389 81874305 83059865 83858055 84472299 84997135 85361320
1203.4 85361320 85343385 84645486 83039528 80635917 78105384 76429439 76318085 77844316 80357349
1221.7 80357349 82802904 84381682 84848017 84318519 83018345 81162333 78943908 76533043 74059719
1240.1 74059719 71537459 68855566 66011494 63265508 60721058 57854414 54101098 49858633
1256.4 49858633 46305221 44445238 44677556 46963862 51109707 56667674 62810344 68573594 73320156
1274.8 73320156 76956701 79710960 81848365 83541751 84877145 85900706 86618352 86959934 86782998
1293.1 86782998 85879260 84126580 81868351 79901218 78737104 78022128 76875710 74671274 71566355
1311.5 71566355 68588531 67074853 67703325 70243484 73836786 77608281 81119645 84277660 87133938
1329.8 87133938 89688057 91828787 93439782 94597936 95596409 96505892 97084671 97221959 96959132
1348.2 96959132 96303034 95194966 93619645 91791683 90027642 88447452 87113303 86159366 85630071
1366.6 85630071 85939711 87438339 89581078 91714376 93330008 94171154 94348454 94016498 93176270
1384.9 93176270 91940153 90834177 90069664 89407295 89049125 89233404 89704055 90151596 90258259
1403.3 90258259 90092182 90004134 90002465 90083379 90244508 90164906 89544237 88631690 87709486 86502212
1423.7 86502212 85574162 85812461 87223929 89067507 90289736 90567374 90365565 89943492 89220887
1442 89220887 88624537 88513619 88835698 89213037 89067167 88081098 86178184 84806663 84944040 85210353
1462.4 85210353 85436982 86448121 87978303 89295357 90609634 92331392 94172186 95843798 97276759
1480.8 97276759 98463058 99165905 99225944 99079913 99452323 99916112 99610305 98609245 97548783
1499.1 97548783 96245527 93949610 88422352 77179992 67637080 64517355 67605162 75805205
1515.4 75805205 85193479 91611946 95260990 97523504 98800403 99659127 100218403 100205982 100048566
1533.8 100048566 100109982 99543965 98190874 97768581 98265094 98641759 98488337 97814417 96963316 95892179
1554.2 95892179 94399971 92410415 91743326 92200464 91949892 90965360 89265645 86525315 82568026
1572.6 82568026 76036215 68519098 68033910 74319053 81520063 85124493 84363717 80384052 73867619
1590.9 73867619 65434057 56716889 50187945 46958616 46491396 48613906 53490752 60188997 66976655
1609.3 66976655 72496694 76439065 79541987 82761765 85522306 87347496 88758862 90002286
1625.6 90002286 90980232 91777021 92243749 92043883 91611457 92011493 92601341 92628837 91955012 90675187
1646 90675187 89931476 89946240 89533913 89607072 90847820 91627020 91453695 90426558 89044762 87263447
1666.4 87263447 84173894 80113989 76525706 72436899 67819571 64185876 61363417 59147078
1682.7 59147078 58441675 59656948 61130959 62015831 62002522 60718274 58908093 58014023 58379591
1701.1 58379591 59539336 60469967 60804665 60699421 60321254 59902978 59725183 60497630 62706494
1719.4 62706494 65282577 67583209 69325149 70159751 70025510 69088930 67344934 66025186 65628648
1737.8 65628648 65323174 65409029 66226929 67702115 69970900 73605102 78512895 83268583 87474257
1756.1 87474257 91168803 94009531 96331775 98230344 99447423 100116181 100500417 101055562 102034104
1774.5 102034104 102919090 103411019 103717029 104054368 104405880 104717839 104781699 104529238 104528129 104993534
1794.9 104993534 105356336 105429959 105515504 105838907 106170130 106271768 106206322 106244290 106476641 106674123
1815.3 106674123 106757784 106828415 106813645 106626880 106459820 106377196 106357276 106645715 107020724 107155526
1835.7 107155526 107185757 107172942 106929588 106602859 106684482 107036877 107293379 107401335 107416260 107389188
1856.1 107389188 107339907 107310474 107297599 107177377 106838381 106546772 106741095 107154191 107360065 107387185
1876.5 107387185 107373333 107354712 107332873 107299125 107196581 107040071 107029605 107117677 107127571 107145262 107190526
1898.9 107190526 107183278 107137954 107074201 106973720 106904352 106963408 107061458 107019007 106893265 106904984 106986511
1921.3 106986511 107083845 107281172 107455361 107529402 107562649 107587969 107612610 107617104 107522810 107355571 107338798
1943.8 107338798 107487667 107615888 107672775 107677734 107662511 107665050 107673848 107659483 107624567 107545888 107435548
1966.2 107435548 107416046 107487273 107523537 107511818 107498980 107496059 107504082 107517076 107510448 107465363 107380724 107274055
1990.7 107274055 107238078 107299650 107335615 107313168 107279277 107230175 107157242 107066226 106972039 106890821 106813467
2013.1 106813467 106722784 106665444 106689954 106741393 106764984 106771469 106781495 106798255 106817222 106842911 106871438 106886590
2037.6 106886590 106891942 106921256 106988382 107060432 107112396 107151651 107195246 107242858 107280886 107306790 107321203 107309556
2062.1 107309556 107279146 107278156 107305014 107313251 107302892 107300293 107314444 107340527 107370949 107397223 107416964 107429338
2086.6 107429338 107428896 107424581 107425511 107426667 107429469 107432592 107433701 107438183 107446432 107455790 107465637 107480168 107500339 107522190
2115.1 107522190 107544589 107566452 107585979 107603407 107622766 107644546 107665086 107679021 107678223 107666790 107661510 107666910
2139.6 107666910 107673299 107674408 107673144 107672620 107669604 107663333 107657146 107650959 107645023 107643616 107647657 107649601 107646084 107646263 107650948
2170.2 107650948 107651496 107654035 107667232 107683766 107689381 107679832 107671356 107681930 107702029 107708323 107699418 107693136 107701671
2196.7 107701671 107714999 107713711 107702434 107699478 107705426 107707775 107704318 107702422 107701612 107697165 107691097 107685983 107681870 107680857
2225.2 107680857 107686007 107693470 107689655 107678115 107674527 107675087 107675433 107677889 107676136 107663882 107647431 107628870 107602799
2251.8 107602799 107572329 107542765 107510507 107466137 107407725 107334316 107251394 107183409 107142246 107120490 107121766 107158196
2276.2 107158196 107231569 107324040 107402372 107447445 107467067 107475293 107474518 107457983 107430184 107401633 107358789 107286143
2300.7 107286143 107198501 107110322 107014751 106912351 106819594 106737792 106649458 106534338 106393003 106261683 106180060
2323.1 106180060 106140327 106094122 106014144 105937350 105916536 105915463 105889773 105859649 105838037 105869639 106043923
2345.6 106043923 106247711 106265390 106063592 105750120 105476642 105321836 105272555 105300939 105377460 105485868
2366 105485868 105625939 105814898 106036937 106255841 106482124 106733346 106993449 107223773 107396817 107504284
2386.4 107504284 107553935 107569361 107570040 107558882 107542622 107532310 107521558 107499158 107466328 107431352 107392132 107345712
2410.8 107345712 107302582 107265317 107225466 107186675 107156670 107125378 107089221 107061732 107048190 107049000 107067466 107097626
2435.3 107097626 107128882 107154357 107175255 107194531 107208061 107213485 107217062 107222819 107221603 107214987 107211494 107212377 107224286
2461.8 107224286 107242417 107260919 107285953 107312417 107331479 107342470 107344818 107342863 107343352 107346368 107356369 107374346
2486.3 107374346 107384217 107378280 107370567 107371306 107374656 107366419 107339263 107300365 107259357 107222271 107190108 107153773 107105362
2512.8 107105362 107055652 107024586 107025325 107054126 107095301 107139885 107180834 107216895 107248735 107266557 107271552 107276332
2537.3 107276332 107272112 107244813 107211220 107192385 107179844 107154119 107114708 107069838 107021034 106969750 106915855 106854939
2561.8 106854939 106783617 106706369 106634510 106571364 106508994 106450987 106414068 106404960 106422758 106469238 106536400 106601131
2586.2 106601131 106660342 106730688 106801474 106855679 106902051 106939566 106957328 106965113 106969094 106968772 106974387 106980681 106968212
2612.8 106968212 106939280 106918228 106911755 106901288 106883562 106871581 106859827 106836236 106807649 106781662 106759512 106749320
2637.2 106749320 106764257 106796730 106824172 106848145 106875801 106906724 106943917 106977630 106990635 106991470 107003689 107022095
2661.7 107022095 107031393 107029653 107015765 106989551 106958199 106927240 106885397 106825233 106753886 106675696 106592679 106506729
2686.2 106506729 106414855 106319940 106238186 106178260 106124568 106063473 105996192 105920017 105839181 105754769 105655742
2708.6 105655742 105550504 105441141 105301178 105115259 104892528 104656529 104438579 104250538 104094422 103968918
2729 103968918 103842139 103695261 103547037 103428793 103351307 103293538 103255975 103248072 103273833 103352880 103480279
2751.4 103480279 103622413 103758943 103905022 104086483 104299819 104520905 104735458 104938424 105114615 105247426
2771.8 105247426 105351889 105461419 105565810 105622303 105617332 105560231 105442715 105264902 105069184 104870176
2792.2 104870176 104628158 104333830 104047477 103822589 103639424 103478193 103361762 103302264 103300488 103338063
2812.6 103338063 103360605 103311670 103160799 102918112 102617729 102287161 101929200 101520765 101032054 100429332
2833 100429332 99699312 98927426 98335254 98155504 98464262 99161536 100065958 100996864 101803160 102413225
2853.4 102413225 102846110 103141809 103360844 103555548 103699291 103758049 103755307 103700376 103602576 103562427 103644192
2875.9 103644192 103759015 103822231 103831637 103783703 103658938 103449297 103159428 102781820 102320981 101834834
2896.3 101834834 101366580 100908864 100482547 100145531 99939030 99858618 99858886 99906218 99995840 100112510 100216079
2918.7 100216079 100248063 100152636 99910122 99513638 98996806 98459232 97958320 97518164 97223967 97176057
2939.1 97176057 97389394 97787005 98249680 98640662 98836029 98785156 98563558 98280287 97973037 97654510
2959.5 97654510 97338998 97020483 96693069 96365792 96018773 95608020 95132691 94639373 94183862 93844527
2979.9 93844527 93718988 93842262 94171119 94629389 95133704 95634961 96109748 96520782 96868163 97180462
3000.3 97180462 97447801 97699153 97999060 98336494 98694009 99123240 99660087 100270021 100899148 101497757
3020.7 101497757 101979375 102318799 102576590 102736211 102788579 102822566 102921677 103071153 103170848 103202724
3041.1 103202724 103240860 103311849 103376365 103410387 103438520 103462231 103470790 103485310 103486609 103419542 103286970 103146625
3065.5 103146625 103063154 103041160 103013694 102937460 102831936 102770448 102825689 102973068 103140378 103297746 103420925
3088 103420925 103491807 103530014 103547275 103528547 103469515 103416145 103428638 103477883 103489828 103489661 103529251 103545630
3112.4 103545630 103479075 103398275 103389180 103469718 103600419 103705060 103737676 103723955 103715408 103729486 103722990 103642523
3136.9 103642523 103542888 103513193 103506565 103443837 103337407 103187120 103007197 102916980 102942979 102954245 102885687
3159.4 102885687 102770948 102639639 102495861 102339196 102186501 102041924 101891184 101735413 101590884 101480651
3179.8 101480651 101400733 101319885 101233709 101162004 101111436 101070809 101026797 100971711 100917435 100889361 100892782 100910389
3204.2 100910389 100924909 100940359 100966048 100994265 101030016 101077569 101126766 101195669 101281917 101356149 101428258
3226.7 101428258 101492047 101499414 101481140 101535034 101646852 101724374 101739025 101701748 101630914 101583362 101592135 101593482
3251.1 101593482 101533282 101456451 101422298 101413202 101380754 101314509 101224494 101099288 100935864 100804853 100746262
3273.6 100746262 100709617 100661886 100597918 100519383 100437355 100346434 100234175 100088274 99924231 99795324 99726379
3296 99726379 99698716 99647802 99503839 99294382 99123222 99056822 99066472 99075925 99048966 98999047 98923784 98813558
3320.5 98813558 98681182 98558277 98495138 98482239 98447526 98370254 98263788 98139650 98067075 98079067 98128462
3342.9 98128462 98196447 98236698 98214787 98253500 98429376 98624206 98749369 98838139 98957682 99101943 99184531
3365.4 99184531 99251395 99469376 99862337 100257802 100529611 100737381 100950336 101164925 101362467 101515508
3385.7 101515508 101566124 101485693 101433337 101553333 101682675 101624644 101479232 101498342 101687014 101791835
3406.1 101791835 101729536 101640558 101608133 101633906 101669908 101627815 101555908 101557684 101573205 101507199 101386464
3428.6 101386464 101310229 101274300 101214802 101212513 101324558 101437330 101464486 101415122 101388764 101490140 101636910
3451 101636910 101724792 101770413 101777899 101760805 101798475 101876795 101881623 101850533 101956534 102204740 102422631 102531409
3475.5 102531409 102554262 102548599 102631295 102788091 102899981 103002596 103155065 103275704 103301525 103291595 103308725
3497.9 103308725 103289938 103224087 103302419 103515136 103649282 103729975 103844845 103967404 104079843 104142201
3518.3 104142201 104091465 103962052 103922105 104031062 104198492 104387343 104518497 104515707 104493332 104549479 104548383
3540.8 104548383 104360759 104138112 104173696 104401731 104522800 104591775 104743540 104829037 104755247 104597783
3561.1 104597783 104333699 103924441 103778291 104214931 104733217 104965925 104993176 104971325 104960501 104910731
3581.5 104910731 104673529 104228592 104036891 104361653 104622817 104586732 104553354 104613614 104686320 104808450
3601.9 104808450 104851997 104649127 104389036 104296362 104258680 104243982 104224145 104162002 104379714 104820228 104942858
3624.4 104942858 104532218 104055035 104327083 104923165 105308771 105551374 105696058 105741680 105657494 105244780
3644.8 105244780 104416108 103820550 104343021 105243218 105714142 105980015 106347358 106661534 106805730 106703198
3665.2 106703198 106270361 105756378 105600941 105493796 105395842 105942130 106726336 107236183 107398748 107147014
3685.6 107147014 106548631 106238723 106706095 107343900 107680619 107721150 107570457 107473230 107597697 107616436
3706 107616436 107241905 106726480 106738198 107280278 107652509 107615912 107363999 107156503 107115448 107245588
3726.4 107245588 107359326 107099307 106392086 105820251 106028545 106600726 106819296 106549251 106224179 106208956
3746.7 106208956 106108582 106072819 106603467 107167637 107344651 107406878 107652998 107836926 107771122 107644713
3767.1 107644713 107645798 107891130 108214283 108285773 108068657 107877648 107956290 108097684 108196986 108325791
3787.5 108325791 108417296 108399892 108194029 107819426 107472885 107158530 107023740 107259250 107510233 107792890
3807.9 107792890 108142674 108189261 107812130 107323039 107027316 106863785 107088351 107566941 107829916 107906675
3828.3 107906675 107837391 107613206 107295001 106931710 106787348 107042038 107456946 107851398 108073509 107882738
3848.7 107882738 107191026 106480587 106745374 107470930 107832420 107748449 107474208 107389212 107377195 107215965
3869.1 107215965 107231176 107550800 107912886 108034503 107797885 107595479 107618630 107726514 107939887 108003569
3889.5 108003569 107948351 108097970 108183086 107895029 107440758 107202542 107357466 107858491 108378494 108639431
3909.9 108639431 108649623 108478999 108214879 108099043 108193398 108263588 108269560 108350039 108390749 108277881 108238864
3932.3 108238864 108409297 108592391 108631694 108527029 108412886 108414483 108433485 108429861 108495319 108598518 108673513
3954.8 108673513 108708882 108701456 108678555 108703697 108761418 108773851 108742988 108718348 108714235 108724463 108747232 108774197
3979.3 108774197 108785582 108778369 108773136 108767819 108751345 108740294 108746994 108764315 108782387
3997.6 108782387
##END=$$ End of the data block
