##TITLE=$$ Begin of the data block
##JCAMP-DX=5.00 $$ ACD/SpecManager v 10.08
##SPECTROMETER/DATA SYSTEM=Alpha
##DATE=10 Apr 2014 11:00:52
##DATA TYPE=INFRARED SPECTRUM
##DATA CLASS=XYDATA
##ORIGIN=
##OWNER=
##NPOINTS=1765
##FIRSTX=399.75695801
##LASTX=3997.56933594
##MAXX=3997.56933594
##MINX=399.75695801
##MAXY=0.85228306
##MINY=0.31336147
##XFACTOR=1.0000000000
##YFACTOR=1.000000000000000e-9
##FIRSTY=0.62800127
##DELTAX=2.03957629
##XUNITS=1/CM
##YUNITS=ARBITRARY UNITS
##XYDATA=(X++(Y..Y))
$$ plain form
399.8 628001273 627816737 626635611 625275493 625057697 624261618 623033226 622963011 622497559 621111870
418.1 621111870 621039748 620988190 620198488 620097399 619858563 619083464 618832648 618298590 617347956 617276549
438.5 617276549 617133558 616492152 616528392 616316617 615535438 615577459 615702689 614883304 614298105 614234447
458.9 614234447 613780320 613395214 612926662 611772597 610864520 610268831 609224677 608677089 608559787
477.3 608559787 607759297 607006669 606829703 606305897 605769873 605624795 604977012 604331613 604230881 603388906
497.7 603388906 602059484 601388812 600632250 599713206 599415004 598793805 597608089 596825480 595799863
516 595799863 594387949 593804419 593142450 591496408 590141356 589233041 587948143 587002516 586346567
534.4 586346567 585146606 584325731 584164917 583566427 582939863 582625926 581700325 580732048 580267668 579142332
$$ packed form
399.8F28001273j84536j181126j360118k17796p96079j228392p0215m65452j385689
418.1F21111870p2122n1558p89702j01089k38836p75099k50816n34058r50634p1407
438.5F17276549j42991o41406L6240k11775p81179M2021J25230q19385n85199o3658
458.9F14234447m54127l85106m68552j154065r08077n95689j044154n47588j17302
477.3F08559787q00490p52628j76966n23806n36024j45078o47783o45399j00732q41975
497.7F03388906j329422o70672p56562r19044k98202o21199j185716p82609j025617
516E95799863j411914n83530o61969j646042j355052r08315j284898r45627o55949
534.4E86346567j199961q20875j60814n98490o26564l13937r25601r68277m64380j125336
$$ plain form
554.8 579142332 577776134 577127337 575987756 574104667 572614789 570901394 568552494 566687286 564931214
573.1 564931214 562740445 561061621 559534013 557429671 555722713 554349184 552506506 550912380
589.4 550912380 549697280 548098445 546707094 545720875 544083834 542090654 540486157 538977981 538025796
607.8 538025796 538158357 538230062 537975609 538662255 540491521 543277919 547140598 551115453 554537535
626.1 554537535 558213592 561928570 564919829 567834198 570739567 572747827 574202776 575420082
642.5 575420082 576182008 577757597 580651343 582666755 582757175 582457185 583467364 587055087 592651367
660.8 592651367 597523212 600417197 602941632 606271565 609046698 611938000 615132332 617658615
677.1 617658615 620222330 623036623 624957860 626643181 628788650 630374670 631623030 633203447
$$ packed form
554.8E79142332j366198o48797j139581j883089j489878j713395k348900j865208j756072
573.1E64931214k190769j678824j527608k104342j706958j373529j842678j594126
589.4E50912380j215100j598835j391351r86219j637041j993180j604497j508176r52185
607.8E38025796J32561P1705k54453O86646J829266K786398L862679L974855L422082
626.1E54537535L676057L714978K991259K914369K905369K008260J454949J217306
642.5E75420082P61926J575589K893746K015412R0420k99990J010179L587723N596280
660.8E92651367M871845K893985K524435L329933K775133K891302L194332K526283
677.1F17658615K563715K814293J921237J685321K145469J586020J248360J580417
$$ plain form
693.5 633203447 634241343 634838820 636029661 637209415 638108015 639664948 641377032 642683148 644585609
711.8 644585609 646830380 648508966 650478125 652917624 654875636 656889498 659302950 661116064
728.1 661116064 662753880 664898694 666547537 667830706 669613361 671083689 672109842 673731923
744.4 673731923 675384402 676641166 678387403 680129051 681254804 682808220 684633553 685745776
760.8 685745776 686973691 688634574 689751089 690725148 691970050 692465067 692390561 692476928 691925228
779.1 691925228 690776765 690033019 689272821 688513637 688948154 690257847 692019582 695228219 699614704
797.5 699614704 704130888 709128976 714362741 718706965 722571492 726291716 728996515 731006026
813.8 731006026 732896209 733738601 733395100 732543468 730598509 727462053 724097908 720284462 715914965
$$ packed form
693.5F33203447J037896N97477J190841J179754Q98600J556933J712084J306116J902461
711.8F44585609K244771J678586J969159K439499J958012K013862K413452J813114
728.1F61116064J637816K144814J648843J283169J782655J470328J026153J622081
744.4F73731923J652479J256764J746237J741648J125753J553416J825333J112223
760.8F85745776J227915J660883J116515R74059J244902M95017p4506Q6367n51700
779.1F91925228j148463p43746p60198p59184M34517J309693J761735L208637M386485
797.5F99614704M516184M998088N233765M344224L864527L720224K704799K009511
813.8G31006026J890183Q42392l43501q51632j944959l136456l364145l813446m369497
$$ plain form
832.1 715914965 712123811 708833516 705355406 702282250 699704409 697053492 695146084 694786549 695648968
850.5 695648968 698171258 702837706 708753884 715546906 723457396 731560290 739238501 746829569
866.8 746829569 753547430 758679390 763021290 766555309 768672884 770084500 770901918 770301640 768872678
885.2 768872678 767199397 764737844 762050569 760084271 758563280 757768452 758386552 759686887 761139274
903.5 761139274 763073206 764676809 765177608 765106440 764138043 761629164 758434176 754999459 751130581
921.9 751130581 747930765 746176004 745223165 745117724 745994568 746766567 747166812 747757018 748055458
940.2 748055458 747898102 747894645 747559190 746382296 744800806 742395043 738517582 733705819 727995932
958.6 727995932 720770001 712385178 703028262 692178965 680353880 668453455 656699896 645851612
$$ packed form
832.1G15914965l791154l290295l478110l073156k577841k650917j907408l59535Q62419
850.5F95648968K522290M666448N916178O793022P910490Q102894P678211P591068
866.8G46829569O717861N131960M341900L534019K117575J411616Q17418o00278j428962
885.2G68872678j673281k461553k687275j966298j520991p94828O18100J300335J452387
903.5G61139274J933932J603603N00799p1168r68397k508879l194988l434717l868878
921.9G51130581l199816j754761r52839j05441Q76844P71999M00245N90206K98440
940.2G48055458j57356l457l35455j176894j581490k405763l877461m811763n709887
958.6G27995932p225931q384823r356916j0849297j1825085j1900425j1753559j0848284
$$ plain form
974.9 645851612 636696339 628798306 621816218 615921080 610591948 605415821 600785315 596704721
991.2 596704721 592924654 589735925 587130189 584708869 582627833 580865383 578699946 575875878
1007.5 575875878 572478294 568263650 563490152 558762789 554074943 549515665 545560360 542056024
1023.9 542056024 538709283 535790563 533247411 530803323 528671145 526908815 525262117 523837686
1040.2 523837686 522653162 521341562 519893765 518484175 516994953 515674472 515110075 515349567 516251743
1058.5 516251743 517788231 519376397 520147800 519735992 517990410 514918149 511133671 507249951 503402770
1076.9 503402770 499765724 496432155 493031383 489306539 485296190 481019080 476860106 473620236
1093.2 473620236 471707702 471041411 471466303 472515762 473587275 474499851 475179642 475366741 474993080
$$ packed form
974.9F45851612r155273p898033o982088n895138n329132n176127m630506m080594
991.2E96704721l780067l188729k605736k421320k081036j762450k165437k824068
1007.5E75875878l397584m214644m773498m727363m687846m559278l955305l504336
1023.9E42056024l346741k918720k543152k444088k132178j762330j646698j424431
1040.2E23837686j184524j311600j447797j409590j489222j320481n64397K39492R02176
1058.5E16251743J536488J588166P71403m11808j745582l072261l784478l883720l847181
1076.9E03402770l637046l333569l400772l724844m010349m277110m158974l239870
1093.2D73620236j912534o66291M24892J049459J071513R12576O79791J87099l73661
$$ plain form
1111.6 474993080 473964900 471879572 468354344 463295847 457633346 453660041 452775747 453885466
1127.9 453885466 455570817 457042694 457724452 458287507 459951282 462757826 465901494 468846738 471397400
1146.2 471397400 473444492 475134373 476744413 478388727 480277270 482759297 485971987 490068197
1162.6 490068197 495353311 501824796 509135842 516993821 525042951 532842338 540257394 547250092
1178.9 547250092 553594828 559197128 563968956 567504108 569580376 570360899 570021868 568995476 568059921
1197.2 568059921 567761302 568414569 570290267 573112547 576124430 578882754 581212521 582904279 584102035
1215.6 584102035 585128963 585991323 586748958 587630808 588622749 589703500 591040909 592596054 594277442
1233.9 594277442 596219778 598321378 600332975 602293849 604131877 605608881 606759429 607638121
$$ packed form
1111.6D74993080j028180k085328l525228n058497n662501l973305q84294J109719
1127.9D53885466J685351J471877O81758N63055J663775K806544L143668K945244K550662
1146.2D71397400K047092J689881J610040J644314J888543K482027L212690M096210
1162.6D90068197N285114O471485P311046P857979Q049130P799387P415056O992698
1178.9E47250092O344736N602300M771828L535152K076268P80523l39031j026392r35555
1197.2E68059921k98619O53267J875698K822280L011883K758324K329767J691758J197756
1215.6E84102035J026928Q62360P57635Q81850R91941J080751J337409J555145J681388
1233.9E94277442J942336K101600K011597J960874J838028J477004J150548Q78692
$$ plain form
1250.3 607638121 608151078 608480573 608929694 609514296 610368609 611799598 613751113 616125822 619041443
1268.6 619041443 622372687 625949144 629880905 634063065 638253927 642585635 647126019 651679695
1284.9 651679695 656361580 661278248 666084826 670628846 674976468 678956211 682526469 685829699
1301.2 685829699 688750803 691239774 693483710 695416093 696968317 698385417 699683368 700768650
1317.6 700768650 701937497 703302562 704646468 705992758 707324028 708385766 709148467 709691942 709894836
1335.9 709894836 709818661 709936500 710467041 711181104 711944222 712652981 713269174 713834643 714190483 714283526
1356.3 714283526 714238405 713844240 712982297 712185860 711495697 710539699 709538043 708486676 707269967
1374.7 707269967 706258714 705184758 703434289 701248109 699410319 698141694 697321951 696738541 695763171
$$ packed form
1250.3F07638121N12957L29495M49121N84602Q54313J430989J951515K374709K915621
1268.6F19041443L331244L576457L931761M182160M190862M331708M540384M553676
1284.9F51679695M681885M916668M806578M544020M347622L979743L570258L303230
1301.2F85829699K921104K488971K243936J932383J552224J417100J297951J085282
1317.6G00768650J168847J365065J343906J346290J331270J061738P62701N43475K02894
1335.9G09894836p6175J17839N30541P14063P63118P08759O16193N65469L55840R3043
1356.3G14283526m5121l94165q61943p96437o90163r55998j001656j051367j216709
1374.7G07269967j011253j073956j750469k186180j837790j268625q19743n83410r75370
$$ plain form
1393 695763171 694253325 692796111 691267669 689530313 687499523 684991956 682597995 680515110 678554714
1411.4 678554714 676863611 675425231 673800588 672190249 671542764 671421409 671340108 671257377 671108544
1429.7 671108544 671243668 671675801 672097802 673013568 674520373 676078081 677502990 678861856 680488527
1448.1 680488527 682726443 685248613 687728167 690979242 696496367 702386737 707493663 712741554
1464.4 712741554 718411803 723752916 728908777 735042572 741821826 747768998 752465069 756032407
1480.7 756032407 758810699 760591507 761170447 760901809 760626078 760387480 759175181 756550550 753905118
1499.1 753905118 752018690 750036716 745983481 738901377 734422386 731835246 728659332 724891901
1515.4 724891901 721143186 718095481 715153337 712810218 711167753 709535658 708167434 706462085
$$ packed form
1393F95763171j509846j457214j528442j737356k030790k507567k393961k082885j960396
1411.4F78554714j691103j438380j624643j610339o47485j21355q1301q2731j48833
1429.7F71108544J35124M32133M22001R15766J506805J557708J424909J358866J626671
1448.1F80488527K237916K522170K479554L251075N517125N890370N106926N247891
1464.4G12741554N670249N341113N155861O133795O779254N947172M696071L567338
1480.7G56032407K778292J780808N78940k68638k75731k38598j212299k624631k645432
1499.1G53905118j886428j981974m053235p082104m478991k587140l175914l767431
1515.4G24891901l748715l047705k942144k343119j642465j632095j368224j705349
$$ plain form
1531.7 706462085 704311669 703047335 701872885 699306011 697608411 697942376 698800206 699561477 700064480
1550.1 700064480 700719178 701529860 701961815 701473415 701792359 703066111 703324020 702461362 700338781
1568.4 700338781 697273970 694737077 691285670 685353696 680093586 675705433 670258641 664078832
1584.7 664078832 657639861 650911033 643996477 637038410 629938066 622986495 616326034 609572351
1601.1 609572351 602722466 596096694 589487076 582636833 576084793 570046663 563064158 554853857
1617.4 554853857 549032986 544340968 538527548 533128977 528549373 524593174 522021294 519911587
1633.7 519911587 517476201 516918540 518179774 519870877 521649778 523826480 527190030 530821204
1650 530821204 534586370 540438831 546552837 551908195 557262957 563307643 570049226 576148033 582255483
$$ packed form
1531.7G06462085k150416j264334j174450k566874j697600L33965Q57830P61271N03003
1550.1G00064480O54698Q10682M31955m88400L18944J273752K57909q62658k122581
1568.4G00338781l064811k536893l451407n931974n260110m388153n446792o179809
1584.7F64078832o438971o728828o914556o958067p100344o951571o660461o753683
1601.1F09572351o849885o625772o609618o850243o552040o038130o982505q210301
1617.4E54853857n820871m692018n813420n398571m579604l956199k571880k109707
1633.7E19911587k435386n57661J261234J691103J778901K176702L363550L631174
1650E30821204L765166N852461O114006N355358N354762O044686O741583O098807O107450
$$ plain form
1668.4 582255483 589587986 596796691 604041398 611965179 619255126 625726283 632587969 641964197
1684.7 641964197 651230693 659138024 667145908 674306035 681349814 689136446 697448432 707480073
1701 707480073 716229916 723412633 730543494 736859083 742078781 746249378 749768555 753805041 758502364
1719.3 758502364 762711763 766274154 769398808 772051573 774383366 776367545 778545916 781634450
1735.7 781634450 784561992 787191808 790024698 792948306 795713842 798429072 801431477 804816425
1752 804816425 807878017 810370862 812517464 814406395 816306591 818199098 819717407 820817530 821614027
1770.3 821614027 822565377 824257374 825985909 827226818 828294337 829457045 830567479 831609547
1786.7 831609547 832436442 832799554 833331764 834471464 835529149 836220205 836946130 837888479 838777781
$$ packed form
1668.4E82255483P332503P208705P244707P923781P289947O471157O861686R376228
1684.7F41964197R266496P907331Q007884P160127P043779P786632Q311986J0031641
1701G07480073Q749843P182717P130861O315589N219698M170597L519177M036486M697323
1719.3G58502364M209399L562391L124654K652765K331793J984179K178371L088534
1735.7G81634450K927542K629816K832890K923608K765536K715230L002405L384948
1752H04816425L061592K492845K146602J888931J900196J892507J518309J100123P96497
1770.3H21614027R51350J691997J728535J240909J067519J162708J110434J042068
1786.7H31609547Q26895L63112N32210J139700J057685O91056P25925R42349Q89302
$$ plain form
1805 838777781 839442730 839858770 840296805 840996265 841702938 842181504 842599332 842996955 843203068 843352318
1825.4 843352318 843577564 843794882 844375908 845233679 845764875 846031904 846345842 846470058 846281350 846526742
1845.8 846526742 847233832 847797215 848222852 848604798 848839581 848994434 849246383 849474967 849537909 849382937
1866.2 849382937 849125683 849341929 850046515 850578368 850764632 850920618 851088464 851124287 851168811 851256788
1886.6 851256788 851185262 851218343 851495504 851642370 851737380 851957977 852081060 852076769 852121115 852104187 851995468
1909 851995468 852070928 852246106 852180958 851978838 851940811 851936460 851952612 852148294 852283061 852262259 852231205
1931.5 852231205 852145135 852030456 852003574 851858258 851478040 851274610 851345599 851356924 851305187 851227343 851032495
1953.9 851032495 850843906 850716770 850512326 850305676 850154102 849905610 849695981 849680245 849601686 849365711
$$ packed form
1805H38777781O64949M16040M38035O99460P06673M78566M17828L97623K06113J49250
1825.4H43352318K25246K17318N81026Q57771N31196K67029L13938J24216j88708K45392
1845.8H46526742P07090N63383M25637L81946K34783J54853K51949K28584O2942j54972
1866.2H49382937k57254K16246P04586N31853J86264J55986J67846L5823M4524Q7977
1886.6H51256788p1526L3081K77161J46866R5010K20597J23083m291M4346j6928j08719
1909H51995468P5460J75178o5148k02120l8027m351J6152J95682J34767k0802l1054
1931.5H52231205q6070j14679k6882j45316l80218k03430P0989J1325n1737p7844j94848
1953.9H51032495j88589j27136k04444k06650j51574k48492k09629j5736p8559k35975
$$ plain form
1974.3 849365711 849188924 849079847 848920822 848814726 848742187 848533273 848277032 848040879 847778201 847643316
1994.7 847643316 847632170 847497702 847261548 847102165 846937656 846692324 846502185 846323073 846072435 845861912
2015.1 845861912 845672727 845443070 845273495 845144033 844908834 844666183 844504595 844291925 844065964 843913019
2035.5 843913019 843708992 843475521 843350530 843224227 843036711 842914104 842805386 842617393 842473030 842373073
2055.9 842373073 842208683 842068672 841980994 841825187 841680825 841647387 841588974 841514885 841507614 841455758 841349900
2078.3 841349900 841299355 841246665 841156006 841126680 841116786 841050029 840999544 840988219 840935230 840904832 840944171 840934873
2102.8 840934873 840897202 840907097 840898514 840854883 840846241 840865612 840897560 840957463 841008365 841034412 841099143 841200054
2127.3 841200054 841273546 841335714 841402829 841442049 841475785 841562510 841662943 841741502 841868520 842030048 842146158
$$ packed form
1974.3H49365711j76787j09077j59025j06096p2539k08914k56241k36153k62678j34885
1994.7H47643316j1146j34468k36154j59383j64509k45332j90139j79112k50638k10523
2015.1H45861912j89185k29657j69575j29462k35199k42651j61588k12670k25961j52945
2035.5H43913019k04027k33471j24991j26303j87516j22607j08718j87993j44363r9957
2055.9H42373073j64390j40011q7678j55807j44362l3438n8413p4089p271n1856j05858
2078.3H41349900n0545n2690r0659k9326r894o6757n0485j1325n2989l0398L9339r298
2102.8H40934873l7671R895q583m3631q642J9371L1948N9903N0902K6047O4731J00911
2127.3H41200054P3492O2168O7115L9220L3736Q6725J00433P8559J27018J61528J16110
$$ plain form
2149.7 842146158 842266858 842427254 842541873 842618883 842736900 842874467 843008518 843142211 843224287 843291879
2170.1 843291879 843442976 843614280 843722343 843835115 843978286 844077766 844156921 844267845 844379604 844481528
2190.5 844481528 844593346 844690263 844752133 844793618 844811797 844835103 844896495 844954431 844990909 845045507 845117986
2212.9 845117986 845170557 845196664 845223486 845270336 845321476 845349848 845348597 845347047 845358729 845353484 845331192 845326006
2237.4 845326006 845332086 845320463 845313013 845306039 845251262 845201433 845217705 845216811 845161855 845121205 845095277 845064461
2261.9 845064461 845057130 845072567 845069408 845059872 845061541 845070422 845152140 845288217 845386267 845470965 845556557 845573068
2286.3 845573068 845572710 845656037 845749140 845768392 845778227 845825076 845870674 845960200 846108437 846181810 846169889 846189499
2310.8 846189499 846210122 846213281 846278906 846318424 846273005 846218228 846139312 846062541 846088111 846167147 846196175 846227169
$$ packed form
2149.7H42146158J20700J60396J14619P7010J18017J37567J34051J33693Q2076O7592
2170.1H43291879J51097J71304J08063J12772J43171R9480P9155J10924J11759J01924
2190.5H44481528J11818R6917O1870M1485J8179K3306O1392N7936L6478N4598P2479
2212.9H45117986N2571K6107K6822M6850N1140K8372j251j550J1682n245k2292n186
2237.4H45326006O080j1623p450o974n4777m9829J6272q94n4956m0650k5928l0816
2261.9H45064461p331J5437l159r536J669Q881Q1718J36077R8050Q4698Q5592J6511
2286.3H45573068l58Q3327R3103J9252R835M6849M5598Q9526J48237P3373j1921J9610
2310.8H46189499K0623L159O5625L9518m5419n4777p8916p6771K5570P9036K9028L0994
$$ plain form
2335.3 846227169 846240103 846128941 846049666 846230984 846643031 847157836 847590923 847720385 847453356 847057462
2355.7 847057462 846822441 846745610 846825302 846987128 847179651 847552299 848073542 848546088 848962963 849369705
2376.1 849369705 849710524 850037038 850389183 850649357 850832880 851037741 851158082 851167083 851209819 851281226
2396.5 851281226 851326704 851395071 851467669 851477265 851487756 851544440 851565182 851568341 851606250 851594090 851532280 851511478
2421 851511478 851479411 851399541 851374030 851389885 851351500 851295471 851233840 851138115 851084888 851069391 850989282 850898683
2445.4 850898683 850852787 850761175 850643754 850592971 850559831 850495934 850438237 850352407 850242138 850207984 850173414
2467.9 850173414 850033581 849904895 849822283 849688113 849563241 849478126 849350095 849249840 849212408 849098802
2488.3 849098802 848927677 848834813 848757625 848619521 848507881 848403454 848250628 848154485 848101139 847977459
$$ packed form
2335.3H46227169J2934j11162p9275J81318M12047N14805M33087J29462k67029l95894
2355.7H47057462k35021p6831P9692J61826J92523L72648N21243M72546M16875M06742
2376.1H49369705L40819L26514L52145K60174J83523K04861J20341R001M2736P1407
2396.5H51281226M5478O8367P2598R596J0491N6684K0742L159L7909j2160o1810k0802
2421H51511478l2067p9870k5511J5855l8385n6029o1631r5725n3227j5497q0109r0599
2445.4H50898683m5896r1612j17421n0783l3140o3897n7697q5830j10269l4154l4570
2467.9H50173414j39833j28686q2612j34170j24872q5115j28031j00255l7432j13606
2488.3H49098802j71125r2864p7188j38104j11640j04427j52826r6143n3346j23680
$$ plain form
2508.7 847977459 847868085 847825825 847732008 847589195 847471893 847341776 847208142 847130537 847042084 846910536
2529 846910536 846806288 846697390 846544564 846434414 846382499 846274137 846130669 846040428 845933020 845803857
2549.4 845803857 845721483 845623553 845489144 845375597 845238268 845039010 844874084 844767094 844624102 844463706
2569.8 844463706 844316423 844101310 843858302 843667984 843444526 843177915 842974305 842770696 842502832 842263162
2590.2 842263162 842013478 841700673 841422796 841129720 840750158 840409636 840111554 839744866 839361072 839009166
2610.6 839009166 838644624 838293254 837965369 837554097 837090790 836708426 836336970 835903525 835515201 835182667
2631 835182667 834801555 834401250 834005296 833592296 833237052 832908571 832516789 832124531 831776798 831388116
2651.4 831388116 830976784 830626786 830267310 829889894 829570711 829245508 828885615 828578949 828283429 827928543
$$ packed form
2508.7H47977459j09374m2260r3817j42813j17302j30117j33634p7605q8453j31548
2529H46910536j04248j08898j52826j10150n1915j08362j43468r0241j07408j29163
2549.4H45803857q2374r7930j34409j13547j37329j99258j64926j06990j42992j60396
2569.8H44463706j47283k15113k43008j90318k23458k66611k03610k03609k67864k39670
2590.2H42263162k49684l12805k77877k93076l79562l40522k98082l66688l83794l51906
2610.6H39009166l64542l51370l27885m11272m63307l82364l71456m33445l88324l32534
2631H35182667l81112m00305l95954m13000l55244l28481l91782l92258l47733l88682
2651.4H31388116m11332l49998l59476l77416l19183l25203l59893l06666k95520l54886
$$ plain form
2671.8 827928543 827575564 827220440 826823533 826437056 826052248 825622261 825213492 824835062 824394464 823944509
2692.2 823944509 823562086 823160827 822715402 822289884 821852624 821381330 820940197 820517600 820050895 819579899
2712.6 819579899 819100678 818567038 818065703 817631066 817181945 816757321 816343844 815789580 815192163 814729333
2733 814729333 814302087 813838780 813407362 812970698 812509239 812102675 811719775 811262667 810745418 810190916
2753.4 810190916 809610963 809108317 808665812 808157027 807599604 807027578 806427538 805853665 805347681 804830730
2773.8 804830730 804208577 803530991 802845001 802112162 801376402 800697088 800057173 799395084 798639596 797799408
2794.2 797799408 796990871 796219170 795321405 794336677 793408334 792477787 791523099 790583253 789586186 788510621
2814.6 788510621 787422895 786319554 785181701 784053981 782908261 781658947 780353189 779024005
$$ packed form
2671.8H27928543l52979l55124l96907l86477l84808m29987m08769l78430m40598m49955
2692.2H23944509l82423m01259m45425m25518m37260m71294m41133m22597m66705m70996
2712.6H19579899m79221n33640n01335m34637m49121m24624m13477n54264n97417m62830
2733H14729333m27246m63307m31418m36664m61459m06564l82900m57108n17249n54502
2753.4H10190916n79953n02646m42505n08785n57423n72026o00040n73873n05984n16951
2773.8H04830730o22153o77586o85990p32839p35760o79314o39915o62089p55488q40188
2794.2G97799408q08537p71701q97765r84728r28343r30547r54688r39846r97067j075565
2814.6G88510621j087726j103341j137853j127720j145720j249314j305758j329184
$$ plain form
2830.9 779024005 777586102 776022494 774305105 772248387 769721210 766777635 763474882 759934843
2847.2 759934843 756534457 753747761 751795590 750540912 749706030 748972833 748014688 746659279 744934499
2865.6 744934499 742966354 740922213 738971531 737158835 735446692 733895779 732534587 731256306
2881.9 731256306 729950190 728575349 727161705 725713193 724203467 722668588 721095741 719391048
2898.2 719391048 717611432 715879500 714116812 712173760 710009933 707600594 704876900 701855600
2914.5 701855600 698715746 695749998 693240345 691342652 690053165 689347684 689164639 689261019 689601123
2932.9 689601123 690390944 691635907 693264365 695264637 697446883 699442983 701009452 702131391
2949.2 702131391 702924967 703450441 703726709 703937769 704300582 704799950 705283105 705747008 706261814 706800461
$$ packed form
2830.9G79024005j437903j563608j717389k056718k527177k943575l302753l540039
2847.2G59934843l400386k786696j952171j254678q34882p33197r58145j355409j724780
2865.6G44934499j968145k044141j950682j812696j712143j550913j361192j278281
2881.9G31256306j306116j374841j413644j448512j509726j534879j572847j704693
2898.2G19391048j779616j731932j762688j943052k163827k409339k723694l021300
2914.5G01855600l139854k965748k509653j897693j289487p05481j83045R6380L40104
2932.9F89601123P89821J244963J628458K000272K182246J996100J566469J121939
2949.2G02131391P93576N25474K76268K11060L62813M99368M83155M63903N14806N38647
$$ plain form
2969.6 706800461 707373857 707998335 708606124 709264040 709997118 710581481 711017489 711535335 712105691 712630987
2990 712630987 713075578 713223040 713060319 712757587 712274373 711634099 710929453 710204303 709556997 708989143
3010.4 708989143 708335280 707473457 706430197 705276966 704042614 702780128 701488018 700075507 698628664
3028.7 698628664 697285473 696006417 694608033 693056107 691588044 690212369 688687861 686926603
3045.1 686926603 685066104 683305979 681605697 679793119 677918792 676090300 674289823 672551513
3061.4 672551513 670915127 669330060 667691052 665921807 664101243 662389457 660879493 659451485
3077.7 659451485 657866359 656127095 654357433 652532995 650699317 648917913 647046626 645065308
3094 645065308 643141925 641335726 639508069 637518942 635490477 633585155 631719172 629708111 627630472
$$ packed form
2969.6G06800461N73396O24478O07789O57916P33078N84363M36008N17846N70356N25296
2990G12630987M44591J47462j62721l02732m83214o40274p04646p25150o47306n67854
3010.4G08989143o53863q61823j043260j153231j234352j262486j292110j412511j446843
3028.7F98628664j343191j279056j398384j551926j468063j375675j524508j761258
3045.1F86926603j860499j760125j700282j812578j874327j828492j800477j738310
3061.4F72551513j636386j585067j639008j769245j820564j711786j509964j428008
3077.7F59451485j585126j739264j769662j824438j833678j781404j871287j981318
3094F45065308j923383j806199j827657j989127k028465j905322j865983k011061k077639
$$ plain form
3112.4 627630472 625687182 623766482 621654451 619270504 616695583 614176452 611829877 609553277
3128.7 609553277 607185960 604710579 602311552 600066185 597786903 595232785 592480361 589777112
3145 589777112 587176919 584722877 582369387 579814672 576927483 573958158 571130872 568421662 565705836
3163.4 565705836 562921703 560097873 557263196 554428577 551597059 548763216 545903504 543035984
3179.7 543035984 540186882 537336588 534496009 531641960 528737187 525842428 522983074 520095050
3196 520095050 517205775 514398873 511654317 508896351 506140769 503417253 500714421 498034239 495345682
3214.3 495345682 492663920 490044415 487468958 484892964 482309610 479715735 477171987 474793732
3230.7 474793732 472530693 470174342 467703223 465302825 463031173 460865289 458848238 456904203
$$ packed form
3112.4F27630472j943290j920700k112031k383947k574921k519131k346575k276600
3128.7F09553277k367317k475381k399027k245367k279282k554118k752424k703249
3145E89777112k600193k454042k353490k554715k887189k969325k827286k709210k715826
3163.4E65705836k784133k823830k834677k834619k831518k833843k859712k867520
3179.7E43035984k849102k850294k840579k854049k904773k894759k859354k888024
3196E20095050k889275k806902k744556k757966k755582k723516k702832k680182k688557
3214.3D95345682k681762k619505k575457k575994k583354k593875k543748k378255
3230.7D74793732k263039k356351k471119k400398k271652k165884k017051j944035
$$ plain form
3247 456904203 454848230 452736080 450731695 448820204 446904421 444930017 442951173 441038966 439191014
3265.3 439191014 437397748 435664743 433879018 431952268 429986566 428038150 426116914 424236059
3281.6 424236059 422335148 420414031 418535680 416724414 414951921 413124532 411173254 409099162
3298 409099162 406978041 404965967 403139174 401313335 399253696 396980435 394643217 392392695 390259147
3316.3 390259147 388114244 385957748 383883387 381846070 379707068 377452523 375214875 373036295
3332.6 373036295 370956153 369017303 367004484 364775062 362475038 360159039 357900530 355863452
3348.9 355863452 353849232 351572216 349159122 346895278 344834149 342793405 340735853 338861346
3365.3 338861346 337138146 335258722 333108664 330966085 329087645 327382386 325769663 324246019
$$ packed form
3247D56904203k055973k112150k004385j911491j915783j974404j978844j912207j847952
3265.3D39191014j793266j733005j785725j926750j965702j948416j921236j880855
3281.6D24236059j900911j921117j878351j811266j772493j827389j951278k074092
3298D09099162k121121k012074j826793j825839k059639k273261k337218k250522k133548
3316.3C90259147k144903k156496k074361k037317k139002k254545k237648k178580
3332.6C73036295k080142j938850k012819k229422k300024k315999k258509k037078
3348.9C55863452k014220k277016k413094k263844k061129k040744k057552j874507
3365.3C38861346j723200j879424k150058k142579j878440j705259j612723j523644
$$ plain form
3381.6 324246019 322804302 321536571 320588559 319956690 319277406 318282634 317277461 316697389 316442609
3399.9 316442609 315930963 314996213 314241201 313978344 313892543 313792020 313629389 313413441 313361466 313492864
3420.3 313492864 313685358 314091682 314827144 315775454 316680878 317587227 318720013 319800675 320526272
3438.7 320526272 321206123 322250217 323670149 325263828 326851964 328474909 330236375 332107455
3455 332107455 334109664 336302429 338453710 340561658 343050510 345781744 348090947 349844217 351640075
3473.4 351640075 353864163 356451899 359046578 361308247 363544226 366117239 368743747 371237874
3489.7 371237874 373854369 376643121 379483998 382249624 384952754 387698978 390385002 392947406
3506 392947406 395606935 398564339 401796520 404991001 407928824 410844296 413966179 417361051 420713902
$$ packed form
3381.6C24246019j441717j267731r48012o31869o79284r94772j005173n80072k54780
3399.9C16442609n11646r34750p55012k62857q5801j00523j62631k15948n1975J31398
3420.3C13492864J92494M06324P35462R48310R05424R06349J132786J080662P25597
3438.7C20526272O79851J044094J419932J593679J588136J622945J761466J871080
3455C32107455K002209K192765K151281K107948K488852K731234K309203J753270J795858
3473.4C51640075K224088K587736K594679K261669K235979K573013K626508K494127
3489.7C71237874K616495K788752K840877K765626K703130K746224K686024K562404
3506C92947406K659529K957404L232181L194481K937823K915472L121883L394872L352851
$$ plain form
3524.4 420713902 423748314 426808059 430218726 433909357 437748015 441526651 445113093 448849142
3540.7 448849142 452854544 456815690 460518599 464220047 468155503 472221047 476349115 480607301
3557 480607301 485030323 489443421 493587524 497530639 502079248 507475734 512780845 517698824 522617638
3575.3 522617638 527773917 533206105 538805246 544270039 549411654 554502904 560143828 565952063
3591.7 565952063 571549594 577292740 583409786 589603186 595693290 601598382 607125044 612644374
3608 612644374 618522882 624497831 630475461 636410534 642348945 648718119 655032098 660626054 665512502
3626.3 665512502 670428038 676436722 682618558 688362896 693795621 698927104 703802824 708407581
3642.6 708407581 712495685 715924323 719620109 724569857 729543209 733796418 737985194 742268503
$$ packed form
3524.4D20713902L034412L059745L410667L690631L838658L778636L586442L736049
3540.7D48849142M005402L961146L702909L701448L935456M065544M128068M258186
3557D80607301M423022M413098M144103L943115M548609N396486N305111M917979M918814
3575.3E22617638N156279N432188N599141N464793N141615N091250N640924N808235
3591.7E65952063N597531N743146O117046O193400O090104N905092N526662N519330
3608F12644374N878508N974949N977630N935073N938411O369174O313979N593956M886448
3626.3F65512502M915536O008684O181836N744338N432725N131483M875720M604757
3642.6G08407581M088104L428638L695786M949748M973352M253209M188776M283309
$$ plain form
3659 742268503 745961964 748977125 751630723 753804147 755494773 757606030 759898245 761596978 763902843
3677.3 763902843 766999960 769852936 772227466 774150133 775643229 776948929 778798759 781161129
3693.6 781161129 783298731 784866869 785953045 786891103 788102388 789341927 789983153 790071845 790645540
3712 790645540 792270482 793886900 794815063 795261919 795621336 796094358 796737671 797541857 798021495 797850430
3732.4 797850430 797646761 798396528 799859881 800934732 800831258 800023556 800265849 800796211 800832987
3750.7 800832987 801770449 803336740 804310322 804749370 805372596 806100130 806470513 806614161 806737185
3769.1 806737185 807189941 808046997 808665872 808824420 808820188 809026539 809332132 809558749 809939861 810452223
3789.5 810452223 810790181 810712039 810257673 809892833 809599221 809318304 809845746 810551822 811000049 811723053
$$ packed form
3659G42268503L693461L015161K653598K173424J690626K111257K292215J698733K305865
3677.3G63902843L097117K852976K374530J922667J493096J305700J849830K362370
3693.6G81161129K137602J568138J086176R38058J211285J239539O41226Q8692N73695
3712G90645540J624942J616418R28163M46856L59417M73022O43313Q04186M79638j71065
3732.4G97850430k03669P49767J463353J074851j03474q07702K42293N30362L6776
3750.7H00832987R37462J566291R73582M39048O23226P27534L70383J43648J23024
3769.1H06737185M52756Q57056O18875J58548m232K06351L05593K26617L81112N12362
3789.5H10452223L37958p8142m54366l64840k93612k80917N27442P06076M48227P23004
$$ plain form
3809.9 811723053 812266409 812038004 811296761 810928285 810686231 810724020 811530530 812162101 812403560 812435448
3830.3 812435448 812224567 812056661 811754167 811237693 811348915 812122226 813029885 813673258 813678861 812787175
3850.7 812787175 811139882 810838699 812246144 813319385 813436151 812970936 812694490 812751532 812550604
3869 812550604 812387586 812822998 813470244 813903451 813743293 813463688 813632965 813729644 813876152 814075351
3889.4 814075351 814015329 814172328 814452887 814132690 813273728 812669456 812738717 813456714 814390004 814952552
3909.8 814952552 815055847 814913392 814620376 814397097 814462423 814528584 814364076 814346254 814548612 814560354
3930.2 814560354 814523757 814778984 815090716 815171659 815047622 814900458 814901590 814921021 814858377 814921141 815129220
3952.7 815129220 815304816 815398991 815486014 815545797 815562844 815614462 815681636 815735161 815772355 815757394 815762103
$$ packed form
3809.9H11723053N43356k28405p41243l68476k42054L7789Q06510O31571K41459L1888
3830.3H12435448k10881j67906l02494n16474J11222P73311R07659O43373N603q91686
3850.7H12787175j647293l01183J407445J073241J16766m65215k76446N7042k00928
3869H12550604j63018M35412O47246M33207j60158k79605J69277R6679J46508J99199
3889.4H14075351o0022J56999K80559l20197q58962o04272O9261P17997R33290N62548
3909.8H14952552J03295j42455k93016k23279O5326O6161j64508j7822K02358J1742
3930.2H14560354l6597K55227L11732Q0943j24037j47164J132J9431o2644O2764K08079
3952.7H15129220J75596R4175Q7023N9783J7047N1618O7174N3525L7194j4961M709
$$ plain form
3975.1 815762103 815903664 816103578 816323400 816604495 816786826 816744566 816606879 816574693 816672802 816777587
3995.5 816777587 816862762
3997.5 816862762
$$ packed form
3975.1H15762103J41561J99914K19822K81095J82331m2260j37687l2186R8109J04785
3995.5H16777587Q5175
3997.5H16862762
##END=$$ End of the data block
