##TITLE=$$ Begin of the data block
##JCAMP-DX=5.00 $$ ACD/SpecManager v 10.08
##SPECTROMETER/DATA SYSTEM=Alpha
##DATE=10 Apr 2014 11:00:52
##DATA TYPE=INFRARED SPECTRUM
##DATA CLASS=XYDATA
##ORIGIN=
##OWNER=
##NPOINTS=1765
##FIRSTX=399.75695801
##LASTX=3997.56933594
##MAXX=3997.56933594
##MINX=399.75695801
##MAXY=0.85241026
##MINY=0.31358114
##XFACTOR=1.0000000000
##YFACTOR=1.000000000000000e-9
##FIRSTY=0.62910515
##DELTAX=2.03957629
##XUNITS=1/CM
##YUNITS=ARBITRARY UNITS
##XYDATA=(X++(Y..Y))
399.8F29105151q75712j523018j489937n17547q76606q83162J71006k59161j233399
418.1F21617615o26266n95391p50124J87337n6922p27058j93238n75185j173138j37449
438.5F16970181K7359o33538j15692k12849o04510M38273N35727p70450q69751m92394
458.9F14272356q43167n54323k83838q56876q14021p03633j221835n05150R1613o71208
479.3F07909918o01769r5367o67513n22434O8068n99980p15613j82033r68695j477599
499.7F02146983q23498q85069j006305k72393m79579j094878p01904r29833j587927
518.1E94365597q93235p14243j537681j261174q51631j279652r55642o29544j182973
536.4E85059822r01938k76804o18875n70655k23338r05812j148462n24521q34227j158416
$$ plain form
399.8 629105151 628229439 626706421 625216484 624698937 623822331 622939169 623110175 622851014 621617615
418.1 621617615 620991349 620395958 619645834 619833171 619776249 619049191 618855953 618280768 617107630 616970181
438.5 616970181 616997540 616364002 616248310 616035461 615430951 615869224 616404951 615634501 614764750 614272356
458.9 614272356 613429189 612874866 612591028 611734152 610920131 610216498 608994663 608489513 608581126 607909918
479.3 607909918 607308149 607212782 606545269 606022835 606090903 605490923 604775310 604593277 603624582 602146983
499.7 602146983 601323485 600438416 599432111 599159718 598680139 597585261 596883357 595953524 594365597
518.1 594365597 593472362 592758119 591220438 589959264 589107633 587827981 586872339 586242795 585059822
536.4 585059822 584157884 583881080 583262205 582691550 582468212 581562400 580413938 579889417 579055190 577896774
556.8E77896774p47323j258373j841963j387536j714290k465963k029955j819909k141416
575.2E62490046j710653j588166k048969j607180j282811j750708j551091j209200
591.5E49741268j613796j492440j137197j701892j929760j545667j499236r28223J19924
609.8E38012981P1466j80304O74188J774431K818823L874182M012943L481924L625512
628.2E58166146L678084L036320K986371K970934K013147J401127J137316P56264J621544
646.5E77767253K801478J911819J88529k05576R83536L603995N627274M873753K948940
664.9F00501001K557516L233016K698063K863884L256023K626479K494812K754450
681.2F22985244K069175J813173K117694J509607J207769J614332J113474N90503J083374
$$ plain form
556.8 577896774 577149451 575891078 574049115 572661579 570947289 568481326 566451371 564631462 562490046
575.2 562490046 560779393 559191227 557142258 555535078 554252267 552501559 550950468 549741268
591.5 549741268 548127472 546635032 545497835 543795943 541866183 540320516 538821280 537893057 538012981
609.8 538012981 538084447 537904143 538578331 540352762 543171585 547045767 551058710 554540634 558166146
628.2 558166146 561844230 564880550 567866921 570837855 572851002 574252129 575389445 576145709 577767253
646.5 577767253 580568731 582480550 582669079 582463503 583447039 587051034 592678308 597552061 600501001
664.9 600501001 603058517 606291533 608989596 611853480 615109503 617735982 620230794 622985244
681.2 622985244 625054419 626867592 628985286 630494893 631702662 633316994 634430468 635020971 636104345
699.6F36104345J113594R24051J578033J712799J302778J878560K271891J758516J981258
717.9F50625825K384305J927733K026141K470136J885533J663566K124488J593828
734.2F66701555J237035J808107J510739J020372J611173J652837J190066J629770
750.6F78361654J756668J232386J546919J766920J144052J290083J627624J033843
766.9F89760149R61661J278162N26786l9101R4354n90980j225173q28982p68900p05301
787.3F88462675M59551J351953J821041L183127M276156M407644M960597N265653M426002
805.6G18614399L938199L740489K729297K055406J904845Q51572k95997q49902k015531
824G30672777l170252l333390l797889m462778l911019l267228l367663k973258k503693
$$ plain form
699.6 636104345 637217939 638141990 639720023 641432822 642735600 644614160 646886051 648644567 650625825
717.9 650625825 653010130 654937863 656964004 659434140 661319673 662983239 665107727 666701555
734.2 666701555 667938590 669746697 671257436 672277808 673888981 675541818 676731884 678361654
750.6 678361654 680118322 681350708 682897627 684664547 685808599 687098682 688726306 689760149
766.9 689760149 690721810 691999972 692526758 692487657 692582011 691991031 690765858 689936876 689167976 688462675
787.3 688462675 688922226 690274179 692095220 695278347 699554503 703962147 708922744 714188397 718614399
805.6 718614399 722552598 726293087 729022384 731077790 732982635 733834207 733538210 732688308 730672777
824 730672777 727502525 724169135 720371246 715908468 711997449 708730221 705362558 702389300 699885607
842.3F99885607k648592j936913l51190Q55446K474367M636884N913079O806194P931650
860.7G23566532Q116484P691562P568479O665408N098462M330337L565491K170920
877G68773675J411796P66515o27696j411319j667261k480328k683938j932978j502872
895.4G58645594p89106O51121J323581J446009J931846J581371M53770j18494j001060
913.7G64124632k492964l156662l415347l847956l174365j751542r63509j06990Q47161
932.1G46062458P17163M15206O36339K70188k19524j6213k79963j095772j550316k452672
952.5G42486894l925085m798949n702138p259905q399963r349227j0839045j1787534
968.8F80425048j1865735j1766911j0870158r139479p880091o997645n932272n364537
$$ plain form
842.3 699885607 697237015 695300102 694948912 695804358 698278725 702915609 708828688 715634882 723566532
860.7 723566532 731683016 739374578 746943057 753608465 758706927 763037264 766602755 768773675
877 768773675 770185471 770951986 770324290 768912971 767245710 764765382 762081444 760148466 758645594
895.4 758645594 757856488 758507609 759831190 761277199 763209045 764790416 765244186 765125692 764124632
913.7 764124632 761631668 758475006 755059659 751211703 748037338 746285796 745322287 745215297 746062458
932.1 746062458 746779621 747194827 747831166 748101354 747881830 747865617 747585654 746489882 744939566 742486894
952.5 742486894 738561809 733762860 728060722 720800817 712400854 703051627 692212582 680425048
968.8 680425048 668559313 656792402 645922244 636782765 628902674 621905029 615972757 610608220
985.1F10608220n177677m598379m075110l832817l232419k599180k391458k058148
1001.4E82643032j763225k168476k815068l403365m252017m814863m744649m661262
1017.7E54020107m505694l918409l497601l366470k924264k519309k422870k133846
1034.1E28731644j795709j675308j387119j117647j294851j471162j427948j491487
1050.4E17070413j317919n40912K86818R19223J501262J540243P64013l62516j707136
1068.7E18153489l105939l838181l919840l877223l630459l303796l399462l727436
1085D89351153m001200m280180m153043l215164j873582o11335M49627J016170J028061
1103.4D73710507Q98361O98805K22832l51846j014441k088934l583938n130798n671799
$$ plain form
985.1 610608220 605430543 600832164 596757054 592924237 589691818 587092638 584701180 582643032
1001.4 582643032 580879807 578711331 575896263 572492898 568240881 563426018 558681369 554020107
1017.7 554020107 549514413 545596004 542098403 538731933 535807669 533288360 530865490 528731644
1034.1 528731644 526935935 525260627 523873508 522755861 521461010 519989848 518561900 517070413
1050.4 517070413 515752494 515211582 515498400 516417623 517918885 519459128 520223141 519860625 518153489
1068.7 518153489 515047550 511209369 507289529 503412306 499781847 496478051 493078589 489351153
1085 489351153 485349953 481069773 476916730 473701566 471827984 471216649 471666276 472682446 473710507
1103.4 473710507 474608868 475307673 475530505 475178659 474164218 472075284 468491346 463360548 457688749
1121.8D57688749l952414r17107J039148J657754J511186P42465N84603J633107K780646
1140.1D62768137L161163K978175K557159K017409J657813J619578J686930J899094
1156.4D80345458K448976L176689M079670N291462O486714P328331P863104Q025170
1172.7E25045574P760226P391096P003784O376028N614042M744113L502369K071082
1189.1E69508314P88212l34740j037657r56833k80440P02500J873970K774775L013730
1207.4E76051831K808571K334595J663029J201451J030922Q30591P23481Q59022R66191
1225.8E88469684J088083J395285J617968J735926J986980K119780K006113J944065
1242.1F02363884J825631J471639J148760Q84712N38409L60727M36723N44608Q37207
$$ plain form
1121.8 457688749 453736335 452819228 453858376 455516130 457027316 457769781 458354384 459987491 462768137
1140.1 462768137 465929300 468907475 471464634 473482043 475139856 476759434 478446364 480345458
1156.4 480345458 482794434 485971123 490050793 495342255 501828969 509157300 517020404 525045574
1172.7 525045574 532805800 540196896 547200680 553576708 559190750 563934863 567437232 569508314
1189.1 569508314 570296526 569961786 568924129 567967296 567686856 568389356 570263326 573038101 576051831
1207.4 576051831 578860402 581194997 582858026 584059477 585090399 585920990 586644471 587503493 588469684
1225.8 588469684 589557767 590953052 592571020 594306946 596293926 598413706 600419819 602363884
1242.1 602363884 604189515 605661154 606809914 607694626 608233035 608593762 609030485 609575093 610412300
1260.4F10412300J412630J915097K361119K921939L345906L609419L941000M156589
1276.8F34075999M174173M327417M531681M553437M685462M897833M790783M541874
1293.1F70578659M342258L989636L572464L277183K908886K512454K297700J988113
1309.4F95467353J565873J384736J269340J101732J203657J378893J333476J316368
1325.7G06021428J298189J060784P74861N26130J81555m7326J84596N45800O69181
1344.1G11215198P30813P17401O28352N53966L58283J15514m5001m00126q47519p79807
1364.5G12247074o88911r76085j022399j048863j212001j017987j072109j749993k187848
1382.8G01270878j816868j263500q53836n96404r61900j507461j476169j542508j724482
$$ plain form
1260.4 610412300 611824930 613740027 616101146 619023085 622368991 625978410 629919410 634075999
1276.8 634075999 638250172 642577589 647109270 651662707 656348169 661246002 666036785 670578659
1293.1 670578659 674920917 678910553 682483017 685760200 688669086 691181540 693479240 695467353
1309.4 695467353 697033226 698417962 699687302 700789034 701992691 703371584 704705060 706021428
1325.7 706021428 707319617 708380401 709155262 709681392 709862947 709815621 710000217 710546017 711215198
1344.1 711215198 711946011 712663412 713291764 713845730 714204013 714319527 714274526 713874400 713026881 712247074
1364.5 712247074 711558163 710582078 709559679 708510816 707298815 706280828 705208719 703458726 701270878
1382.8 701270878 699454010 698190510 697336674 696740270 695778370 694270909 692794740 691252232 689527750
1401.2F89527750k006590k500356k400517k077758j958490j726508j490354j633883
1417.5F73733294j554012n96822j20878j11878j00314j38820J32621M10914M23670
1435.9F72077775R40084J515389J551032J414537J356543J618385K218008K521932
1452.2F85213685K498388L258527N483865N866409N108773N248785N679846N367399
1468.5G23725677N187928O161809O781042N928397M681289L555834K761126J792908
1484.8G60576010O30676k44379l05295k66909j210928k575517k596319j903057k027094
1503.2G50077188m076183p057786m452824k586604l178060l766000l722668l015875
1519.5G18221188k975583k362013j598120j619279j386941j708090k131284j230776
$$ plain form
1401.2 689527750 687521160 685020804 682620287 680542529 678584039 676857531 675367177 673733294
1417.5 673733294 672179282 671582460 671461582 671349704 671249390 671110570 671243191 671654105 672077775
1435.9 672077775 673017859 674533248 676084280 677498817 678855360 680473745 682691753 685213685
1452.2 685213685 687712073 690970600 696454465 702320874 707429647 712678432 718358278 723725677
1468.5 723725677 728913605 735075414 741856456 747784853 752466142 756021976 758783102 760576010
1484.8 760576010 761206686 760962307 760657012 760390103 759179175 756603658 754007339 752104282 750077188
1503.2 750077188 746001005 738943219 734490395 731903791 728725731 724959731 721237063 718221188
1519.5 718221188 715245605 712883592 711285472 709666193 708279252 706571162 704439878 703209102
1535.8G03209102j138627k566100j768887K99037Q72731P69138N14210O85394Q23080
1554.1G01699078L89457n40853L29912J287699K67207q47041k099395l049970k532601
1572.5F94903493l435314n932987n272924m384637n458832o213665o460786o719768
1588.8F51024580o890953o949484p119715o973565o668448o775797o878197o614804
1605.1E96153617o571949o825268o548941o063521p020652q212447n792857m657387
1621.4E44460595n793095n411923m579365l953397k602578k126276k398312n49138
1637.8E17046511J219928J666546J803100K236307L380776L598034L756285N880713
1654.1E40588200O132543N378068N393147O082118O747961O081879O093085P317424
$$ plain form
1535.8 703209102 702070475 699504375 697735488 698034525 698907256 699676394 700190604 700875998 701699078
1554.1 701699078 702088535 701547682 701877594 703165293 703432500 702585459 700486064 697436094 694903493
1572.5 694903493 691468179 685535192 680262268 675877631 670418799 664205134 657744348 651024580
1588.8 651024580 644133627 637184143 630064428 623090863 616422415 609646618 602768421 596153617
1605.1 596153617 589581668 582756400 576207459 570143938 563123286 554910839 549117982 544460595
1621.4 544460595 538667500 533255577 528676212 524722815 522120237 519993961 517595649 517046511
1637.8 517046511 518266439 519932985 521736085 523972392 527353168 530951202 534707487 540588200
1654.1 540588200 546720743 552098811 557491958 563574076 570322037 576403916 582497001 589814425
1670.4E89814425P190823P239938P941305P323683O480634O839514R367466R259999
1686.7F51457787P893979P988334P130265P022560P817566Q372247R996236Q678257
1703G16357231P178366P138789O294727N188644M156530L557801M096866M689336M174948
1721.4G62833238L547847L112554K655268K364695K023340K183198L037990K906203
1737.7G84664333K656937K860784K928793K764762K736211L017962L360033L025472
1754H08015287K471149K150535J910627J905740J883626J523852J114011Q08358R45747
1772.4H22728932J662373J711607J248599J076936J152635J094937J040101Q29697
1788.7H32545817L58105N37514J156926J075030P14779P32302R21846Q62181O44922
$$ plain form
1670.4 589814425 597005248 604245186 612186491 619510174 625990808 632830322 642197788 651457787
1686.7 651457787 659351766 667340100 674470365 681492925 689310491 697682738 707678974 716357231
1703 716357231 723535597 730674386 736969113 742157757 746314287 749872088 753968954 758658290 762833238
1721.4 762833238 766381085 769493639 772148907 774513602 776536942 778720140 781758130 784664333
1737.7 784664333 787321270 790182054 793110847 795875609 798611820 801629782 804989815 808015287
1754 808015287 810486436 812636971 814547598 816453338 818336964 819860816 820974827 821783185 822728932
1772.4 822728932 824391305 826102912 827351511 828428447 829581082 830676019 831716120 832545817
1788.7 832545817 832903922 833441436 834598362 835673392 836388171 837120473 838042319 838904500 839549422
1807H39549422M12345M34220O97732P16984M82858M14252L94881K02775J53064K41101
1827.4H43699634K23577N61118Q23736N25177L06606L29375R7991j85967K80023P20024
1847.8H47381294N65886M24326L68118K18809J41561K54690K51890P6353j55926k42173
1868.2H49284828K35021O92844N01275J56164J41442J67966O3121R7991J07526j07288
1888.6H51340890j0073K56538J43230R3699K19166J20461j4603L7610r656r1254R5546
1911.1H52181554J82926n4776j71960k6702k4319Q583K00152J14799m9889l5942q0347
1933.5H52244079j22309l5524j23322l27468j81019K5451m4048n2690n0128j94132
1953.9H51138890k05457j29462j94490k07424j58965k50876k18749k7180p8082k05577
$$ plain form
1807 839549422 839961767 840395987 841093719 841810703 842293561 842707813 843102694 843305469 843458533 843699634
1827.4 843699634 843923211 844484329 845308065 845833242 846139848 846469223 846567214 846381247 846661270 847381294
1847.8 847381294 847947180 848371506 848739624 848958433 849099994 849354684 849606574 849682927 849527001 849284828
1868.2 849284828 849519849 850212693 850713968 850870132 851011574 851179540 851242661 851340652 851448178 851340890
1888.6 851340890 851330817 851587355 851730585 851824284 852043450 852163911 852149308 852186918 852177262 852086008 852181554
1911.1 852181554 852364480 852309704 852137744 852111042 852086723 852095306 852295458 852410257 852360368 852324426 852244079
1933.5 852244079 852121770 852086246 851962924 851635456 851454437 851479888 851435840 851383150 851333022 851138890
1953.9 851138890 850933433 850803971 850609481 850402057 850243092 849992216 849773467 849746287 849668205 849462628
1974.3H49462628j23858r2745j95384j44541q8096k03371k33829k10464k29359j06215
1994.7H47834766k5570j68205k35379j34110j48833k49564k07603j90199k57850k40087
2015.1H45977366k23577k34783j65701j32680k26855k37524j63198j85370j92583j36077
2035.5H44079018j75774k25425j59085j49071j81258j30117j44780k11119j35124q0585
2055.9H42486680j49012j42932j02699j48535j29103k8610n6565q0169r417n9247j32442
2078.3H41447949o3419k5392n8949k7060k8491r5010o4254K385l7432m5598J4842j5319
2102.8H41004252o2227j7464J9968J1980R418n424L457O2048P9513L8981M6909Q3506
2127.3H41274917P6175P2360P4923M5299L9757J01805J11699O2346J07646J66416J28627
$$ plain form
1974.3 849462628 849338770 849246025 849050641 848906100 848818004 848614633 848380804 848170340 847940981 847834766
1994.7 847834766 847809196 847640991 847405612 847271502 847122669 846873105 846665502 846475303 846217453 845977366
2015.1 845977366 845753789 845519006 845353305 845220625 844993770 844756246 844593048 844407678 844215095 844079018
2035.5 844079018 843903244 843677819 843518734 843369663 843188405 843058288 842913508 842702389 842567265 842486680
2055.9 842486680 842337668 842194736 842092037 841943502 841814399 841785789 841729224 841649055 841639638 841580391 841447949
2078.3 841447949 841384530 841359138 841300189 841273129 841244638 841149628 841085374 841087759 841050327 841004729 841019571 841004252
2102.8 841004252 840942025 840924561 840944529 840956509 840965927 840960503 840963960 841026008 841105521 841144502 841191411 841274917
2127.3 841274917 841351092 841423452 841498375 841543674 841583431 841685236 841796935 841859281 841966927 842133343 842261970
2149.7H42261970J21892J40309J02043J02580J40667J32739J20759J14799P0870Q9049
2170.1H43397677J87099J80304R1672J05619J52946J13845J03831J29640R3520O2406
2190.5H44618559Q1003Q8214P4506P0811M8995K5153M2140L9876K0742O0439R4354
2212.9H45264792O6042L8863L2305L1829L2783J9133j8716k5690J5498J2755k4140
2235.4H45445454p212L0577J8239k682k5928r4116j00255p629J9789j5855l517j0133
2259.8H45246732m8101k0742K2709J3530J0312J1504P629O5446J12832R2566R6619
2282.3H45611036R7990K3246P569P7785P0631K0981M1962P4505M6194N8830J26540
2304.7H46257269J03236L9696L0578q405j6212N1617J0252m6312K2471J8239l3856
$$ plain form
2149.7 842261970 842383862 842524171 842626214 842728794 842869461 843002200 843122959 843237758 843308628 843397677
2170.1 843397677 843584776 843765080 843856752 843962371 844115317 844229162 844332993 844462633 844556153 844618559
2190.5 844618559 844699562 844787776 844862282 844933093 844982088 845007241 845049381 845089257 845109999 845170438 845264792
2212.9 845264792 845330834 845369697 845402002 845433831 845466614 845485747 845467031 845441341 845456839 845469594 845445454
2235.4 845445454 845438242 845468819 845487058 845484376 845458448 845364332 845264077 845256448 845276237 845260382 845256865 845246732
2259.8 845246732 845198631 845177889 845200598 845214128 845224440 845235944 845243573 845309019 845421851 845514417 845611036
2282.3 845611036 845709026 845732272 845739841 845817626 845888257 845909238 845951200 846025705 846071899 846130729 846257269
2304.7 846257269 846360505 846400201 846430779 846422374 846406162 846457779 846468031 846421719 846444190 846462429 846428573
2327.1H46428573M6730R8348j2636q2434o7770j09851n9426J82032L98755N27025M40597
2349.6H47789943P2479l11613l39031k18034q7380J91629K73228J78217K56181L99351
2370H48204970M47989M46379M08351L49045L50952L55602K53975J60396J53363Q1837
2390.4H51212859K5690J00612R1613R358N4180Q7381K3603L1769N2870j6749j6451
2412.8H51656735M9233Q285k9265J9848k3365r8646m3511r418n7637n7757o8069r6977
2437.3H51249456l0398P272q7559j16826m3928o0022r1493l4869l2127p9036p2240
2459.7H50608230r3460j19091m8279l9161j35839j26540q7917j57893j47581q7321
2480.1H49565148j26898r9003k9624j00732j46508p9989j02759j55985r6262p3194
$$ plain form
2327.1 846428573 846475303 846573651 846561015 846478581 846410811 846300960 846241534 846423566 846822321 847349346 847789943
2349.6 847789943 847862422 847550809 847211778 846993744 846906364 847097993 847371221 847549438 847805619 848204970
2370 848204970 848652959 849099338 849507689 849856734 850207686 850563288 850817263 850977659 851131022 851212859
2390.4 851212859 851238549 851339161 851430774 851440132 851494312 851581693 851605296 851637065 851689935 851673186 851656735
2412.8 851656735 851705968 851714253 851684988 851704836 851681471 851582825 851539314 851529896 851472259 851414502 851346433 851249456
2437.3 851249456 851219058 851226330 851138771 851021945 850978017 850917995 850826502 850791633 850759506 850680470 850608230
2459.7 850608230 850514770 850395679 850347400 850308239 850172400 850045860 849957943 849800050 849652469 849565148
2480.1 849565148 849438250 849339247 849309623 849208891 849062383 848982394 848879635 848723650 848627388 848554194
2500.5H48554194j26421j21713j08659j31667q7679m7385j02163j13666o5505j10209
2520.9H47539127j59979r6798p1883j24157j30236j17004j13010p2241p6830j51396
2541.3H46425593j36733p9274j31905j54496q7618q9407j05203p4267j13726j92523
2561.7H45260441j76370j30534j53780j74582j85072k25306k18987j74821j90317k19107
2582.1H43411565k16901k62738k95698k26438k25127l12627l13520l20256l70323l13521
2602.5H40554416k86281l87847m02511l38852l44336l46601l45528m25041m59373l71456
2622.9H36846590l46601m08769l86059l55124l88742l54051l47913m25994m02749l45289
2643.3H33085299l63350l63052l59595m25935m38034l64423l71456l72708k83420l01004
$$ plain form
2500.5 848554194 848427773 848306060 848197401 848065734 847978055 847930670 847828507 847714841 847649336 847539127
2520.9 847539127 847379148 847282350 847210467 847086310 846956074 846839070 846726060 846653819 846576989 846425593
2541.3 846425593 846288860 846209586 846077681 845923185 845835567 845746160 845640957 845566690 845452964 845260441
2561.7 845260441 845084071 844953537 844799757 844625175 844440103 844214797 843995810 843820989 843630672 843411565
2582.1 843411565 843194664 842931926 842636228 842409790 842184663 841872036 841558516 841238260 840867937 840554416
2602.5 840554416 840268135 839880288 839477777 839138925 838794589 838447988 838102460 837677419 837218046 836846590
2622.9 836846590 836499989 836091220 835705161 835350037 834961295 834607244 834259331 833833337 833430588 833085299
2643.3 833085299 832721949 832358897 831999302 831573367 831135333 830770910 830399454 830026746 829743326 829442322
2663.7H29442322l91245l60667l35574l67225l27527l11554l63171l72588l76285m37080
2684.1H25799406m48823l90768l91365l93629l61442m14133m56572m25100m58300m94361
2704.5H21564913m38571m22955m69029m60863m67658n27918n02050m36008m27485l95715
2724.8H17016661m27306n95629o20067m57764l96013m29809m37617m76659m78923l88861
2745.2H12308013l70800m50790m99129n39065n75304n12302m81188n63979n78106n39660
2765.6H07197690n69046n81920n22613n15402o10709o81817p10607p52747p20501o14941
2786H00917387n81026o50287p65025q59142q46147q22604r13262r51469r16362r66251
2806.4G92645812r71794r18031r91285j092434j095414j085877j114071j138150j161099
$$ plain form
2663.7 829442322 829051077 828690410 828354836 827987611 827660084 827348530 826985359 826612771 826236486 825799406
2684.1 825799406 825350583 824959815 824568450 824174821 823813379 823399246 822942674 822517574 822059274 821564913
2704.5 821564913 821126342 820703387 820234358 819773495 819305837 818777919 818275869 817839861 817412376 817016661
2724.8 817016661 816589355 815993726 815373659 814915895 814519882 814090073 813652456 813175797 812696874 812308013
2745.2 812308013 811937213 811486423 810987294 810448229 809872925 809360623 808879435 808315456 807737350 807197690
2765.6 807197690 806628644 806046724 805524111 805008709 804398000 803716183 803005576 802252829 801532328 800917387
2786 800917387 800336361 799686074 798921049 798061907 797215760 796393156 795479894 794528425 793612063 792645812
2806.4 792645812 791674018 790755987 789764702 788672268 787576854 786490977 785376906 784238756 783077657
2824.8G83077657j222133j278222j327515j437008j554728j690209k028226k542377
2841.1G69997239l006339l335297l516972l396988k810776j963914j249790q15570
2857.4G49901593p07984r33171j339495j725733j978099k074063j996041j838684j723647
2875.8G35584676j548171j323521j235545j285195j359522j406312j444280j495958
2892.1G24486172j535654j602411j740098j781225j705826j750648j943648k171933
2908.4G10254729k425015k730608l021777l134549k964258k526879j917243j295507
2924.7F90238893o85215j40965J26958L35157P79033J262545J642823J988113K177656
2943.1F97724998K023041J574755J092613P95841N44727K50041J76430L51846N16057
$$ plain form
2824.8 783077657 781855524 780577302 779249787 777812779 776258051 774567842 772539616 769997239
2841.1 769997239 766990900 763655603 760138631 756741643 753930867 751966953 750717163 749901593
2857.4 749901593 749193609 748260438 746920943 745195210 743217111 741143048 739147007 737308323 735584676
2875.8 735584676 734036505 732712984 731477439 730192244 728832722 727426410 725982130 724486172
2892.1 724486172 722950518 721348107 719608009 717826784 716120958 714370310 712426662 710254729
2908.4 710254729 707829714 705099106 702077329 698942780 695978522 693451643 691534400 690238893
2924.7 690238893 689553678 689412713 689539671 689874828 690653861 691916406 693559229 695547342 697724998
2943.1 697724998 699748039 701322794 702415407 703211248 703755975 704006016 704182446 704534292 705050349
2961.4G05050349N29588M67658M47034M89891O06239O86824O22034O28472P17520O10650
2981.8G10856259M68433N03123N30183N24580M75467J77681j22964k74182m95612o61314
3002.2G11981654p06792p50303p04348n75423o10531q53419j073539j173973j237929
3020.6G04295397j271844j300812j399398j415908j312137j270652j383721j525104
3036.9F93415821j491487j439810j554251j739204j845896j766741j678467j749993
3053.2F80149972j815199j828909j843393j758814j622498j578510j665473j811147
3069.5F66226029j825213j649737j442612j420378j637280j802922j788437j797438
3085.8F52862012j809537j804292j922369k000213j876891j752674j839280k023638
$$ plain form
2961.4 705050349 705579937 706047595 706494629 706984520 707590759 708277583 708899617 709528089 710245609 710856259
2981.8 710856259 711324692 711827815 712357998 712882578 713358045 713535726 713412762 713138580 712642968 711981654
3002.2 711981654 711274862 710524559 709820211 709244788 708634257 707780838 706707299 705533326 704295397
3020.6 704295397 703023553 701722741 700323343 698907435 697595298 696324646 694940925 693415821
3036.9 693415821 691924334 690484524 688930273 687191069 685345173 683578432 681899965 680149972
3053.2 680149972 678334773 676505864 674662471 672903657 671281159 669702649 668037176 666226029
3069.5 666226029 664400816 662751079 661308467 659888089 658250809 656447887 654659450 652862012
3085.8 652862012 651052475 649248183 647325814 645325601 643448710 641696036 639856756 637833118
3102.2F37833118k038121j889765j841247k025008k115012j950323j929760k125859
3118.5F21918023k346576k519488k499998k327561k212703k306819k499521k486110
3134.8F02719247k304732k297223k559841k741456k676368k584517k478063k392709
3151.1E82684338k549708k834856k922833k831638k768934k789140k814352k798498
3167.4E60374379k794981k818167k829433k849340k905428k886415k819836k838075
3183.7E37632704k857864k840579k851069k848327k845108k905369k911151k806246
3200.1E14766991k726555k740144k769232k767146k737522k687752k656132k613306
3216.4D93069202k598673k647549k665341k609968k529473k469182k378940k284795
$$ plain form
3102.2 637833118 635794997 633905232 632063985 630038977 627923965 625973642 624043882 621918023
3118.5 621918023 619571447 617051959 614551961 612224400 610011697 607704878 605205357 602719247
3134.8 602719247 600414515 598117292 595557451 592815995 590139627 587555110 585077047 582684338
3151.1 582684338 580134630 577299774 574376941 571545303 568776369 565987229 563172877 560374379
3167.4 560374379 557579398 554761231 551931798 549082458 546177030 543290615 540470779 537632704
3183.7 537632704 534774840 531934261 529083192 526234865 523389757 520484388 517573237 514766991
3200.1 514766991 512040436 509300292 506531060 503763914 501026392 498338640 495682508 493069202
3216.4 493069202 490470529 487822980 485157639 482547671 480018198 477549016 475170076 472885281
3232.7D72885281k364576k487332k399832k242595k132564k012939j975774k059669
3249D55210000k083689k011358j951009j945168j981408j962125j889080j855701j795202
3267.4D37735260j695395j779377j990766k044707j967132j898587j878202j878321
3283.7D22602773j868457j866460j834422j815438j901865k007336k072245k076268
3300D07160282j951963j787483j833499k102881k308608k313345k197504k133876k173037
3318.4C88358086k147972k029002k006054k184987k330601k267212k184808k086997
3334.7C71120453j944602k036333k268493k285391k226114k194852k047390k042591
3351C54074687k300471k447069k279192k003759j937390k027064j939535j757443j854480
$$ plain form
3232.7 472885281 470520705 468033373 465633541 463390946 461258382 459245443 457269669 455210000
3249 455210000 453126311 451114953 449163944 447218776 445237368 443275243 441386163 439530462 437735260
3267.4 437735260 436039865 434260488 432269722 430225015 428257883 426359296 424481094 422602773
3283.7 422602773 420734316 418867856 417033434 415217996 413316131 411308795 409236550 407160282
3300 407160282 405208319 403420836 401587337 399484456 397175848 394862503 392664999 390531123 388358086
3318.4 388358086 386210114 384181112 382175058 379990071 377659470 375392258 373207450 371120453
3334.7 371120453 369175851 367139518 364871025 362585634 360359520 358164668 356117278 354074687
3351 354074687 351774216 349327147 347047955 345044196 343106806 341079742 339140207 337382764 335528284
3369.3C35528284k163499k204091j913696j690656j570851j472860j408339j250148
3385.7C21854144r41872o63042p15942j018017j024395n46307k06053n21183r40442
3404C15276891p49946k94715q2463p5668j92761k53439m6760J91003K60025M12405
3424.4C14444572P14391R41336Q82686Q82238J148581J092643P14242O89805J058757
3442.8C22569251J392961J537650J583875J672208J781613J917630K116025K231091
3459.1C36802304K076000K036810K462268K718925K304882J742393J770883K206207
3475.4C54120672K597749K620757K258628K211333K564102K623588K487987K617002
3491.7C74101818K793490K860308K820909K772749K765476K623737K506644K651274
$$ plain form
3369.3 335528284 333364785 331160694 329246998 327556342 325985491 324512631 323104292 321854144
3385.7 321854144 320912272 320249230 319533288 318515271 317490876 316944569 316738516 316217333 315276891
3404 315276891 314526945 314232230 314149767 314074099 313881338 313627899 313581139 313772142 314032167 314444572
3424.4 314444572 315158963 316100299 316982985 317865223 319013804 320106447 320820689 321510494 322569251
3442.8 322569251 323962212 325499862 327083737 328755945 330537558 332455188 334571213 336802304
3459.1 336802304 338878304 340915114 343377382 346096307 348401189 350143582 351914465 354120672
3475.4 354120672 356718421 359339178 361597806 363809139 366373241 368996829 371484816 374101818
3491.7 374101818 376895308 379755616 382576525 385349274 388114750 390738487 393245131 395896405
3508C95896405K932101L188640L182561K953767K950847L179878L399820L311455L066510
3526.4D24061984L140151L433943L657788L802896L764659L614962L788441M017771
3542.7D53282595L934771L702461L722310L932655M074067M184783M306197M397273
3559D85537112M340410M101992L964930M572124N344033N277932M978418M972160N132973
3577.4E28222084N378068N599677N522907N170822N055308N641282N909860N705595
3593.7E72205603N738378O020903O109774O065846N925178N530954N485773N882144
3610F18964553O033778N989730N838097N846023O416142O418586N645513M912913M976988
3628.4F71042323O038725O130934N656004N347073N080879M859805M625976M130721
$$ plain form
3508 395896405 398828506 402017146 405199707 408153474 411104321 414284199 417684019 420995474 424061984
3526.4 424061984 427202135 430636078 434293866 438096762 441861421 445476383 449264824 453282595
3542.7 453282595 457217366 460919827 464642137 468574792 472648859 476833642 481139839 485537112
3559 485537112 489877522 493979514 497944444 502516568 507860601 513138533 518116951 523089111 528222084
3577.4 528222084 533600152 539199829 544722736 549893558 554948866 560590148 566500008 572205603
3593.7 572205603 577943981 583964884 590074658 596140504 602065682 607596636 613082409 618964553
3610 618964553 624998331 630988061 636826158 642672181 649088323 655506909 661152422 666065335 671042323
3628.4 671042323 677081048 683211982 688867986 694215059 699295938 704155743 708781719 712912440
3644.7G12912440L474057L758609M968644M937052M215122M141151M262269L706694
3661G46376038L023028K670586K202451J690746K061665K276420J778603K341151L036976
3679.4G67457664K824307K388119J934886J511753J310944J795650K258599K048909
3695.7G83530831J586676J167178R66668J209200J226127O37233J42694O05106J571774
3714G92643487J576663R79781N01513K86460L68714O54579Q94725N35130k08079k71321
3734.4G97961652P35164J443088J035094q5950p30216K66850N25892Q3327J007140
3752.8H02242041J570165Q96692L63410O53684Q44598M41968J03474K9981L37839P69198
3773.2H08253050O42657K47955J6630J45257K79903K93434M42385M82321K79248r0003
$$ plain form
3644.7 712912440 716386497 720145106 725113750 730050802 734265924 738407075 742669344 746376038
3661 746376038 749399066 752069652 754272103 755962849 758024514 760300934 762079537 764420688 767457664
3679.4 767457664 770281971 772670090 774604976 776116729 777427673 779223323 781481922 783530831
3695.7 783530831 785117507 786284685 787251353 788460553 789686680 790323913 790466607 791071713 792643487
3714 792643487 794220150 795199931 795701444 795987904 796356618 797011197 797905922 798441052 798232973 797961652
3734.4 797961652 798696816 800139904 801174998 801089048 800358832 800625682 801151574 801234901 802242041
3752.8 802242041 803812206 804708898 805072308 805725992 806570590 807012558 807116032 807146013 807483852 808253050
3773.2 808253050 808895707 809143662 809160292 809305549 809585452 809878886 810321271 810803592 811082840 810992837
3793.6H10992837m49956l90291k94327k12908N78403O99759M05490O76572N27859k65479
3814H12267959p72714k81096j53124q94P41064O49989K92361M6730j92285j61052l25978
3836.4H12110960n01573J64688P61569P70986N27024J8418q77738j762390l48688J532257
3856.8H12395513J196206J81615m97222l22342J52230q1241j81913L43263N96106M02808
3877.2H14185023k18332k90691K54392J47403J02818J40190j01447J41739L04580k29895
3897.6H14435780p39217n69403k265O26564Q83937N09560M8757j30356k64227k72274
3918H14526856l58R1493m9173N0187J14798p7426R954L23593L16740P5161j31607k00510
3942.5H15049708m4286J2219p2301R4414L07619K53022Q8394O6221J10209P4267O080
$$ plain form
3793.6 810992837 810542881 810152590 809858263 809645355 810223758 810923517 811329007 812005579 812533438 812267959
3814 812267959 811495245 811214149 811061025 811060131 811801195 812451184 812743545 812790275 812597990 812436938 812110960
3836.4 812110960 811609387 811774075 812535644 813306630 813833654 813852072 812974334 811211944 810863256 812395513
3856.8 812395513 813591719 813773334 813276112 812953770 813106000 813024759 812842846 813186109 813782215 814185023
3877.2 814185023 813966691 813676000 813930392 814077795 814180613 814320803 814219356 814361095 814665675 814435780
3897.6 814435780 813696563 813127160 813124895 813751459 814635396 815144956 815193713 815063357 814799130 814526856
3918 814526856 814526498 814617991 814568818 814619005 814733803 814656377 814666331 814989924 815306664 815381825 815250218 815049708
3942.5 815049708 815005422 815017641 814945340 815039754 815347373 815600395 815688789 815755010 815865219 815939486 815945566
3964.9H15945566l7790j7106N5969O7710L994K9862J40369J98901J96456J46866M6313
3987.3H16777110P272N4717O3419N9903J11580
3997.5H17074001
$$ plain form
3964.9 815945566 815907776 815890670 815946639 816014349 816018343 816048205 816188574 816387475 816583931 816730797 816777110
3987.3 816777110 816784382 816839099 816902518 816962421 817074001
3997.5 817074001
##END=$$ End of the data block
