##TITLE=$$ Begin of the data block
##JCAMP-DX=5.00 $$ ACD/SpecManager v 10.08
##SPECTROMETER/DATA SYSTEM=Alpha
##DATE=10 Apr 2014 11:00:52
##DATA TYPE=INFRARED SPECTRUM
##DATA CLASS=XYDATA
##ORIGIN=
##OWNER=
##NPOINTS=1765
##FIRSTX=399.75695801
##LASTX=3997.56933594
##MAXX=3997.56933594
##MINX=399.75695801
##MAXY=0.85249746
##MINY=0.31393769
##XFACTOR=1.0000000000
##YFACTOR=1.000000000000000e-9
##FIRSTY=0.62812322
##DELTAX=2.03957629
##XUNITS=1/CM
##YUNITS=ARBITRARY UNITS
##XYDATA=(X++(Y..Y))
399.8F28123224p08342j526296j096427L30686n49912j501441l73066l91662j426160
418.1F20880604l40522L7134n02586K41339R0599p55012n69582q79109j211107p7366
438.5F16914392L6358o75082Q3745J70946n80669M6194L40640n64396o41048m78089
458.9F14652991r36567n73516m02928r68814n90264n59271j490056q40068R4116m03107
479.3F07982516o03497l15487o53803m18962R1672p10606j052201m44293r21130j196563
499.7F01757646m38989o28471r98676m29213o08921j097441p77900j056313j482606
518.1E94239116o74904n79357j545846j372576q43287j268804j101255p26640j123727
536.4E85002720p71701k04682o66499o74606l39389q74817q94785l87907j011372j332163
$$ plain form
399.8 628123224 627414882 625888586 624792159 625122845 624572933 623071492 622698426 622306764 620880604
418.1 620880604 620540082 620577216 620074630 620315969 620406568 619651556 619081974 618202865 616991758 616914392
438.5 616914392 616950750 616275668 616359413 616530359 615949690 615995884 616336524 615772128 615131080 614652991
458.9 614652991 613716424 613142908 612739980 611771166 611180902 610621631 609131575 608291507 608385623 607982516
479.3 607982516 607379019 607063532 606409729 605990767 606082439 605371833 604319632 603875339 602954209 601757646
499.7 601757646 601318657 600690186 599691510 599262297 598653376 597555935 596778035 595721722 594239116
518.1 594239116 593564212 592984855 591439009 590066433 589223146 587954342 586853087 586126447 585002720
536.4 585002720 584231019 584026337 583359838 582685232 582345843 581471026 580576241 580188334 579176962 577844799
556.8E77844799p34568j257539j944303j521171j715183k262950j795053j764178k255321
575.2E62594533j713872j510322k085507j591921j195252j769185j603246j199781
591.5E49925447j635194j520992j088082j679063j919925j499653j562238j000226
607.8E38020074J63317M2498l30806N75066J796961K888799L994941M164279L519237
626.1E54834366L541887L590107K973079K915144K938688K096355J584828J331925
642.5E75806379Q18074J544535K789021J949787J27673k10941J047969L514946N510091
660.8E92897534M855216K890587K486408L308892K856672K958059L212154K554118
677.1F18019640K509952K763808K044618J798093K158821J590371J224220J602709
$$ plain form
556.8 577844799 577110231 575852692 573908389 572387218 570672035 568409085 566614032 564849854 562594533
575.2 562594533 560880661 559370339 557284832 555692911 554497659 552728474 551125228 549925447
591.5 549925447 548290253 546769261 545681179 544002116 542082191 540582538 539020300 538020074
607.8 538020074 538183391 538225889 537895083 538470149 540267110 543155909 547150850 551315129 554834366
626.1 554834366 558376253 561966360 564939439 567854583 570793271 572889626 574474454 575806379
642.5 575806379 576624453 578168988 580958009 582907796 583035469 582824528 583872497 587387443 592897534
660.8 592897534 597752750 600643337 603129745 606438637 609295309 612253368 615465522 618019640
677.1 618019640 620529592 623293400 625338018 627136111 629294932 630885303 632109523 633712232
693.5F33712232J103401N61893J074732J062929Q61109J610279J759410J319110J917660
711.8F44982755K313614J805902K060830K405226J832426J936138K443194J856983
728.1F61637068J624226K113521J646221J299024J788556J465023J044512J656949
744.4F74275100J634479J207351J740695J796603J198172J533807J711964J029909
760.8F86128080J199365J626908J105130R95040J222610N02110J7881Q7858o47724
779.1F92237258j174331p25269p57754p74205L77179J259565J757324L194689M346192
797.5F99740648M512966N034685N227268M338682L941655L802180K727807K004265
813.8G31330156J898229Q47817l56317q46386j938581l148854l363728l782034m368365
$$ plain form
693.5 633712232 634815633 635377526 636452258 637515187 638376296 639986575 641745985 643065095 644982755
711.8 644982755 647296369 649102271 651163101 653568327 655400753 657336891 659780085 661637068
728.1 661637068 663261294 665374815 667021036 668320060 670108616 671573639 672618151 674275100
744.4 674275100 675909579 677116930 678857625 680654228 681852400 683386207 685098171 686128080
760.8 686128080 687327445 688954353 690059483 691054523 692277133 692779243 692797124 692884982 692237258
779.1 692237258 691062927 690337658 689579904 688805699 689182878 690442443 692199767 695394456 699740648
797.5 699740648 704253614 709288299 714515567 718854249 722795904 726598084 729325891 731330156
813.8 731330156 733228385 734076202 733719885 732873499 730934918 727786064 724422336 720640302 716271937
832.1G16271937l868401l350675l451884l012896k539456k635777j885235l21507Q59260
850.5F96065366K448559M583299N873323O831705P971764Q070648P619917P583439
866.8G47048020O722331N116642M292548L508389K163350J443863P94053o32107j463175
885.2G68993914j720190k500117k683282j912713j492738q18909O40095J351595J455426
903.5G61313081J950323J633048M78328j20104j009226k537667l210724l399253l776133
921.9G51321673l140390j766085r97603j53065Q37505P47800M12822O06000K80678
940.2G48149335j78814k801l02732j139104j582086k419889l890038m868209n779565
958.6G27986097p212877q325338r350896j0879100j1825442j1861861j1728584j0858417
$$ plain form
832.1 716271937 712403536 709052861 705600977 702588081 700048625 697412848 695527613 695206106 696065366
850.5 696065366 698513925 703097224 708970547 715802252 723774016 731844664 739464581 747048020
866.8 747048020 753770351 758886993 763179541 766687930 768851280 770295143 771089196 770457089 768993914
885.2 768993914 767273724 764773607 762090325 760177612 758684874 757865965 758506060 759857655 761313081
903.5 761313081 763263404 764896452 765374780 765254676 764245450 761707783 758497059 755097806 751321673
921.9 751321673 748181283 746415198 745417595 745264530 746102035 746849835 747262657 747868657 748149335
940.2 748149335 747970521 747967720 747664988 746525884 744943798 742523909 738633871 733765662 727986097
958.6 727986097 720773220 712447882 703096986 692217886 680392444 668530583 656801999 645943582
974.9F45943582r145439p858872o960869n908787n379617n244911m664123m077792
991.2E96703172l776491l174782k604961k456725k106368j772225k168477k804398
1007.5E75838745l374756m224896m823446m770756m686117m519523l919482l480613
1023.9E42039156l297985k878964k550363k458274k105475j725137j630902j392484
1040.2E23999572j169682j344681j472473j401603j458049j294017n80251K04504R07302
1058.5E16390622J552462J570702P61449m01139j752973l099203l809690l896475l809750
1076.9E03506005l573448l344953l467023l743619l982574m258573m141628l215254
1093.2D73778933j883059o02305M85330J038790J036465R01819O62297J60604l74525
$$ plain form
974.9 645943582 636798143 628939271 621978402 616069615 610689998 605445087 600780964 596703172
991.2 596703172 592926681 589751899 587146938 584690213 582583845 580811620 578643143 575838745
1007.5 575838745 572463989 568239093 563415647 558644891 553958774 549439251 545519769 542039156
1023.9 542039156 538741171 535862207 533311844 530853570 528748095 527022958 525392056 523999572
1040.2 523999572 522829890 521485209 520012736 518611133 517153084 515859067 515278816 515483320 516390622
1058.5 516390622 517943084 519513786 520275235 519874096 518121123 515021920 511212230 507315755 503506005
1076.9 503506005 499932557 496587604 493120581 489376962 485394388 481135815 476994187 473778933
1093.2 473778933 471895874 471293569 471778899 472817689 473854154 474755973 475418270 475578874 475204349
1111.6D75204349r91315k060831l554850n099595n680680l987641r30279J035362J661599
1129.9D55596119J541704P60228N76645J640737K782583L131360K932817K530187K047479
1148.3D73539859J700044J619994J673371J901686K464235L193438M062086N233825
1164.6D95388538O454676P334173P865786Q023918P771313P397115O986797O359637
1180.9E53581953N602121M724443L486216K074361Q00729l47495j065731r47893k60949
1199.3E67647755O79970J857281K790868L008962K781331K350152J719415J220703
1215.6E84056437J009107Q32975P53939Q70585R62794J087725J383305J601398J724541
1233.9E94282806J967668K114892K039493J996696J863598J471699J150429R09388
$$ plain form
1111.6 475204349 474213034 472152203 468597353 463497758 457817078 453829437 452899158 453934520 455596119
1129.9 455596119 457137823 457898051 458474696 460115433 462898016 466029376 468962193 471492380 473539859
1148.3 473539859 475239903 476859897 478533268 480434954 482899189 486092627 490154713 495388538
1164.6 495388538 501843214 509177387 517043173 525067091 532838404 540235519 547222316 553581953
1180.9 553581953 559184074 563908517 567394733 569469094 570269823 569922328 568856597 567908704 567647755
1199.3 567647755 568327725 570185006 572975874 575984836 578766167 581116319 582835734 584056437
1215.6 584056437 585065544 585898519 586652458 587523043 588485837 589573562 590956867 592558265 594282806
1233.9 594282806 596250474 598365366 600404859 602401555 604265153 605736852 606887281 607796669
1250.3F07796669N39243L33131M25875N63800Q56161J410425J888752K320826K896368
1268.6F19031250L340841L605664L921926M114329M158318M359425M543423M523576
1284.9F51598752M651784M895807M809499M549622M351795M005492L587543L295839
1301.2F85746133K929211K513587K261520J975953J612068J413047J262009J109243
1317.6G00822771J211822J345574J298786J328468J316309J067400Q08477N73159J97351
1335.9G09970117o4671J64926N51104O79016P12216O95288O30916N66780L62635J22308
1356.3G14390635k4020l87907q69990q10504o83903r54032j003206j033783j219809
1374.7G07403481j039267j088678j763225k197981j803994j227975q52346o28233r67741
$$ plain form
1250.3 607796669 608335912 608669043 609094918 609658718 610514879 611925304 613814056 616134882 619031250
1268.6 619031250 622372091 625977755 629899681 634014010 638172328 642531753 647075176 651598752
1284.9 651598752 656250536 661146343 665955842 670505464 674857259 678862751 682450294 685746133
1301.2 685746133 688675344 691188931 693450451 695426404 697038472 698451519 699713528 700822771
1317.6 700822771 702034593 703380167 704678953 706007421 707323730 708391130 709199607 709772766 709970117
1335.9 709970117 709905446 710070372 710621476 711300492 712012708 712707996 713338912 713905692 714268327 714390635
1356.3 714390635 714366615 713978708 713108718 712298214 711614311 710660279 709657073 708623290 707403481
1374.7 707403481 706364214 705275536 703512311 701314330 699510336 698282361 697430015 696801782 695834041
1393F95834041j461447j423180j545071j765669k026081k483845k380549k065897j937867
1411.4F78744435j694798j456976j619101j573801o17623j28150j21653j18375j56760
1429.7F71257198J41919M43160M19974Q80778J480937J562238J432359J356065J609862
1448.1F80584490K189160K489626K527416L320277N470573N822778N108059N286753
1464.4G12799132N679369N330503N189538O188452O790400N926013M663705L546894
1480.7G56114006K794206J831413O22808k85863l39866k76029j196623k572775k619207
1499.1G54072070j914978k017498m025817o991923m464745k622664l202260l767848
1515.4G25064337l716886k998471k929270k361477j630604j618922j367330j684010
$$ plain form
1393 695834041 694372594 692949414 691404343 689638674 687612593 685128748 682748199 680682302 678744435
1411.4 678744435 677049637 675592661 673973560 672399759 671782136 671653986 671532333 671413958 671257198
1429.7 671257198 671399117 671842277 672262251 673143029 674623966 676186204 677618563 678974628 680584490
1448.1 680584490 682773650 685263276 687790692 691110969 696581542 702404320 707512379 712799132
1464.4 712799132 718478501 723809004 728998542 735186994 741977394 747903407 752567112 756114006
1480.7 756114006 758908212 760739625 761362433 761076570 760736704 760460675 759264052 756691277 754072070
1499.1 754072070 752157092 750139594 746113777 739121854 734657109 732034445 728832185 725064337
1515.4 725064337 721347451 718348980 715419710 713058233 711427629 709808707 708441377 706757367
1531.7G06757367k114594j224459j120388k550006j778185K68578Q51631P91550N48601
1550.1G00430095O97375Q36968M33028n02289K73526J234531K67864q36134k113104
1568.4G00721860l077447k543927l415703n890787n258143m399419n477190o224990
1584.7F64434254o471395o744266o919861o963908p116974o969809o679178o774127
1601.1F09794736o856561o605506o570637o825507o550252o034315o972909q208871
1617.4E55170178n824744m698336n836428n429089m587352l954291k596081k160966
1633.7E20082891k480924n71609J261056J700103J803041K259016L485441L696799
1650E31235814L798246N815208O016255N301237N381107O125033O792605O116331O119370
$$ plain form
1531.7 706757367 704642773 703418314 702297926 699747920 697969735 698238313 699089944 699881494 700430095
1550.1 700430095 701127470 701964438 702397466 701895177 702168703 703403234 703671098 702834964 700721860
1568.4 700721860 697644413 695100486 691684783 685793996 680535853 676136434 670659244 664434254
1584.7 664434254 657962859 651218593 644298732 637334824 630217850 623248041 616568863 609794736
1601.1 609794736 602938175 596332669 589762032 582936525 576386273 570351958 563379049 555170178
1617.4 555170178 549345434 544647098 538810670 533381581 528794229 524839938 522243857 520082891
1633.7 520082891 517601967 517030358 518291414 519991517 521794558 524053574 527539015 531235814
1650 531235814 535034060 540849268 546865523 552166760 557547867 563672900 570465505 576581836 582701206
1668.4E82701206P316768P184744P238984P912696P284105O486654O885946R381056
1684.7F42392159R239256P873595P966458P127822P056355P860542Q373081R960473
1701G07849741Q655190P178784P143438O279230N160451M163325L604829M115820M664302
1719.3G58815110M155099L538907L118157K673030K370656K003908K170443L061116
1735.7G81906426K912939K636790K845466K937019K778292K715706K982021L340065
1752H05054724L017485K481342K163350J920641J926899J901090J533866J112878Q08060
1770.3H21920335R63271J646638J674831J255035J118303J179754J093388J008868
1786.7H31860423P92861L56734N50687J160205J086711P12872P01129Q91924Q55089
$$ plain form
1668.4 582701206 590017974 597202718 604441702 612354398 619638503 626125157 633011103 642392159
1684.7 642392159 651631415 659505010 667471468 674599290 681655645 689516187 697889268 707849741
1701 707849741 716504931 723683715 730827153 737106383 742266834 746430159 750034988 754150808 758815110
1719.3 758815110 762970209 766509116 769627273 772300303 774670959 776674867 778845310 781906426
1735.7 781906426 784819365 787456155 790301621 793238640 796016932 798732638 801714659 805054724
1752 805054724 808072209 810553551 812716901 814637542 816564441 818465531 819999397 821112275 821920335
1770.3 821920335 822883606 824530244 826205075 827460110 828578413 829758167 830851555 831860423
1786.7 831860423 832653284 833010018 833560705 834720910 835807621 836520493 837221622 838113546 838968635
1805H38968635O56187M28736M40717O97851P11859M77016M25100M01735J84834J29998
1825.4H43522668K43604K40803N59389Q21829N28336L02255L53873J40846k06233K18571
1845.8H46725941P03871N64754M23491L78370K30670J67310K61188K23637Q1181j14143
1866.2H49646270k33710J99438O65962M92871J54972J40429J60992N9605J02281J29819
1886.6H51518929o5863J1027K40206J18614R2387K28703J23143n424M6611j6391j06931
1909H52185011P3969J56343o5684j60813r478o794J6987J91092J16825k1994j3291
1931.5H52462173q3089j25170k8312j23144l43620k18153Q34k7060l2604m7386j81794
1953.9H51252675j92940j38104k11179k24173j67370k34545j80244K98j02520k67506
$$ plain form
1805 838968635 839624822 840053558 840494275 841192126 841903985 842381001 842806101 843207836 843392670 843522668
1825.4 843522668 843766272 844007075 844566464 845388293 845916629 846218884 846572757 846713603 846507370 846725941
1845.8 846725941 847429812 847994566 848418057 848796427 849027097 849194407 849455595 849679232 849760413 849646270
1866.2 849646270 849412560 849611998 850277960 850770831 850925803 851066232 851227224 851286829 851389110 851518929
1886.6 851518929 851453066 851464093 851704299 851822913 851915300 852144003 852267146 852261722 852308333 852291942 852185011
1909 852185011 852258980 852415323 852349639 852188826 852179348 852172554 852189541 852380633 852497458 852475464 852462173
1931.5 852462173 852379084 852253914 852225602 852102458 851758838 851540685 851541519 851514459 851481855 851434469 851252675
1953.9 851252675 851059735 850921631 850710452 850486279 850318909 850084364 849904120 849904418 849801898 849534392
1974.3H49534392j69873r3102j52827j05857p9930k01285k34485k08497k28047j25706
1994.7H47934783k7001j38164k21968j57594j94252k76744j91868j60992k43485k31862
2015.1H46090853k03550k15232j63019j41978k39968k20776j29998j99079k37584j64092
2035.5H44175577j95682k45213j47581j14441j78159j50323j44064j99378j18374o1453
2055.9H42620909j64091j63913r1612j46568j45853l2365n4419q1122k861m9472j32501
2078.3H41556132p3016m1723p2003l0577l0458q6367n0485J967l8326k9802L5167k39
2102.8H41140270l4511J1623L58m0710r895J729J1980P0692P2300L6418N8532Q8155
2127.3H41406941P3076O0200P7367Q8811P3850P6354P4267O9380J30773J67489J22964
$$ plain form
1974.3 849534392 849364519 849271417 849118590 849012733 848932803 848731518 848497033 848288536 848060489 847934783
1994.7 847934783 847907782 847769618 847547650 847390056 847195804 846919060 846727192 846566200 846322715 846090853
2015.1 846090853 845887303 845672071 845509052 845367074 845127106 844906330 844776332 844577253 844339669 844175577
2035.5 844175577 843979895 843734682 843587101 843472660 843294501 843144178 843000114 842800736 842682362 842620909
2055.9 842620909 842456818 842292905 842201293 842054725 841908872 841876507 841822088 841740966 841738105 841688633 841556132
2078.3 841556132 841483116 841441393 841369390 841338813 841308355 841221988 841171503 841173470 841135144 841105342 841140509 841140270
2102.8 841140270 841105759 841117382 841117740 841077030 841067135 841068864 841080844 841151536 841223836 841260254 841318786 841406941
2127.3 841406941 841480017 841540217 841617584 841706395 841780245 841856599 841930866 842000246 842131019 842298508 842421472
2149.7H42421472J11044J08003O6757R8110J60873J32620J01149J26362J05560Q6307
2170.1H43518257J60277J84596J26004J27196J27435O9022Q7380J35363J03533Q8572
2190.5H44727635J13368R7156O6876N1201J7464K921L9517N1499K9862O6101J12355
2212.9H45375955P5817L3975M2736L2843L099M232K861J0371L6776N37l6180J0669
2237.4H45593691L0219k2173k1815k682o5029p9274l636Q166j9491k503j1504m4703
2261.9H45359266k6226J5199J9014J2100J1503L875M8279R9004Q4400R3639J13070
2284.3H45833123M5001J4663P8022O9023J2338M0114Q3387N8353P0452J12593O6340
2306.7H46483409K0624K9087q524n722O7771J0430o0617k385j609m17R1970M7743n9605
$$ plain form
2149.7 842421472 842532516 842640519 842707276 842805386 842966259 843098879 843200028 843326390 843431950 843518257
2170.1 843518257 843678534 843863130 843989134 844116330 844243765 844312787 844400167 844535530 844639063 844727635
2190.5 844727635 844841003 844938159 845005035 845056236 845073700 845076621 845116138 845167637 845197499 845263600 845375955
2212.9 845375955 845451772 845485747 845528483 845561326 845564425 845568657 845571518 845581889 845618665 845619202 845583022 845593691
2237.4 845593691 845623910 845601737 845579922 845577240 845512211 845432937 845429301 845437467 845417976 845415473 845403969 845359266
2261.9 845359266 845333040 845348239 845367253 845379353 845390856 845394731 845443010 845542014 845626414 845720053 845833123
2284.3 845833123 845878124 845892787 845970809 846039832 846052170 846092284 846175671 846234024 846304476 846417069 846483409
2306.7 846483409 846504033 846533120 846524596 846518874 846586645 846597075 846536458 846534073 846532464 846532047 846624017 846671760 846612155
2333.3H46612155J5319J19j63436p8082J95324L72708N01216M38869P9036l21150l57330
2355.7H47294748j39117K324O0797J20461K69771M49180M57168L68833L71158M05193
2376.1H49660516L58403L27408L25739K57611K00034J88350J03116L1233P2599P4267
2396.5H51599276L8683O7950N5134q583J3709M4584j0252n36N3644m470m9055J133
2421H51801217L993l1710j7345k8371p6711p3970q2016r7215k1338M887r2685j04487
2445.4H51184249m5240r4593j18136k7776j6868p4208o3896o3240q6487o7353r3043
2467.9H50433409j38938r0659p7665j45495j26958r4115j31786r5844m1247j14024
2488.3H49376678j54078q5771j14560j79410j17361q0765r8466n2989o2466j33216
$$ plain form
2333.3 846612155 846627474 846627593 846464157 846386075 846581399 846954107 847455323 847894192 847973228 847652078 847294748
2355.7 847294748 847155631 847157955 847218752 847339213 847608984 848058164 848515332 848884165 849255323 849660516
2376.1 849660516 850018919 850346327 850672066 850929677 851129711 851318061 851421177 851452410 851525009 851599276
2396.5 851599276 851637959 851705909 851761043 851752460 851766169 851810753 851800501 851799965 851853609 851849139 851800084 851801217
2421 851801217 851805210 851773500 851756155 851727784 851651073 851577103 851495087 851397872 851376534 851381421 851288736 851184249
2445.4 851184249 851139009 851044416 850926280 850898504 850881636 850807428 850743532 850680292 850593805 850526452 850433409
2467.9 850433409 850294471 850203812 850126147 849980652 849853694 849759579 849627793 849531949 849490702 849376678
2488.3 849376678 849222600 849136829 849022269 848842859 848725498 848644733 848546267 848493278 848430812 848297596
2508.7H48297596q9824m3333j21712j59145j11997j24037j34707o5148p0691j28746
2529H47248256r9361q8930j23322r4771q0824j39535j35779r0659j34706j63853j07408
2551.5H45989108p6175p9393q4102j35422j90258j59383j23322j38223j33395j67966
2571.9H44701469k53737k43068j87456k21968k40266k04027k52485k88964k23696k42472
2592.3H42343330l15666l11076l28243l55721l08871l08991l80694l61860l19123l57807
2612.7H38995278l65079l48687m10437m34399l52502l59058m39644l86775l32415m04715
2633.1H35161567m15623l92378m44174m08649l14236l21746l43978l58164m28379m22835
2653.5H31311405l54529l80099l95000l23236l11493l40462l09110l30567l78013l38852
$$ plain form
2508.7 848297596 848207772 848164439 848042727 847883582 847771585 847647548 847512841 847447693 847377002 847248256
2529 847248256 847148895 847059965 846936643 846841872 846761048 846621513 846485734 846395075 846260369 846096516 845989108
2551.5 845989108 845912933 845833540 845749438 845614016 845423758 845264375 845141053 845002830 844869435 844701469
2571.9 844701469 844447732 844204664 844017208 843795240 843554974 843350947 843098462 842809498 842585802 842343330
2592.3 842343330 842027664 841716588 841388345 841032624 840723753 840414762 840034068 839672208 839353085 838995278
2612.7 838995278 838630199 838281512 837871075 837436676 837084174 836725116 836285472 835898697 835566282 835161567
2633.1 835161567 834745944 834353566 833909392 833500743 833186507 832864761 832520783 832162619 831734240 831311405
2653.5 831311405 830956876 830576777 830181777 829858541 829547048 829206586 828897476 828566909 828188896 827850044
2673.9H27850044l33190l70443l45826l55840m40299m39346l91543m20332m18067l73125
2694.3H23962033m10080m35293l95179m31120m98295m71651m24088m21881m27365m87924
2714.6H19559157n69761n13852m12583m11689m13716m50254o05344o26445m33385l44217
2735H14777911m24564m83096n05447m87864l94881l77297m67897n09500n40614n72682
2755.4H10014069m99606m69029n49614n63324n49316n88179n74648n23985n47051o24001
2775.8H04525316o72341p01546p28250o85811o12974o10948o84857p99120q69393q17954
2796.2G97342122p79927q95918r77456r09686q79884r18150r48131j015186j078427
2814.6G88939357j085341j114071j158595j151204j170873j244188j255512j296341
$$ plain form
2673.9 827850044 827516854 827146411 826800585 826444745 826004446 825565100 825173557 824753225 824335158 823962033
2694.3 823962033 823551953 823116660 822721481 822290361 821792066 821320415 820896327 820474446 820047081 819559157
2714.6 819559157 818989396 818475544 818062961 817651272 817237556 816787302 816181958 815555513 815122128 814777911
2735 814777911 814353347 813870251 813364804 812876940 812482059 812104762 811636865 811127365 810586751 810014069
2755.4 810014069 809514463 809045434 808495820 807932496 807383180 806795001 806220353 805696368 805149317 804525316
2775.8 804525316 803852975 803151429 802423179 801737368 801124394 800513446 799828589 799029469 798160076 797342122
2796.2 797342122 796562195 795666277 794688821 793779135 792899251 791981101 791032970 790017784 788939357
2814.6 788939357 787854016 786739945 785581350 784430146 783259273 782015085 780759573 779463232
2830.9G79463232j461864j592278j704753k026319k521694k981067l342926l552497
2847.2G60279834l408491k797246j943767j238287q41915p43688r47594j313806j663446
2865.6G45381594j955033k104640k008676j807213j679957j531899j352668j280784
2881.9G31660724j309276j365781j405597j454114j507163j525581j599491j731157
2898.2G19762564j748026j695037j763999j954734k190352k451956k733171l003180
2914.5G02222109l132343k963126k514482j900315j265049o83010j78158J11640L58939
2932.9F90056205Q14318J269699J609146J945138K162934K056777J620650J094103
2949.2G02628970P65979N46813K96653K15173L53038M72069M54545M56035N33402N57124
$$ plain form
2830.9 779463232 778001368 776409090 774704337 772678018 770156324 767175257 763832331 760279834
2847.2 760279834 756871343 754074097 752130330 750892043 750050128 749306440 748358846 747045040 745381594
2865.6 745381594 743426561 741321921 739313245 737506032 735826075 734294176 732941508 731660724
2881.9 731660724 730351448 728985667 727580070 726125956 724618793 723093212 721493721 719762564
2898.2 719762564 718014538 716319501 714555502 712600768 710410416 707958460 705225289 702222109
2914.5 702222109 699089766 696126640 693612158 691711843 690446794 689763784 689585626 689697266 690056205
2932.9 690056205 690870523 692140222 693749368 695694506 697857440 699914217 701534867 702628970
2949.2 702628970 703394949 703941762 704238415 704453588 704806626 705278695 705733240 706189275 706722677 707279801
2969.6G07279801N80848O51538O38127O28114O93619O08147M58836M71830N08607N20050
2990G13039517M76003J95623j15574l08215n10872o41286o98209p23064o49035n63741
3010.4G09501147o30855q41618j045108j161098j234651j283645j320422j401186j415491
3028.7F99167073j322627j265526j358271j525879j519859j447618j564025j764596
3045.1F87398672j841068j720429j622080j744688j864612j872778j856744j734913
3061.4F73141360j602053j597047j675904j784980j802802j664639j473248j432180
3077.7F60108507j617372j765311j747668j762807j806438j835823j946926k003313
3094F45622849j892149j781046j854420k017558k006292j855195j848876k045930k105116
$$ plain form
2969.6 707279801 707860649 708512187 709150314 709778428 710472047 711080194 711539030 712010860 712519467 713039517
2990 713039517 713515520 713711143 713595569 713287354 712776482 712135196 711436987 710713923 710064888 709501147
3010.4 709501147 708870292 708028674 706983566 705822468 704587817 703304172 701983750 700582564 699167073
3028.7 699167073 697844446 696578920 695220649 693694770 692174911 690727293 689163268 687398672
3045.1 687398672 685557604 683837175 682215095 680470407 678605795 676733017 674876273 673141360
3061.4 673141360 671539307 669942260 668266356 666481376 664678574 663013935 661540687 660108507
3077.7 660108507 658491135 656725824 654978156 653215349 651408911 649573088 647626162 645622849
3094 645622849 643730700 641949654 640095234 638077676 636071384 634216189 632367313 630321383 628216267
3112.4F28216267j944662j926124k086639k333939k586365k567351k340436k227842
3128.7F10202909k341211k488554k426922k251625k265930k560199k785384k706707
3145E90376377k555489k469004k417624k528786k796173k930820k883494k813936k766609
3163.4E66214442k754032k783001k809346k830028k855718k855957k852916k841414
3179.7E43632030k837181k877056k883852k842009k842188k854824k849638k870202
3196E20775080k853394k803504k778709k758742k745509k781987k791762k700359k626508
3214.3D95934606k611101k615869k617747k593606k588034k601355k539993k383232
3230.7D75383669k272069k357185k470434k395779k260893k142609k024173j995474
$$ plain form
3112.4 628216267 626271605 624345481 622258842 619924903 617338538 614771187 612430751 610202909
3128.7 610202909 607861698 605373144 602946222 600694597 598428667 595868468 593083084 590376377
3145 590376377 587820888 585351884 582934260 580405474 577609301 574678481 571794987 568981051 566214442
3163.4 566214442 563460410 560677409 557868063 555038035 552182317 549326360 546473444 543632030
3179.7 543632030 540794849 537917793 535033941 532191932 529349744 526494920 523645282 520775080
3196 520775080 517921686 515118182 512339473 509580731 506835222 504053235 501261473 498561114 495934606
3214.3 495934606 493323505 490707636 488089889 485496283 482908249 480306894 477766901 475383669
3230.7 475383669 473111600 470754415 468283981 465888202 463627309 461484700 459460527 457465053
3247D57465053k052248k051026j973569j929820j959294k002567j990646j928597j863599
3265.3D39713687j789928j704931j788586j998157k061337j973599j864761j842261
3281.6D24690127j881003j883239j868307j823664j788080j875519k012551k093077
3298D09464687k089053j959741j782418j803487k063662k284914k330214k245665k145469
3316.3C90760064k127856k128422k069473k035350k176255k312511k228379k135635
3332.6C73546183k098143k010286k042234k177596k228975k273202k243340k070695
3348.9C56401712k076418k303183k408832k248943k012342j997530k075136j905769
3365.3C39373559j738817j882553k141952k164573j896798j674682j593471j534551
$$ plain form
3247 457465053 455412805 453361779 451388210 449458390 447499096 445496529 443505883 441577286 439713687
3265.3 439713687 437923759 436218828 434430242 432432085 430370748 428397149 426532388 424690127
3281.6 424690127 422809124 420925885 419057578 417233914 415445834 413570315 411557764 409464687
3298 409464687 407375634 405415893 403633475 401829988 399766326 397481412 395151198 392905533 390760064
3316.3 390760064 388632208 386503786 384434313 382398963 380222708 377910197 375681818 373546183
3332.6 373546183 371448040 369437754 367395520 365217924 362988949 360715747 358472407 356401712
3348.9 356401712 354325294 352022111 349613279 347364336 345351994 343354464 341279328 339373559
3365.3 339373559 337634742 335752189 333610237 331445664 329548866 327874184 326280713 324746162
3381.6C24746162j445473j266866r55493o26623o55294r94056j012296n53667k41906
3399.9C16994488n42402r30756p04408k44528p7278r9629j94788k29418l3587J99377
3420.3C14137071K95520M36902O98030R31829R13799R09686J120597J051397O87658
3438.7C21182489O83189J102090J448095J564443J581788J665890J782298J886517
3455C32896799K039105K170115K096415K076655K437741K703249K364547J790881J765221
3473.4C52340728K187997K561331K622336K340376K268643K550661K573192K427847
3489.7C71873111K591937K820999K888202K776474K683401K730787K674192K560914
3506C93600017K669066K964526L235281L186196K920330K925992L178268L421158L325522
$$ plain form
3381.6 324746162 323300689 322033823 321078330 320451707 319796413 318802357 317790061 317236394 316994488
3399.9 316994488 316452086 315521330 314816922 314572394 314495116 314395487 314200699 313971281 313937694 314137071
3420.3 314137071 314432591 314869493 315567523 316499352 317413151 318322837 319443434 320494831 321182489
3438.7 321182489 321865678 322967768 324415863 325980306 327562094 329227984 331010282 332896799
3455 332896799 334935904 337106019 339202434 341279089 343716830 346420079 348784626 350575507 352340728
3473.4 352340728 354528725 357090056 359712392 362052768 364321411 366872072 369445264 371873111
3489.7 371873111 374465048 377286047 380174249 382950723 385634124 388364911 391039103 393600017
3506 393600017 396269083 399233609 402468890 405655086 408575416 411501408 414679676 418100834 421426356
3524.4D21426356L055602L118575L415644L656179L810405L781319L620237L779709
3540.7D49664026M046530L987908L717721L703087L902644M030586M149347M309982
3557D81511831M436553M404634M155755L915787M467934N345166N317450M966318M971087
3575.3E23492515N222201N463303N565941N459368N200982N122185N613744N818069
3591.7E66958308N639076N751789O083608O171524O106794N945385N575776N542814
3608F13775074N863250N952000N975068N917728N869210O309747O314815N619406M942298
3626.3F66538596M988372N981327O100714N703807N430400N124867M862428M614234
3642.6G09344745M117131L463268L704012M922509M950702M205585M087746M222929
$$ plain form
3524.4 421426356 424481958 427600533 431016177 434672356 438482761 442264080 445884317 449664026
3540.7 449664026 453710556 457698464 461416185 465119272 469021916 473052502 477201849 481511831
3557 481511831 485948384 490353018 494508773 498424560 502892494 508237660 513555110 518521428 523492515
3575.3 523492515 528714716 534178019 539743960 545203328 550404310 555526495 561140239 566958308
3591.7 566958308 572597384 578349173 584432781 590604305 596711099 602656484 608232260 613775074
3608 613775074 619638324 625590324 631565392 637483120 643352330 649662077 655976892 661596298 666538596
3626.3 666538596 671526968 677508295 683609009 689312816 694743216 699868083 704730511 709344745
3642.6 709344745 713461876 716925144 720629156 725551665 730502367 734707952 738795698 743018627
3659G43018627L715933L059566K698063K221525J704753K029478K234578J785100K358913
3677.3G64826536L040850K811909K367854J924038J480699J276850J815439K297461
3693.6G81841636K061605J545847J123130R81331J249850J261890O39081P3611N44250
3712G91322231J604259J609803R44018M60207L21031M72963P32124Q57114M62950k03550
3732.4G98583150k36571P06554J415252J076818J8358o17504L06129N03242p629Q75831
3752.8H02623630J512825R36985M11868N79477O85989L71993J97053J43588L72648
3771.1H07836056P60913O04510K18332K1398J80662L25918K72095L70264M55618K98262
3791.5H11344028m6492l67046l20076l36290l14057N38886O49989L64959P14123N51581
$$ plain form
3659 743018627 746734560 749794126 752492189 754713714 756418467 758447945 760682523 762467623 764826536
3677.3 764826536 767867386 770679295 773047149 774971187 776451886 777728736 779544175 781841636
3693.6 781841636 783903241 785449088 786572218 787553549 788803399 790065289 790704370 790777981 791322231
3712 791322231 792926490 794536293 795480311 795940518 796261549 796734512 797466636 798323750 798786700 798583150
3732.4 798583150 798346579 799053133 800468385 801545203 801563561 800946057 801252186 801755428 801747799 802623630
3752.8 802623630 804136455 805073440 805485308 806064785 806750774 807122767 807319820 807463408 807836056
3771.1 807836056 808596969 809201479 809419811 809441209 809621871 809947789 810219884 810590148 811045766 811344028
3791.5 811344028 811297536 810930490 810610414 810274124 809960067 810498953 811148942 811513901 812228024 812779605
3811.9H12779605k51591p48932l11911j55986Q4162P98822O53088K95698L9697k55883
3832.3H12926769k05815k95639n04553J05321P53344Q56876O18517L2664q97050j764715
3852.7H11625719l59356J528322J187742J41919n17309l19600J14977r6380j46509
3871.1H13159525L44813N91755M58062j54793l32773J26243J04129J60813J55986j33276
3891.5H14480484J02579K41518k49565n91576l68774K5332N10931P65145M94182Q3268
3911.9H15493524j51813k37822q3983J60515P0631j75297q3268R6202m7683m5062K61009
3934.3H15256953K73824L9577j12175j23322J7344N5254j7524N3406J45137J59204
3954.7H15747678J02639N7161R1136J09970O7532M0830O5148L3199N4419J74165J51754
$$ plain form
3811.9 812779605 812528014 811779082 811467171 811311185 811395347 812194169 812847257 813142955 813182652 812926769
3832.3 812926769 812720954 812425315 811920762 812026083 812779427 813636303 814254820 814287484 813390434 811625719
3852.7 811625719 811266363 812794685 813982427 814124346 813607037 813287437 813402414 813306034 813159525
3871.1 813159525 813504338 814096093 814554155 814399362 814066589 814192832 814296961 814457774 814613760 814480484
3891.5 814480484 814583063 814824581 814575016 813983440 813614666 813639998 814150929 814916074 815410256 815493524
3911.9 815493524 815341711 815103889 815019906 815180421 815251052 815075755 814992487 815088689 815041006 814995944 815256953
3934.3 815256953 815530777 815570354 815458179 815334857 815352201 815407455 815389931 815443337 815588474 815747678
3954.7 815747678 815850317 815907478 815998614 816108584 816176116 816216946 816282094 816315293 816369712 816543877 816695631
3977.1H16695631R775J9252J85668J75596o318l1233Q3148J01805N2929P2360
3997.5H17358613
$$ plain form
3977.1 816695631 816705406 816724658 816910326 817085922 817079604 817048371 817131519 817233324 817286253 817358613
3997.5 817358613
##END=$$ End of the data block
