##TITLE=$$ Begin of the data block
##JCAMP-DX=5.00 $$ ACD/SpecManager v 10.08
##SPECTROMETER/DATA SYSTEM=Alpha
##DATE=10 Apr 2014 11:00:52
##DATA TYPE=INFRARED SPECTRUM
##DATA CLASS=XYDATA
##ORIGIN=
##OWNER=
##NPOINTS=1765
##FIRSTX=399.75695801
##LASTX=3997.56933594
##MAXX=3997.56933594
##MINX=399.75695801
##MAXY=0.85254872
##MINY=0.31420821
##XFACTOR=1.0000000000
##YFACTOR=1.000000000000000e-9
##FIRSTY=0.62565863
##DELTAX=2.03957629
##XUNITS=1/CM
##YUNITS=ARBITRARY UNITS
##XYDATA=(X++(Y..Y))
$$ plain form
399.8 625658631 626025438 625136375 623517394 622704148 621963322 621319652 621308565 620577633 619242489 619488478
420.2 619488478 619695485 618929267 618704736 618449152 617732942 617471278 616845608 615638852 615486860 615679264
440.5 615679264 615124047 614952266 614821792 614300191 614564061 614873230 614197314 613519371 613003314 612172961
460.9 612172961 611776650 611475825 610499859 609842122 609409869 608333588 607798159 607766032 607078731 606462538
481.3 606462538 606300592 605738163 605356872 605312645 604398310 603359461 603081584 602403402 601453304 601073563
501.7 601073563 600305676 599183738 598747849 598137140 597037852 596321464 595282376 593742251 593022108
520.1 593022108 592394710 590903223 589690208 588823378 587433994 586317897 585547030 584411561 583800197
538.4 583800197 583759546 583182812 582558095 582148969 581079483 579939008 579316497 578239858 577069521
$$ packed form
399.8F25658631L66807q89063j618981q13246p40826o43670j1087p30932j335144K45989
420.2F19488478K07007p66218k24531k55584p16210k61664o25670j206756j51992J92404
440.5F15679264n55217j71781j30474n21601K63870L09169o75916o77943n16057q30353
460.9F12172961l96311l00825r75966o57737m32253j076281n35429l2127o87301o16193
481.3F06462538j61946n62429l81291m4227r14335j038849k77877o78182r50098l79741
501.7F01073563p67887j121938m35889o10709j099288p16388j039088j540125p20143
520.1E93022108o27398j491487j213015q66830j389384j116097p70867j135469o11364
538.4E83800197m0651n76734o24717m09126j069486j140475o22511j076639j170337
$$ plain form
556.8 577069521 576592743 575559855 573698103 572145700 570345879 567952037 566090465 564385951 562218547
575.2 562218547 560461402 558800220 556641459 555105329 554021657 552282453 550579607 549275458
591.5 549275458 547679901 546324968 545358419 543708146 541710198 540108621 538644075 537850320 538128853
609.8 538128853 538261890 538020313 538616478 540389955 543230891 547110260 551056623 554533541 558317602
628.2 558317602 562033474 564961433 567853093 570805430 572921216 574468613 575712383 576478183 578084767
646.5 578084767 580953360 582859695 582909226 582674623 583750784 587340176 592922390 597828865 600740373
664.9 600740373 603278458 606679797 609445572 612245977 615357041 617852688 620388627 623231173
681.2 623231173 625339627 627233624 629449010 631041706 632310808 633912921 634909630 635371625 636451662
$$ packed form
556.8E77069521m76778j032888j861752j552403j799821k393842j861572j704514k167404
575.2E62218547j757145j661182k158761j536130j083672j739204j702846j304149
591.5E49275458j595557j354933r66549j650273j997948j601577j464546p93755K78533
609.8E38128853J33037k41577N96165J773477K840936L879369L946363L476918L784061
628.2E58317602L715872K927959K891660K952337K115786J547397J243770P65800J606584
646.5E78084767K868593J906335M9531k34603J076161L589392N582214M906475K911508
664.9F00740373K538085L401339K765775K800405L111064K495647K535939K842546
681.2F23231173K108454J893997K215386J592696J269102J602113R96709M61995J080037
$$ plain form
699.6 636451662 637571454 638448536 640025377 641756356 643093586 645029366 647328317 649100482 651115477
717.9 651115477 653493047 655389249 657462537 659981728 661837339 663429141 665458620 667024374
734.2 667024374 668314099 670146585 671660006 672722518 674374461 675970972 677121937 678825438
750.6 678825438 680606604 681762397 683197260 684897900 686082363 687445521 689072192 690030456 690938890
768.9 690938890 692185640 692681015 692686498 692874253 692337513 691117823 690271258 689473867 688746750 689202547
789.3 689202547 690525293 692288339 695431292 699714839 704176486 709209442 714532137 718952954
805.6 718952954 722840011 726540506 729218960 731182337 733023167 733859599 733563483 732756257 730794251
824 730794251 727649808 724326193 720554471 716166854 712275743 708934307 705498815 702446759 699865818
$$ packed form
699.6F36451662J119792Q77082J576841J730979J337230J935780K298951J772165K014995
717.9F51115477K377570J896202K073288K519191J855611J591802K029479J565754
734.2F67024374J289725J832486J513421J062512J651943J596511J150965J703501
750.6F78825438J781166J155793J434863J700640J184463J363158J626671R58264R08434
768.9F90938890J246750M95375N483J87755n36740j219690q46565p97391p27117M55797
789.3F89202547J322746J763046L142953M283547M461647N032956N322695M420817
805.6G18952954L887057L700495K678454J963377J840830Q36432k96116q07226j962006
824G30794251l144443l323615l771722m387617l891111l341436l435492l052056k580941
$$ plain form
842.3 699865818 697239995 695406556 695145130 696020305 698450506 703019857 708931446 715823054 723790109
860.7 723790109 731828809 739406586 746906042 753589869 758760452 763134599 766716897 768934786
877 768934786 770394146 771135628 770419776 768942237 767274737 764797151 762084663 760123968 758590579
895.4 758590579 757788956 758470953 759829998 761285424 763232350 764867187 765348852 765201330 764173567
913.7 764173567 761665642 758501709 755098939 751278639 748119950 746346056 745351732 745218694 746014416
932.1 746014416 746673286 747058153 747694731 747993350 747819483 747838259 747545123 746379137 744763255 742322505
952.5 742322505 738463879 733676016 727915525 720635116 712249696 702885687 692017376 680202246
968.8 680202246 668337107 656618118 645792782 636680782 628855050 621923327 616005421 610607088
$$ packed form
842.3F99865818k625823j833439k61426Q75175K430201M569351N911589O891608P967055
860.7G23790109Q038700P577777P499456O683827N170583M374147L582298K217889
877G68934786J459360P41482p15852j477539j667500k477586k712488j960695j533389
895.4G58590579q01623O81997J359045J455426J946926J634837M81665j47522j027763
913.7G64173567k507925l163933l402770l820300l158689j773894r94324j33038P95722
932.1G46014416O58870L84867O36578K98619j73867J8776k93136j165986j615882k440750
952.5G42322505l858626m787863n760491p280409q385420r364009j0868311j1815130
968.8F80202246j1865139j1718989j0825336r112000p825732o931723n917906n398333
$$ plain form
985.1 610607088 605415821 600815773 596723139 592903376 589690804 587067664 584630251 582530916
1001.4 582530916 580743194 578555822 575722456 572320402 568080664 563288152 558560550 553870738
1017.7 553870738 549343526 545448303 542002320 538694024 535757124 533179224 530755341 528683424
1034.1 528683424 526950657 525295556 523881793 522720993 521427512 520009279 518606067 517090738
1050.4 517090738 515763342 515208304 515460014 516408145 517976701 519502103 520184577 519763350 518043935
1068.7 518043935 514964938 511166990 507280171 503452301 499871492 496575773 493164808 489431530
1085 489431530 485430628 481172085 477067262 473874271 471964091 471327424 471799105 472831309 473854363
1103.4 473854363 474754095 475453287 475647300 475253791 474241346 472190022 468640357 463547736 457873672
$$ packed form
985.1F10607088n191267m600048m092634l819763l212572k623140k437413k099335
1001.4E82530916j787722k187372k833366l402054m239738m792512m727602m689812
1017.7E53870738m527212l895223l445983l308296k936900k577900k423883k071917
1034.1E28683424j732767j655101j413763j160800j293481j418233j403212j515329
1050.4E17090738j327396n55038K51710R48131J568556J525402O82474m21227j719415
1068.7E18043935l078997l797948l886819l827870l580809l295719l410965l733278
1085D89431530m000902m258543m104823l192991j910180o36667M71681J032204J023054
1103.4D73854363Q99732O99192J94013l93509j012445k051324l549665n092621n674064
$$ plain form
1121.8 457873672 453863531 452895522 453900874 455561727 457126915 457908303 458495498 460134447 462906033
1140.1 462906033 466022581 468955874 471490115 473531634 475245059 476869732 478526205 480429918
1156.4 480429918 482897222 486072510 490133375 495391369 501835465 509118021 516948700 524953902
1172.7 524953902 532697141 540080309 547065079 553407669 558999360 563723028 567192972 569237828
1189.1 569237828 570026934 569706798 568680286 567750394 567496061 568196297 570058882 572811306 575792015
1207.4 575792015 578592300 580967247 582681537 583881736 584874749 585694790 586443841 587340117 588355362
1225.8 588355362 589477777 590865254 592475355 594230533 596228242 598341167 600355327 602330685
1242.1 602330685 604195118 605690241 606843770 607740879 608316422 608707786 609133124 609647572 610465109
$$ packed form
1121.8D57873672m010141r68009J005352J660853J565188P81388N87195J638949K771586
1140.1D62906033L116548K933293K534241K041519J713425J624673J656473J903713
1156.4D80429918K467304L175288M060865N257994O444096P282556P830679Q005202
1172.7E24953902P743239P383168O984770O342590N591691M723668L469944K044856
1189.1E69237828P89106l20136j026512r29892k54333P00236J862585K752424K980709
1207.4E75792015K800285K374947J714290J200199R93013Q20041P49051Q96276J015245
1225.8E88355362J122415J387477J610101J755178J997709K112925K014160J975358
1242.1F02330685J864433J495123J153529Q97109N75543L91364M25338N14448Q17537
$$ plain form
1260.4 610465109 611869693 613772869 616100729 618976474 622264862 625825584 629756927 633915961
1276.8 633915961 638097405 642431557 646932960 651456356 656163096 661094189 665879667 670410633
1293.1 670410633 674763858 678760648 682341158 685629845 688562632 691115141 693410873 695368528
1309.4 695368528 696944594 698367476 699663103 700776458 701975465 703345358 704698026 706045806
1325.7 706045806 707347274 708392620 709169924 709718525 709925234 709893107 710068405 710600972 711274862
1344.1 711274862 712016404 712732077 713351965 713910043 714266181 714368701 714335740 713973701 713134885 712323785
1364.5 712323785 711619198 710644484 709631324 708592474 707368731 706343412 705283225 703533947 701330602
1382.8 701330602 699503064 698243022 697406232 696822822 695845246 694319010 692867160 691348851 689626813
$$ packed form
1260.4F10465109J404584J903176K327860K875745L288388L560722L931343M159034
1276.8F33915961M181444M334152M501403M523396M706740M931093M785478M530966
1293.1F70410633M353225L996790L580510L288687K932787K552509K295732J957655
1309.4F95368528J576066J422882J295627J113355J199007J369893J352668J347780
1325.7G06045806J301468J045346P77304N48601K06709l2127J75298N32567O73890
1344.1G11274862P41542P15673O19888N58078L56138J02520l2961l62039q38816q11100
1364.5G12323785p04587r74714j013160j038850j223743j025319j060187j749278k203345
1382.8G01330602j827538j260042q36790n83410r77576j526236j451850j518309j722038
$$ plain form
1401.2 689626813 687638581 685150862 682737768 680665612 678736150 677035689 675569594 673964798
1417.5 673964798 672416449 671790957 671652317 671549439 671457469 671312094 671439230 671847463 672246158 673123538
1437.9 673123538 674584985 676114023 677506685 678840935 680479705 682726443 685227215 687696457
1454.2 687696457 690970898 696458697 702283084 707372606 712648451 718353987 723738015 728988469
1470.5 728988469 735221744 741997957 747885883 752543628 756105602 758888304 760689497 761312246
1486.8 761312246 761058450 760722816 760420859 759212315 756641150 754017532 752105355 750093102 746051848
1505.2 746051848 739054739 734627366 732061028 728917360 725169599 721425593 718389332 715450704
1521.5 715450704 713108897 711481094 709842384 708471417 706792653 704664826 703418553 702261984
$$ packed form
1401.2F89626813j988232k487719k413094k072156j929462j700461j466095j604796
1417.5F73964798j548349o25492j38640j02878r1970j45375J27136M08233L98695Q77380
1437.9F73123538J461447J529038J392662J334250J638770K246738K500772K469242
1454.2F87696457L274441N487799N824387N089522N275845N705536N384028N250454
1470.5G28988469O233275O776213N887926M657745L561974K782702J801193O22749
1486.8G61312246k53796l35634l01957j208544k571165k623618j912177k012253m041254
1505.2G46051848o997109m427373k566338l143668l747761l744006l036261k938628
1521.5G15450704k341807j627803j638710j370967j678764k127827j246273j156569
$$ plain form
1537.8 702261984 699682176 697975457 698345065 699232101 700020432 700548649 701184928 701947093 702347100
1556.2 702347100 701894224 702246308 703498244 703776062 702963769 700857162 697754145 695198178 691775680
1574.5 691775680 685869157 680620193 676235378 670770943 664563417 658100486 651354432 644426525
1590.9 644426525 637466490 630362928 623391747 616707087 609921217 603045344 596435189 589873493
1607.2 589873493 583061755 576519489 570465386 563474059 555286765 549469888 544760287 538929045
1623.5 538929045 533515394 528936625 524963200 522317588 520112276 517630219 517100215 518389225
1639.8 518389225 520078897 521864355 524109304 527547002 531191170 534969091 540813863 546879947
1656.1 546879947 552227437 557633817 563754141 570531070 576638579 582780302 590148687 597345054
$$ packed form
1537.8G02261984k579808j706719L69608Q87036P88331N28217O36279P62165M00007
1556.2G02347100m52876L52084J251936K77818q12293k106607l103017k555967l422498
1574.5F91775680n906523n248964m384815n464435o207526o462931o746054o927907
1590.9F44426525o960035p103562o971181o684660o785870o875873o610155o561696
1607.2E89873493o811738o542266o054103o991327q187294n816877m709601n831242
1623.5E38929045n413651m578769l973425k645612k205312k482057n30004J289010
1639.8E18389225J689672J785458K244949L437698L644168L777921N844772O066084
1656.1E46879947N347490N406380O120324O776929O107509O141723P368385P196367
$$ plain form
1672.4 597345054 604566813 612498164 619820714 626321614 633190930 642527580 651728451 659597158
1688.8 659597158 667560756 674656689 681669116 689477026 697803080 707804501 716525614 723701954
1705.1 723701954 730817854 737104595 742311180 746523917 750138819 754229248 758869290 763005674
1721.4 763005674 766534090 769658208 772345543 774729311 776741982 778910637 781965077 784876943
1737.7 784876943 787507474 790344298 793270886 796026826 798752308 801785111 805139482 808143675
1754 808143675 810633063 812806189 814695716 816585720 818492174 820030093 821113229 821883976 822853625
1772.4 822853625 824544311 826236665 827474296 828570843 829747200 830850303 831890047 832730591
1788.7 832730591 833095193 833601892 834724247 835784674 836483479 837202489 838124990 838994503 839654982
$$ packed form
1672.4E97345054P221759P931351P322550O500900O869316R336650R200871P868707
1688.8F59597158P963598P095933P012427P807910Q326054J0001421Q721113P176340
1705.1G23701954P115900O286741N206585M212737L614902M090429M640042M136384
1721.4G63005674L528416L124118K687335K383768K012671K168655L054440K911866
1737.7G84876943K630531K836824K926588K755940K725482L032803L354371L004193
1754H08143675K489388K173126J889527J890004J906454J537919J083136P70747R69649
1772.4H22853625J690686J692354J237631J096547J176357J103103J039744Q40544
1788.7H32730591L64602N06699J122355J060427O98805P19010R22501Q69513O60479
$$ plain form
1807 839654982 840084791 840520144 841211259 841921806 842399716 842816651 843215823 843429387 843586624 843806684
1827.4 843806684 844017386 844591916 845428288 845955849 846257269 846587777 846702337 846516609 846778035 847492337
1847.8 847492337 848048866 848460853 848838151 849085093 849240601 849476099 849701166 849769175 849630296 849405468
1868.2 849405468 849625945 850304723 850811839 850974441 851108313 851252079 851298273 851410508 851545095 851473749
1888.6 851473749 851506650 851775050 851887584 851939380 852142394 852287829 852314234 852371216 852354348 852252483
1909 852252483 852339268 852512956 852455020 852278471 852245748 852228403 852246344 852438092 852548718 852519989 852504611
1931.5 852504611 852427244 852307618 852282643 852160037 851810336 851598024 851612449 851573944 851514220 851460934 851290107
1953.9 851290107 851101875 850961089 850745440 850539267 850410044 850189149 849981546 849938273 849831820 849609256
$$ packed form
1807H39654982M29809M35353O91115P10547M77910M16935L99172K13564J57237K20060
1827.4H43806684K10702N74530Q36372N27561L01420L30508J14560j85728K61426P14302
1847.8H47492337N56529M11987L77298K46942J55508K35498K25067O8009j38879k24828
1868.2H49405468K20477O78778N07116J62602J33872J43766M6194J12235J34587p1346
1888.6H51473749L2901K68400J12534N1796K03014J45435K6405N6982j6868j01865
1909H52252483Q6785J73688n7936j76549l2723j7345J7941J91748J10626k8729j5378
1931.5H52504611p7367j19626k4975j22606l49701k12312J4425l8505n9724n3286j70827
1953.9H51290107j88232j40786k15649k06173j29223k20895k07603m3273j06453k22564
$$ plain form
1974.3 849609256 849463701 849350214 849166155 849040449 848968029 848790348 848567426 848347008 848101318 847981811
1994.7 847981811 847957134 847792208 847561777 847432613 847269475 847016275 846829116 846644580 846376240 846136034
2015.1 846136034 845921814 845682621 845501959 845354438 845122933 844920576 844800770 844600260 844367504 844219208
2035.5 844219208 844021976 843766212 843617141 843497872 843315840 843163788 843024671 842841566 842720568 842634439
2055.9 842634439 842466712 842318177 842226446 842074752 841943562 841930270 841880858 841792285 841772318 841712594 841598272
2078.3 841598272 841554701 841509759 841398776 841335714 841310084 841247976 841207802 841198444 841157377 841146052 841170490
2100.7 841170490 841133356 841089368 841097593 841083527 841067433 841107965 841128767 841126442 841170251 841223955 841256380 841318965
2125.2 841318965 841395497 841438174 841499507 841601849 841683328 841744423 841849625 841957152 842017293 842111707 842255235
$$ packed form
1974.3H49609256j45555j13487j84059j25706p2420j77681k22922k20418k45690j19507
1994.7H47981811k4677j64926k30431j29164j63138k53200j87159j84536k68340k40206
2015.1H46136034k14220k39193j80662j47521k31505k02357j19806k00510k32756j48296
2035.5H44219208j97232k55764j49071j19269j82032j52052j39117j83105j20998q6129
2055.9H42634439j67727j48535r1731j51694j31190j3292m9412q8573j9967n9724j14322
2078.3H41598272m3571m4942j10983o3062k5630o2108m0174r358m1067j1325K4438
2100.7H41170490l7134m3988Q225j4066j6094M0532K0802k325M3809N3704L2425O2585
2125.2H41318965P6532M2677O1333J02342Q1479O1095J05202J07527O0141R4414J43528
$$ plain form
2147.7 842255235 842385232 842542231 842703342 842772484 842835844 842988610 843148589 843266487 843383670 843483627
2168 843483627 843592048 843769193 843927681 844022632 844140112 844267726 844349563 844453931 844598711 844704211
2188.4 844704211 844774008 844846964 844918132 844993651 845068276 845095038 845090926 845134377 845208466 845251799 845316768 845419228
2212.9 845419228 845465899 845464826 845489383 845546246 845609546 845648766 845649242 845653713 845669389 845638335 845593750 845615327
2237.4 845615327 845668375 845658481 845620334 845611870 845561683 845489264 845475078 845455408 845422447 845441639 845449567 845400572
2261.9 845400572 845378697 845414281 845448792 845475435 845488906 845484018 845525682 845603645 845674694 845787048 845915556
2284.3 845915556 845959723 845981240 846055388 846104264 846113205 846155703 846226871 846269906 846349001 846494734 846589565
2306.7 846589565 846616566 846627712 846616387 846649528 846763730 846813500 846754253 846686959 846594334 846496165 846521437
$$ packed form
2147.7H42255235J29997J56999J61111O9142O3360J52766J59979J17898J17183R9957
2168H43483627J08421J77145J58488R4951J17480J27614Q1837J04368J44780J05500
2188.4H44704211O9797P2956P1168P5519P4625K6762m112M3451P4089M3333O4969J02460
2212.9H45419228M6671j073K4557N6863O3300L9220M76M471J5676l1054m4585K1577
2237.4H45615327N3048r894l8147q464n0187p2419j4186j9670l2961J9192P928m8995
2261.9H45400572k1875L5584L4511K6643J3471m888M1664P7963P1049J12354J28508
2284.3H45915556M4167K1517P4148M8876Q941M2498P1168M3035P9095J45733R4831
2306.7H46589565K7001J1146j1325L3141J14202M9770n9247o7294r2625r8169K5272
$$ plain form
2329.2 846521437 846612096 846666813 846696317 846639216 846483231 846407712 846561074 846919298 847452760 847931445
2349.6 847931445 848014355 847646832 847274303 847131133 847046852 847086191 847269893 847581804 848049641 848527312
2370 848527312 848949134 849392235 849813640 850136220 850445569 850774944 851044714 851242840 851395845 851477325
2390.4 851477325 851527393 851608992 851664722 851686835 851740956 851794004 851813495 851863742 851927400 851922631 851913691 851938069
2414.8 851938069 851897538 851824820 851830661 851860940 851849735 851830721 851773381 851674259 851635158 851611674 851528466 851486087
2439.3 851486087 851484716 851408422 851311028 851247668 851126730 850987434 850927591 850877941 850808799 850771129 850707710
2461.7 850707710 850604236 850544870 850469291 850322843 850227952 850176632 850058854 849940240 849845588 849711418
2482.1 849711418 849608719 849551082 849418759 849251866 849173546 849106610 848979294 848882854 848802269 848671675
$$ packed form
2329.2H46521437R0659N4717K9504n7101j55985p5519J53362L58224N33462M78685
2349.6H47931445Q2910l67523l72529j43170q4281L9339J83702L11911M67837M77671
2370H48527312M21822M43101M21405L22580L09349L29375K69770J98126J53005Q1480
2390.4H51477325N0068Q1599N5730K2113N4121N3048J9491N0247O3658m769q940K4378
2414.8H51938069m0531p2718N841L0279j1205j9014n7340r9122l9101k3484q3208m2379
2439.3H51486087j371p6294r7394o3360j20938j39296n9843m9650o9142l7670o3419
2461.7H50707710j03474n9366p5579j46448r4891n1320j17778j18614r4652j34170
2482.1H49711418j02699n7637j32323j66893p8320o6936j27316r6440q0585j30594
$$ plain form
2502.5 848671675 848565578 848487854 848362327 848264873 848210573 848076344 847914100 847813904 847705066 847592413
2522.9 847592413 847532749 847441673 847281575 847148240 847050130 846946359 846874654 846810460 846681595 846545756
2543.3 846545756 846452475 846318603 846152723 846046209 845971465 845897198 845813572 845661640 845470488 845322371
2563.7 845322371 845189631 845028818 844883919 844724238 844480097 844240665 844050884 843817770 843572676 843386233
2584.1 843386233 843160808 842871726 842625260 842363954 842036664 841734052 841425300 841081381 840798914 840519190
2604.5 840519190 840138495 839775681 839447618 839043200 838646173 838310421 837917507 837486267 837122381 836732805
2624.9 836732805 836277425 835900307 835561514 835150421 834770262 834439754 834061861 833689094 833332956 832929254
2645.3 832929254 832530379 832151771 831722498 831318617 830995560 830629826 830240667 829943240 829654217 829308033
$$ packed form
2502.5H48671675j06097p7724j25527r7454n4300j34229j62244j00196j08838j12653
2522.9H47592413n9664r1076j60098j33335r8110j03771p1705o4194j28865j35839
2543.3H46545756r3281j33872j65880j06514p4744p4267q3626j51932j91152j48117
2563.7H45322371j32740j60813j44899j59681k44141k39432j89781k33114k45094j86443
2584.1H43386233k25425k89082k46466k61306l27290l02612l08752l43919k82467k79724
2604.5H40519190l80695l62814l28063m04418l97027l35752l92914m31240l63886l89576
2624.9H36732805m55380l77118l38793m11093l80159l30508l77893l72767l56138m03702
2645.3H32929254l98875l78608m29273m03881l23057l65734l89159k97427k89023l46184
$$ plain form
2665.7 829308033 828987658 828667283 828313768 827974141 827601612 827196538 826836228 826475084 826037407 825604558
2686.1 825604558 825212240 824779332 824360192 824004352 823612988 823177636 822753549 822292805 821803570 821378291
2706.5 821378291 820975661 820523024 820071399 819585502 819015622 818491518 818031490 817561626 817171037 816804409
2726.9 816804409 816253304 815632820 815162182 814762950 814331889 813901186 813440919 812945247 812526464 812166750
2747.3 812166750 811708570 811164558 810626447 810092747 809602320 809113503 808532417 807956338 807440579 806884408
2767.7 806884408 806281328 805731356 805207312 804609179 803946018 803224385 802475214 801796138 801199436 800598502
2788.1 800598502 799902856 799096525 798236728 797434926 796669066 795772254 794787347 793841243 792898476 791961908
2808.5 791961908 791043520 790039480 788937628 787840009 786766708 785670042 784538090 783342302
$$ packed form
2665.7H29308033l20375Tl53515l39627l72529m05074l60310l61144m37677m32849
2686.1H25604558l92318m32908m19140l55840l91364m35352m24087m60744m89235m25279
2706.5H21378291m02630m52637m51625m85897n69880n24104m60028m69864l90589l66628
2726.9H16804409n51105o20484m70638l99232m31061m30703m60267m95672m18783l59714
2747.3H12166750m58180n44012n38111n33700m90427m88817n81086n76079n15759n56171
2767.7H06884408o03080n49972n24044n98133o63161p21633p49171o79076n96702o00934
2788.1H00598502o95646q06331q59797q01802p65860q96812r84907r46104r42767r36568
2808.5G91961908r18388j004040j101852j097619j073301j096666j131952j195788
$$ plain form
2824.8 783342302 782062352 780780971 779504895 778086126 776480496 774735391 772707939 770200670
2841.1 770200670 767228544 763885915 760316730 756901026 754127860 752195537 750939727 750106752
2857.4 750106752 749384880 748437464 747109592 745419860 743462145 741398811 739430547 737621844 735909581
2875.8 735909581 734344065 732982695 731727302 730441093 729064345 727637529 726199389 724719048
2892.1 724719048 723188877 721597195 719888389 718115747 716370642 714579105 712620497 710471928
2908.4 710471928 708078861 705354869 702343106 699212492 696243048 693723261 691809177 690526426
2924.7 690526426 689848840 689675927 689770639 690106750 690905809 692180753 693825006 695819497 697998464
2943.1 697998464 700011015 701590002 702705681 703519285 704072773 704337120 704526544 704861820 705344677
$$ packed form
2824.8G83342302j279950j281381j276076j418769j605630j745105k027452k507269
2841.1G70200670k972126l342629l569185l415704k773166j932323j255810q32975
2857.4G50106752p21872r47416j327872j689732j957715k063334j968264j808703j712263
2875.8G35909581j565516j361370j255393j286209j376748j426816j438140j480341
2892.1G24719048j530171j591682j708806j772642j745105j791537j958608k148569
2908.4G10471928k393067k723992l011763l130614k969444k519787j914084j282751
2924.7F90526426o77586j72913R4712L36111P99059J274944J644253J994491K178967
2943.1F97998464K012551J578987J115679Q13604N53488K64347J89424L35276M82857
$$ plain form
2961.4 705344677 705857337 706347585 706870854 707418203 707994938 708629131 709250391 709909439 710641086 711245894
2981.8 711245894 711719453 712245345 712798476 713335454 713794291 713946700 713800907 713482916 712968409 712333083
3002.2 712333083 711631954 710885525 710241556 709712207 709091961 708246171 707202673 706043541 704801977
3020.6 704801977 703500330 702156425 700748622 699370146 698081553 696796179 695395172 693862736
3036.9 693862736 692375362 690950811 689407408 687680006 685854733 684101045 682431638 680674255
3053.2 680674255 678826094 676982939 675159931 673428476 671806693 670211375 668559313 666793227
3069.5 666793227 664985001 663282275 661772370 660354137 658766210 656988561 655216157 653422117
3085.8 653422117 651564062 649720430 647819281 645852327 643986523 642258346 640454292 638424575
$$ packed form
2961.4G05344677N12660M90248N23269N47349N76735O34193O21260O59048P31647O04808
2981.8G11245894M73559N25892N53131N36978M58837J52409j45793l17991n14507o35326
3002.2G12333083p01129p46429o43969n29349o20246q45790j043498j159132j241564
3020.6G04801977j301647j343905j407803j378476j288593j285374j401007j532436
3036.9F93862736j487374j424551j543403j727402j825273j753688j669407j757383
3053.2F80674255j848161j843155j823008j731455j621783j595318j652062j766086
3069.5F66793227j808226j702726j509905j418233j587927j777649j772404j794040
3085.8F53422117j858055j843632j901149j966954j865804j728177j804054k029717
$$ plain form
3102.2 638424575 636355698 634438038 632548392 630490482 628410816 626512468 624609411 622497737
3118.5 622497737 620136678 617572188 615040421 612694085 610453844 608141541 605672121 603234053
3134.8 603234053 600970030 598687232 596140385 593414664 590722561 588093460 585566103 583145559
3151.1 583145559 580618501 577827752 574905396 572034419 569247842 566482723 563716888 560964584
3167.4 560964584 558166385 555302143 552442908 549615562 546766937 543904185 541050017 538158178
3183.7 538158178 535264909 532430947 529597342 526745200 523910403 521040261 518144667 515312195
3200.1 515312195 512535810 509764910 507023752 504298806 501564622 498872876 496214628 493556589
3216.4 493556589 490890354 488243878 485652596 483078837 480515301 478036821 475680083 473367721
$$ packed form
3102.2F38424575k068877j917660j889646k057910k079666j898348j903057k111674
3118.5F22497737k361059k564490k531767k346336k240241k312303k469420k438068
3134.8F03234053k264023k282798k546847k725721k692103k629101k527357k420544
3151.1E83145559k527058k790749k922356k870977k786577k765119k765835k752304
3167.4E60964584k798199k864242k859235k827346k848625k862752k854168k891839
3183.7E38158178k893269k833962k833605k852142k834797k870142k895594k832472
3200.1E15312195k776385k770900k741158k724946k734184k691746k658248k658039
3216.4D93556589k666235k646476k591282k573759k563536k478480k356738k312362
$$ plain form
3232.7 473367721 470958948 468471318 466082305 463813037 461624563 459564179 457572550 455521286
3249 455521286 453450114 451483279 449586868 447627604 445610225 443653166 441792876 439959913 438134611
3267.4 438134611 436382920 434598058 432652891 430645227 428674012 426755965 424862027 422962815
3283.7 422962815 421068043 419198334 417397827 415633708 413784891 411795169 409689486 407590121
3300 407590121 405638754 403849483 402031630 399952143 397642583 395286828 393036604 390914142 388821274
3318.4 388821274 386725366 384659231 382614881 380460978 378163248 375900894 373742610 371668577
3334.7 371668577 369666547 367594421 365380824 363123059 360847235 358648628 356653333 354616970
3351 354616970 352289617 349855959 347606301 345592976 343624115 341587543 339669347 337899089 335993230
$$ packed form
3232.7D73367721k408773k487630k389013k269268k188474k060384j991629k051264
3249D55521286k071172j966835j896411j959264k017379j957059j860290j832963j825302
3267.4D38134611j751691j784862j945167k007664j971215j918047j893938j899212
3283.7D22962815j894772j869709j800507j764119j848817j989722k105683k099365
3300D07590121j951367j789271j817853k079487k309560k355755k250224k122462k092868
3318.4C88821274k095908k066135k044350k153903k297730k262354k158284k074033
3334.7C71668577k002030k072126k213597k257765k275824k198607j995295k036363
3351C54616970k327353k433658k249658k013325j968861k036572j918196j770258j905859
$$ plain form
3369.3 335993230 333802491 331592262 329709023 328092873 326556087 325037658 323578894 322313100
3385.7 322313100 321391135 320787281 320117384 319105446 318058759 317473680 317255020 316767722 315870255
3404 315870255 315141648 314856976 314777970 314694524 314490557 314238936 314208210 314404994 314666390 315102190
3424.4 315102190 315845162 316780388 317650110 318562478 319728017 320798129 321509093 322228938 323330164
3442.8 323330164 324745953 326280445 327850133 329518706 331329018 333242744 335266292 337410539
3459.1 337410539 339491814 341571271 344048798 346758544 349062860 350835830 352633208 354819059
3475.4 354819059 357378989 360018820 362335891 364574313 367154330 369787425 372247726 374830514
3491.7 374830514 377615213 380468637 383258015 386000842 388760120 391403407 393944740 396611422
$$ packed form
3369.3C35993230k190739k210229j883239j616150j536786j518429j458764j265794
3385.7C22313100r21965o03854o69897j011938j046687n85079k18660m87298q97467
3404C15870255p28607k84672p9006q3446k03967k51621l0726J96784K61396M35800
3424.4C15102190P42972R35226Q69722R12368J165539J070112P10964P19845J101226
3442.8C23330164J415789J534492J569688J668573J810312J913726K023548K144247
3459.1C37410539K081275K079457K477527K709746K304316J772970J797378K185851
3475.4C54819059K559930K639831K317071K238422K580017K633095K460301K582788
3491.7C74830514K784699K853424K789378K742827K759278K643287K541333K666682
$$ plain form
3508 396611422 399554193 402779132 405969590 408883721 411795825 414968520 418424368 421794623 424830943
3526.4 424830943 427919477 431369662 435085505 438935310 442697436 446256608 450019896 454085141
3542.7 454085141 458058804 461745232 465459108 469411522 473468304 477585614 481862217 486340880
3559 486340880 490816355 494992703 498936951 503446281 508775771 514062524 519013524 523965538 529124737
3577.4 529124737 534510612 540080249 545603752 550845206 555983067 561616242 567458332 573111117
3593.7 573111117 578867495 584974706 591136456 597188473 603107214 608667493 614191473 620066583
3610 620066583 626045942 632029772 637953758 643874168 650257468 656562388 662091911 666988194 672004580
3628.4 672004580 677971065 684020877 689694285 695127189 700266182 705102265 709660172 713721216
$$ packed form
3508C96611422K942771L224939L190458K914131K912104L172695L455848L370255L036320
3526.4D24830943L088534L450185L715843L849805L762126L559172L763288M065245
3542.7D54085141L973663L686428L713876L952414M056782M117310M276603M478663
3559D86340880M475475M176348L944248M509330N329490N286753M951000M952014N159199
3577.4E29124737N385875N569637N523503N241454N137861N633175N842090N652785
3593.7E73111117N756378O107211O161750O052017N918741N560279N523980N875110
3610F20066583N979359N983830N923986N920410O383300O304920N529523M896283N016386
3628.4F72004580N966485O049812N673408N432904N138993M836083M557907M061044
$$ plain form
3644.7 713721216 717163503 720947206 725949705 730923235 735166430 739245355 743372619 746989489
3661 746989489 749987841 752650678 754863799 756600738 758694708 760934472 762600482 764858842 767919898
3679.4 767919898 770796418 773223042 775194228 776714265 778018713 779878259 782232165 784317672
3695.7 784317672 785833240 786874115 787769318 788978577 790249228 790923834 790989995 791474879 793073893
3714 793073893 794721067 795667887 796107292 796437442 796913385 797632337 798510909 799019694 798857331 798639894
3734.4 798639894 799367309 800771952 801762462 801673412 800968409 801193237 801625848 801618278 802558959 804121912
3754.8 804121912 805097103 805564284 806239784 806994498 807333410 807448566 807585657 808027744 808817267 809389830
3775.2 809389830 809565246 809568048 809723258 809995174 810268581 810728371 811263442 811566472 811466336 811019719
$$ packed form
3644.7G13721216L442287L783703N002499M973530M243195M078925M127264L616870
3661G46989489K998352K662837K213121J736939K093970K239764J666010K258360L061056
3679.4G67919898K876520K426624J971186J520037J304448J859546K353906K085507
3695.7G84317672J515568J040875Q95203J209259J270651O74606O6161M84884J599014
3714G93073893J647174R46820M39405L30150M75943P18952Q78572N08785j62363k17437
3734.4G98639894P27415J404643R90510q9050p05003K24828M32611p570R40681J562953
3754.8H04121912R75191M67181O75500P54714L38912J15156J37091M42087P89523N72563
3775.2H09389830J75416K802J55210K71916K73407M59790N35071L03030j00136m46617
$$ plain form
3795.6 811019719 810658813 810347259 810060620 810603678 811295867 811689615 812353015 812897384 812739193 812105238
3816 812105238 811825454 811582804 811546266 812305152 812959194 813212097 813176095 812915087 812800348 812570989
3836.4 812570989 812103689 812280715 813057363 813840926 814360023 814364016 813500345 811785579 811478555 812948704
3856.8 812948704 813999832 814085186 813632488 813411057 813578367 813441694 813258350 813624680 814207137 814641833
3877.2 814641833 814473093 814148307 814337790 814499021 814666510 814804375 814640462 814785838 815157890 814948082
3897.6 814948082 814181387 813618064 813658059 814307392 815188169 815702379 815747976 815600455 815332294 815077782
3918 815077782 815113962 815239668 815180063 815172613 815260053 815163672 815089524 815370440 815788805 815981567 815834999
3940.4 815834999 815569520 815537155 815630615 815627515 815664768 815835297 816074073 816243529 816295087 816312551 816343844
$$ packed form
3795.6H11019719l60906l11554k86639N43058O92189L93748O63400N44369j58191o33955
3816H12105238k79784k42650l6538P58886O54042K52903l6002k61008j14739k29359
3836.4H12570989m67300J77026P76648P83563N19097L993q63671j714766l07024J470149
3856.8H12948704J051128Q5354m52698k21431J67310j36673j83344L66330N82457M34696
3877.2H14641833j68740l24786J89483J61231J67489J37865j63913J45376L72052k09808
3897.6H14948082p66695n63323L9995O49333Q80777N14210M5597j47521k68161k54512
3918H15077782L6180J25706n9605p450Q7440r6381p4148K80916M18365J92762j46568
3940.4H15834999k65479l2365R3460l100L7253J70529K38776J69456N1558J7464L1293
$$ plain form
3962.9 816343844 816385329 816415966 816433311 816444874 816494226 816584110 816694260 816826224 816969872 817130327 817221284
3985.3 817221284 817194343 817194402 817304611 817436457 817529082 817582011
3997.5 817582011
$$ packed form
3962.9H16343844M1485L0637J7345J1563M9352Q9884J10150J31964J43648J60455R0957
3985.3H17221284k6941N9J10209J31846R2625N2929
3997.5H17582011
##END=$$ End of the data block
