##TITLE=$$ Begin of the data block
##JCAMP-DX=5.00 $$ ACD/SpecManager v 10.08
##SPECTROMETER/DATA SYSTEM=Alpha
##DATE=10 Apr 2014 11:00:52
##DATA TYPE=INFRARED SPECTRUM
##DATA CLASS=XYDATA
##ORIGIN=
##OWNER=
##NPOINTS=1765
##FIRSTX=399.75695801
##LASTX=3997.56933594
##MAXX=3997.56933594
##MINX=399.75695801
##MAXY=0.85263968
##MINY=0.31516081
##XFACTOR=1.0000000000
##YFACTOR=1.000000000000000e-9
##FIRSTY=0.62651002
##DELTAX=2.03957629
##XUNITS=1/CM
##YUNITS=ARBITRARY UNITS
##XYDATA=(X++(Y..Y))
399.8F26510024m97878j032710j086175m36902r12488r40680q8751q02935j795232
418.1F18916273m98414m7028l29494N92529L15547n79118j73808m97639j172125l31044
438.5F16195679j46270p64310l62933k44498l15130M59015L25322o51121m95255l72529
458.9F13627970r55522l69727p9453j047969r17137m94719j103162o75619j38998p47621
479.3F07098043n62906k7359o25491n78999M708o52790r12130l41594q73685j184344
499.7F01343453m37617o75559j093030m54963o48617j143277o19292q88646j538455
518.1E93843997p88332o57737j524448j233578q17895j320302j022578o66260j213432
536.4E84599435p42137O9976n05567p95245n49257j095414j046479l38196q26896j219570
$$ y = [626510024, 626012146, 624979436, 623893261, 623456359, 622543871, 621603191, 621514440, 620711505, 618916273, 618417859, 618370831, 618041337, 618633866, 618949413, 618370295, 618196487, 617698848, 616526723, 616195679, 616049409, 615285099, 614922166, 614677668, 614362538, 614821553, 615146875, 614495754, 614000499, 613627970, 612672448, 612302721, 612223268, 611175299, 610258162, 609763443, 608660281, 607984662, 607845664, 607098043, 606535137, 606507778, 605882287, 605303288, 605307996, 604655206, 603743076, 603401482, 602527797, 601343453, 600905836, 600230277, 599137247, 598682284, 598033667, 596890390, 596271098, 595382452, 593843997, 593055665, 592397928, 590873480, 589639902, 588822007, 587501705, 586479127, 585812867, 584599435, 583857298, 583927274, 583421707, 582626462, 582077205, 580981791, 579935312, 579597116, 578770220, 577550650]
556.8E77550650p05362j190066j801789j366794j724303k378702j855850j784563k268791
575.2E62474430j854837j662732j970410j444399j261056j840055j584887j245678
591.5E49610376j695633j482784j042784j666665j932859j481414j416087q61049K26736
609.8E38257837J56880k11358O03199J751721K835094L891528L929079L404259L694594
628.2E58312833L733218K997160K928913K994954K161741J576305J204073O49929J475096
646.5E78034222K837181K064467K60889k09033R04441L517031N685032M913270K833903
664.9F00841403K536654L530682K980947K922475L082097K451062K504766K789855
681.2F23639941K132416J954675K214610J554370J206458J558840J044989N45025J092672
$$ y = [577550650, 576845288, 575655222, 573853433, 572486639, 570762336, 568383634, 566527784, 564743221, 562474430, 560619593, 558956861, 556986451, 555542052, 554280996, 552440941, 550856054, 549610376, 547914743, 546431959, 545389175, 543722510, 541789651, 540308237, 538892150, 538031101, 538257837, 538414717, 538203359, 538806558, 540558279, 543393373, 547284901, 551213980, 554618239, 558312833, 562046051, 565043211, 567972124, 570967078, 573128819, 574705124, 575909197, 576559126, 578034222, 580871403, 582935870, 583196759, 582987726, 583892167, 587409198, 593094230, 598007500, 600841403, 603378057, 606908739, 609889686, 612812161, 615894258, 618345320, 620850086, 623639941, 625772357, 627727032, 629941642, 631496012, 632702470, 634261310, 635306299, 635851324, 636943996]
699.6F36943996J120508R02831J555205J673221J308680J958430K325236J774609K017022
717.9F51579738K381444J849770J956821K407550J789630J620531K166986J637221
734.2F67389691J242399J807451J551152J115977J660586J552641J114845J710475
750.6F79145217J787960J175046J542509J764655J106918J272440J621366J019537
766.9F90435648R34124J224995M92274R597J68144n86688j218796p58707p82967q54671
787.3F89062953L24428J311183J854718L215551M292190M456640M970490N179465M349292
805.6G19016910L962397L804565K731800K013325J903892Q62002l29375q75235k016723
824G31073558l156840l305614l743828m374265l916622l402412l477096k995014k455831
$$ y = [636943996, 638064504, 638967335, 640522540, 642195761, 643504441, 645462871, 647788107, 649562716, 651579738, 653961182, 655810952, 657767773, 660175323, 661964953, 663585484, 665752470, 667389691, 668632090, 670439541, 671990693, 673106670, 674767256, 676319897, 677434742, 679145217, 680933177, 682108223, 683650732, 685415387, 686522305, 687794745, 689416111, 690435648, 691369772, 692594767, 693087041, 693096638, 693264782, 692678094, 691459298, 690700591, 689917624, 689062953, 689387381, 690698564, 692553282, 695768833, 700061023, 704517663, 709488153, 714667618, 719016910, 722979307, 726783872, 729515672, 731528997, 733432889, 734294891, 733965516, 733090281, 731073558, 727916718, 724611104, 720867276, 716493011, 712576389, 709173977, 705696881, 702701867, 700246036]
842.3G00246036k531111j814485l26693P83861K411246M596949N876362O825507P943511
860.7G24011183Q035183P607341P560789O676972N093455M303158L517925K202154
877G69008160J491308P23243p27415j412750j638889k488732k677143j932800j534283
895.4G58810699p98047O42836J285375J446008J958013J575828M61876o9082r72509
913.7G64340997k503217l161549l427744l863990l167272j764595j000345j39594Q04364
932.1G46117055O94395M29034O43849K78890j94072j1385l18348j164616j599431k430856
952.5G42444515l876924m812897n756795p251620q345425r354234j0882378j1782109
968.8F80382133j1832715j1751830j0850251r134710p911503o988347n873978n367338
$$ y = [700246036, 697714925, 695900440, 695573747, 696357608, 698768854, 703365803, 709242165, 716067672, 724011183, 732046366, 739653707, 747214496, 753891468, 758984923, 763288081, 766806006, 769008160, 770499468, 771222711, 770495296, 769082546, 767443657, 764954925, 762277782, 760344982, 758810699, 758012652, 758655488, 759940863, 761386871, 763344884, 764920712, 765382588, 765313506, 764340997, 761837780, 758676231, 755248487, 751384497, 748217225, 746452630, 745452285, 745312691, 746117055, 746811450, 747240484, 747884333, 748163223, 747969151, 747957766, 747639418, 746474802, 744875371, 742444515, 738567591, 733754694, 727997899, 720746279, 712400854, 703046620, 692164242, 680382133, 668549418, 656797588, 645947337, 636812627, 628901124, 621912777, 616038799, 610671461]
985.1F10671461n244255m642427m082203l824711l230214k605498k411604k096117
1001.4E82534432j787483k181053k838910l438830m281402m798889m708052m653215
1017.7E53846598m489005l893018l466308l306210k887606k512992k410173k089739
1034.1E28791547j721323j658797j462638j193822j295149j414359j378178j464486
1050.4E17202795j297296n63204K06530Q65817J508177J550555P70926l61800j725674
1068.7E18156826l082275l771305l873885l827393l586888l329814l441631l722012
1085D89521623l978581m258245m095793l151565j871348o42240M32134J008272J049072
1103.4D74013329R38415O94186J81764l80069j013011k067596l569245n138934n694955
$$ y = [610671461, 605427206, 600784779, 596702576, 592877865, 589647651, 587042153, 584630549, 582534432, 580746949, 578565896, 575726986, 572288156, 568006754, 563207865, 558499813, 553846598, 549357593, 545464575, 541998267, 538692057, 535804451, 533291459, 530881286, 528791547, 527070224, 525411427, 523948789, 522754967, 521459818, 520045459, 518667281, 517202795, 515905499, 515342295, 515548825, 516414642, 517922819, 519473374, 520244300, 519882500, 518156826, 515074551, 511303246, 507429361, 503601968, 500015080, 496685266, 493243635, 489521623, 485543042, 481284797, 477189004, 474037439, 472166091, 471523851, 471955985, 472964257, 474013329, 474951744, 475645930, 475827694, 475447625, 474434614, 472367018, 468797773, 463658839, 457963884]
1121.8D57963884l970117r58621R77993J672685J600266P82042N72682J638412K758950
1140.1D63038176L094852K912700K531559K053469J706630J619101J645773J863361
1156.4D80465621K427667L166288M073531N258798O427348P281363P847965Q012950
1172.7E24961531P725775P340551O961524O355346N575716M677236L465235K087415
1189.1E69150329Q11517l45886j049697r30190k74003O68049J870096K784907K997637
1207.4E75682759K806485K369046J709104J226723J025021Q24988P48992Q96811R95458
1225.8E88285387J106500J400054J635611J778006K012551K119541K027750K000571
1242.1F02365971J886606J527667J190543Q92639N25534L52264M32670N42343Q50200
$$ y = [457963884, 453993767, 453035146, 454013139, 455685824, 457286090, 458068132, 458640814, 460279226, 463038176, 466133028, 469045728, 471577287, 473630756, 475337386, 476956487, 478602260, 480465621, 482893288, 486059576, 490133107, 495391905, 501819253, 509100616, 516948581, 524961531, 532687306, 540027857, 546989381, 553344727, 558920443, 563597679, 567062914, 569150329, 569961846, 569615960, 568566263, 567636073, 567362070, 568030119, 569900215, 572685122, 575682759, 578489244, 580858290, 582567394, 583794117, 584819138, 585644126, 586393118, 587289929, 588285387, 589391887, 590791941, 592427552, 594205558, 596218109, 598337650, 600365400, 602365971, 604252577, 605780244, 606970787, 607863426, 608388960, 608741224, 609173894, 609716237, 610566437]
1260.4F10566437J412988J859903K288997K874852L286302L519833L864944M128039
1276.8F33802295M197418M348576M504920M529714M702032M926741M796684M534363
1293.1F70342743M346908M002392L605246L310144K917350K522349K304614J992344
1309.4F95344090J590610J425326J312792J142442J233578J382470J309812J295865
1325.7G06036985J297116J074791Q13067N63741J96278l3021J78874N05328O42180
1344.1G11275339P39396P33614O35326N67078L78311J33693l0637l88384q38458p89285
1364.5G12415993p08580r81986j013756j046956j231432j024127j057505j753807k221227
1382.8G01376617j831472j220226q11696n90086r44972j473785j452386j547456j758456
$$ y = [610566437, 611979425, 613839328, 616128325, 619003177, 622289479, 625809312, 629674256, 633802295, 637999713, 642348289, 646853209, 651382923, 656084955, 661011696, 665808380, 670342743, 674689651, 678692043, 682297289, 685607433, 688524783, 691047132, 693351746, 695344090, 696934700, 698360026, 699672818, 700815260, 702048838, 703431308, 704741120, 706036985, 707334101, 708408892, 709221959, 709785700, 709981978, 709948957, 710127831, 710633159, 711275339, 712014735, 712748349, 713383675, 713950753, 714329064, 714462757, 714432120, 714043736, 713205278, 712415993, 711707413, 710725427, 709711671, 708664715, 707433283, 706409156, 705351651, 703597844, 701376617, 699545145, 698324919, 697513223, 696923137, 695978165, 694504380, 693051994, 691504538, 689746082]
1401.2F89746082k029240k501846k413153k089620j945555j699627j445770j567900
1417.5F74053371j532733o40035j52290j24753j17659j41025J41025L99172L88026
1435.9F72273099Q71122J444817J522541J422644J356899J598537K204299K514780
1452.2F85208738K502739L303051N518794N825639N058348N237937N693376N389214
1468.5G23737836N254984O262898O812334N873919M630804L556609K787471J814723
1484.8G60731578O59406k18928l32475k93791j195669k587557k659142j937806k017856
1503.2G50147760m006386o918371m417240k623618l179908l741502l737092l018380
1519.5G18505263k896011k335727j659751j661479j383424j669884k078771j226068
$$ y = [689746082, 687716842, 685214996, 682801843, 680712223, 678766668, 677067041, 675621271, 674053371, 672520638, 671880603, 671728313, 671603560, 671485901, 671344876, 671485901, 671885073, 672273099, 673144221, 674589038, 676111579, 677534223, 678891122, 680489659, 682693958, 685208738, 687711477, 691014528, 696533322, 702358961, 707417309, 712655246, 718348622, 723737836, 728992820, 735255718, 742068052, 747941971, 752572775, 756129384, 758916855, 760731578, 761390984, 761172056, 760839581, 760545790, 759350121, 756762564, 754103422, 752165616, 750147760, 746141374, 739223003, 734805763, 732182145, 729002237, 725260735, 721523643, 718505263, 715609252, 713273525, 711613774, 709952295, 708568871, 706898987, 704820216, 703594148]
1535.8G03594148j151323k496541j635372L39567Q32498P39396N11467O88553Q39889
1554.1G02262282M12226n10275L38196J275301K75434q27253k085626l063441k565563
1572.5F95511281l444671n892396n236924m385590n450786o194710o476581o772697
1588.8F51656926o943107o987154p138610o958366o651401o765843o853342o601512
1605.1E96757591o594300o867111o561637o028831o951928q155048n823970m748642
1621.4E45026124n866945n423129m575312l959417k615154k159119k445996n71251
1637.8E17409801J222373J670300J795769K236605L410935L635526L798723N894184
1654.1E41074216O091118N338133N394160O140411O826043O151319O150186P333875
$$ y = [703594148, 702442825, 699946284, 698310912, 698650479, 699482977, 700222373, 700733840, 701422393, 702262282, 702674508, 702164233, 702502429, 703777730, 704053164, 703225911, 701140285, 698076844, 695511281, 692066610, 686174214, 680937290, 676551700, 671100914, 664906204, 658429623, 651656926, 644713819, 637726665, 630588055, 623629689, 616978288, 610212445, 603359103, 596757591, 590163291, 583296180, 576734543, 570705712, 563753784, 555598736, 549774766, 545026124, 539159179, 533736050, 529160738, 525201321, 522586167, 520427048, 517981052, 517409801, 518632174, 520302474, 522098243, 524334848, 527745783, 531381309, 535180032, 541074216, 547165334, 552503467, 557897627, 564038038, 570864081, 577015400, 583165586, 590499461]
1670.4E90499461P187009P254064P935583P275522O457686O854892R328366R194433
1686.7F51987016P858575P940113P075131P002831P821202Q336902R948790Q662581
1703G16633141P169664P133186O291032N184233M159331L565252M118860M714787M173994
1721.4G63143480L545523L134608K689719K378464K010166K183140L030419K862811
1737.7G84978330K632737K870202K924085K730131K703786L015757L354788L019988
1754H08229804K503037K187670J918673J902283J875340J527369J123548Q10444R77576
1772.4H23055744J674235J663327J202286J050174J145661J127720J068472Q31545
1788.7H32819164L84211N63622J122236J024783O88851P14540Q99255Q59797O75679
$$ y = [590499461, 597686470, 604940534, 612876117, 620151639, 626609325, 633464217, 642792583, 651987016, 659845591, 667785704, 674860835, 681863666, 689684868, 698021770, 707970560, 716633141, 723802805, 730935991, 737227023, 742411256, 746570587, 750135839, 754254699, 758969486, 763143480, 766689003, 769823611, 772513330, 774891794, 776901960, 779085100, 782115519, 784978330, 787611067, 790481269, 793405354, 796135485, 798839271, 801855028, 805209816, 808229804, 810732841, 812920511, 814839184, 816741467, 818616807, 820144176, 821267724, 822078168, 823055744, 824729979, 826393306, 827595592, 828645766, 829791427, 830919147, 831987619, 832819164, 833203375, 833766997, 834889233, 835914016, 836602867, 837317407, 838216662, 839076459, 839752138]
1807H39752138M46915M41611O88970O94215M55916M17889M15742K19166J55807K32637
1827.4H43921006K30252N81563Q52525N36680K79785L20136J32978j65820K55466O94096
1847.8H47638667N37336L93152L56316K27869J66476K64763K39909Q3089j29700k41875
1868.2H49536002K05874O81996N05746J56581J36495J50204M0710Q3088J15753n8413
1888.6H51554036L8445K64406J28866P5817K06172J36316L3498O8545l2067j37568
1909H52336466O7234J92523k0444j56820l7908l0995k38J80483J09374l7372k5034
1931.5H52577269n8710q6964l9160j62780l37363j73270K4080l4451n7459p1883j78993
1953.9H51400316j80364j58131k35021j93596j23918k42591k10583k1279j03533k27988
$$ y = [839752138, 840199053, 840640664, 841329634, 842023849, 842479765, 842897654, 843313396, 843532562, 843688369, 843921006, 844151258, 844732821, 845585346, 846122026, 846401811, 846721947, 846854925, 846689105, 846944571, 847638667, 848176003, 848569155, 848925471, 849153340, 849319816, 849584579, 849824488, 849907577, 849777877, 849536002, 849741876, 850423872, 850929618, 851086199, 851222694, 851372898, 851413608, 851496696, 851612449, 851554036, 851592481, 851856887, 851985753, 852061570, 852267742, 852404058, 852437556, 852506101, 852474034, 852336466, 852403700, 852596223, 852575779, 852418959, 852381051, 852350056, 852349818, 852530301, 852639675, 852602303, 852577269, 852518559, 852431595, 852392435, 852229655, 851892292, 851719022, 851743102, 851708651, 851651192, 851579309, 851400316, 851219952, 851061821, 850826800, 850633204, 850509286, 850266695, 850056112, 850034833, 849931300, 849703312]
1974.3H49703312j28925r7871j81138j11997p6354k26915k62439k17378k21133r5427
1994.7H48083735j4127j60634k36273j46926j61886k27451j68562j98305k92360k34902
2015.1H46242309j92464k25067j78754j51694k35200k13921j29640j91868k32040j79232
2035.5H44312429k16007k27809j14739j15335j86264j51813j58966k10404j37985q2314
2055.9H42710793j33812j32800j08242j69217j41502r954m0233q6367j5616n8949j21892
2078.3H41692209m3988l7849j00195n1380k4199o2227k0325J7166n3168n6028K0862
2100.7H41280878K443m0114k145Q404j7345J907M053K0981P9513O3479N364L8088Q4817
2127.3H41530323O1333N2810P3671P8917Q5890J18971R6202M6074J13547J88351J51515
$$ y = [849703312, 849574387, 849476516, 849295378, 849183381, 849107027, 848880112, 848617673, 848400295, 848179162, 848083735, 848069608, 847908974, 847672701, 847525775, 847363889, 847136438, 846967876, 846769571, 846477211, 846242309, 846049845, 845824778, 845646024, 845494330, 845259130, 845045209, 844915569, 844723701, 844491661, 844312429, 844096422, 843868613, 843753874, 843638539, 843452275, 843300462, 843141496, 842931092, 842793107, 842710793, 842576981, 842444181, 842335939, 842166722, 842025220, 842015266, 841975033, 841888666, 841873050, 841814101, 841692209, 841648221, 841610372, 841510177, 841458797, 841434598, 841372371, 841352046, 841369212, 841316044, 841260016, 841280878, 841283321, 841243207, 841241062, 841249466, 841232121, 841234028, 841238081, 841259062, 841338575, 841402054, 841407418, 841445506, 841530323, 841591656, 841644466, 841718137, 841797054, 841882944, 842001915, 842098117, 842144191, 842257738, 842446089, 842597604]
2149.7H42597604J15275R3401N7220Q9944J44720J28865J12533J33813J11461R9480
2170.1H43684316J56820J56879J11043J36972J45435Q6963R6441J32739R6858P4923
2190.5H44879389R9242R9957Q6426O9320J1683q285L8803N5968O6340J09136J10805
2212.9H45618784N9724J0073m112K3961N8889N3346l695k9802J2338J8179j3411n305
2237.4H45798969O795l57J8239R656o9082p7546k444j1742n2571j8358j7882o4313
2261.9H45519364k7537O1512O5863J1682j6630j2636M0889R5248J14024J24514J01805
2284.3H46078098K7537N96O6579R7274O8725Q1241Q1598J5378N1797J36435P0929J1564
2308.8H46787751O1273N8353M0174J00732N7637n6624l1471K682j9431J9908L6835
$$ y = [842597604, 842712879, 842806280, 842863500, 842953444, 843098164, 843227029, 843339562, 843473375, 843584836, 843684316, 843841136, 843998015, 844109058, 844246030, 844391465, 844478428, 844574869, 844707608, 844804466, 844879389, 844978631, 845078588, 845165014, 845234334, 845246017, 845237732, 845276535, 845332503, 845398843, 845507979, 845618784, 845678508, 845688581, 845684469, 845708430, 845767319, 845820665, 845816970, 845787168, 845799506, 845817685, 845804274, 845798969, 845805764, 845805407, 845823646, 845833302, 845764220, 845686674, 845684230, 845672488, 845619917, 845601559, 845583677, 845519364, 845491827, 845553339, 845619202, 845630884, 845614254, 845601618, 845642507, 845737755, 845851779, 845976293, 846078098, 846105635, 846106231, 846172810, 846270084, 846338809, 846420050, 846501648, 846517026, 846568823, 846705258, 846776187, 846787751, 846849024, 846907377, 846947551, 847048283, 847105920, 847049296, 847017825, 847020507, 847001076, 847020984, 847057819]
2331.2H47057819j2159j5318m7923j61588r8109J83106L96072N17786M61340J33455
2351.6H48414481k56300l05891r4235L1054N0604L1233J21176L14772M43340M83036
2372H49233270M63664L88086K95341L16441L53575K41756J35005J22011O4253K8551
2392.4H51641953Q4579O8665J4066N5015P5937L3915N7161O8187j5616k9862K7180
2414.8H52081180m053l9161o437l1233p0751k7477m948m5239n9307p4267q7858k8431
2439.3H51602018m828o9499p7307n6804j16705j22726m1664m3392p2241l3319o3658
2461.7H50899875j21474p3493o4790j18315q3029o4969j29581j22785j11223j69873
2482.1H49840343j31130m0055q7440j51395r7871q1182j10924p9274r4533j48296j12236
$$ y = [847057819, 847045660, 847030342, 846982419, 846820831, 846722722, 846905828, 847301900, 847819686, 848281026, 848414481, 848158181, 847852290, 847758055, 847789109, 847839713, 847870946, 847992122, 848306894, 848750234, 849233270, 849696934, 850085020, 850380361, 850696802, 851050377, 851292133, 851427138, 851549149, 851613402, 851641953, 851726532, 851795197, 851809263, 851864278, 851940215, 851974130, 852031291, 852099478, 852083862, 852054000, 852081180, 852077127, 852037966, 852031529, 852000296, 851929545, 851902068, 851897120, 851851881, 851792574, 851718307, 851630449, 851602018, 851597190, 851527691, 851450384, 851393580, 851276875, 851154149, 851112485, 851069093, 850996852, 850963533, 850899875, 850778401, 850704908, 850640118, 850521803, 850438774, 850373805, 850244224, 850121439, 850010216, 849840343, 849709213, 849669158, 849581718, 849430323, 849332452, 849251270, 849140346, 849061072, 848966539, 848818243, 848706007]
2504.6H48706007r0599j41025j13368n9902j02461j20938r4235j23500j20759o9857
2525H47669363r4295j23679r2924j07109j38224q7440o1512j36852j54257j04844j35541
2547.4H46432686j47939q1777q2136r3817p6294j43647k02060j56224j32561j64270
2567.8H45151961j44720j44243k37048k43902j76370k07544k30610j94073k53260l03388
2588.2H43016803k26617k39789l27051l08573l04520l48330l14891l03984l79741l64780
2608.6H39898527l25322l93272l94165l24727l77476m32610l71397l75032m24266l79682
2629H36100578l71515m14193l63648l52860m14252l75449l32416l54111l46422l77953
2649.4H32397759m70519m32968l26753l55005l72648l13700l41475l79860l24547l21687
$$ y = [848706007, 848615408, 848474383, 848361015, 848301113, 848198652, 848077714, 847983479, 847859979, 847739220, 847669363, 847575068, 847451389, 847358465, 847251356, 847113132, 847025692, 846964180, 846827328, 846673071, 846568227, 846432686, 846284747, 846202970, 846120834, 846027017, 845950723, 845807076, 845605016, 845448792, 845316231, 845151961, 845007241, 844862998, 844625950, 844382048, 844205678, 843998134, 843767524, 843573451, 843320191, 843016803, 842790186, 842550397, 842223346, 841914773, 841610253, 841261923, 840947032, 840643048, 840263307, 839898527, 839573205, 839179933, 838785768, 838461041, 838083565, 837650955, 837279558, 836904526, 836480260, 836100578, 835729063, 835314870, 834951222, 834598362, 834184110, 833808661, 833476245, 833122134, 832775712, 832397759, 831927240, 831494272, 831167519, 830812514, 830439866, 830126166, 829784691, 829404831, 829080284, 828758597]
2669.8H28758597l43501l04640l45706m08411l62337l66092m51505m21107l52800m04298
2690.2H24998200m19021l55363l88443m52221m43398m64917m80115m18365m28200m88758
2710.6H20659399m56035m61519n31137m85659m24206m62174m36485m10020n31435n78583
2731H15882146m72128m12226m09543m09663m63486n00142m40657m06444m47631m89414
2751.4H11430812n59747n98967m94421m43160n30363n60402n47112n79595n81563n36024
2771.8H05999458n42700o16968o79135p06017p20025p01785o64115o26444o32227p47442
2792.2G99362600q57055q24869p90715q83103r48488r40025r60052r46701r27269j017213
2812.5G90267110j093388j064837j062870j119852j157462j214803j276374j252055
$$ y = [828758597, 828415096, 828110456, 827764750, 827356339, 826994002, 826627910, 826176405, 825755298, 825402498, 824998200, 824579179, 824223816, 823835373, 823383152, 822939754, 822474837, 821994722, 821576357, 821148157, 820659399, 820203364, 819741845, 819210708, 818725049, 818300843, 817838669, 817402184, 816992164, 816460729, 815882146, 815410018, 814997792, 814588249, 814178586, 813715100, 813214958, 812774301, 812367857, 811920226, 811430812, 810871065, 810272098, 809777677, 809334517, 808804154, 808243752, 807696640, 807117045, 806535482, 805999458, 805456758, 804839790, 804160655, 803454638, 802734613, 802032828, 801368713, 800742269, 800110042, 799362600, 798505545, 797680676, 796889961, 796006858, 795058370, 794118345, 793158293, 792211592, 791284323, 790267110, 789173722, 788108885, 787046015, 785926163, 784768701, 783553898, 782277524, 781025469]
2828.9G81025469j277387j432478j555681j689017k036155k519428k964914l363311
2845.2G64187098l595412l427863k802134j935184j200199p89940p31290r83894j363992
2863.5G47357190j722813k001882k081155j942039j782656j681864j527369j354694
2879.9G33262718j289904j314819j353205j381218j424849j498401j545549j602232
2896.2G21852541j732230j786173j709401j731813j943648k177417k421618k761125
2912.5G05589116l055334l113807k909004k496899j914501j281619o87837j76669J18852
2930.8F90072298L66688Q00788J265288J640200J966536K142847K017975J605093J121462
2949.2G02999175Q08000N42641K39789J79947L80099N25236M92751M71175N43118N76794
$$ y = [781025469, 779748082, 778315604, 776759923, 775070906, 773034751, 770515323, 767550409, 764187098, 760591686, 757163823, 754361689, 752426505, 751226306, 750436366, 749705076, 748721182, 747357190, 745634377, 743632495, 741551340, 739609301, 737826645, 736144781, 734617412, 733262718, 731972814, 730657995, 729304790, 727923572, 726498723, 725000322, 723454773, 721852541, 720120311, 718334138, 716624737, 714892924, 712949276, 710771859, 708350241, 705589116, 702533782, 699419975, 696510971, 694014072, 692099571, 690817952, 690130115, 689953446, 690072298, 690438986, 691239774, 692505062, 694145262, 696111798, 698254645, 700272620, 701877713, 702999175, 703807175, 704349816, 704589605, 704769552, 705149651, 705674887, 706167638, 706638813, 707181931, 707758725]
2969.6G07758725N99503O32942N86569O20544P26521O11663M64976N30124N72025N57721
2990G13661313M95434J80304j37627k97845n02407o54459p04289p36296o82056n69880
3010.4G10052192n98907q05021j017212j156986j255632j290381j321911j421273j412153
3028.7F99772716j291216j238942j343250j524389j520395j409471j493454j738370
3045.1F88213229j874924j771628j654327j721144j814127j844168j851499j761257
3061.4F73920155j618386j561224j631856j761258j795173j698672j538098j447380
3077.7F60868108j575589j750588j789451j790166j769900j778782j924038k021729
3094F46467865j913190j778543j849950k010166j987040j843691j838923k041757k134025
$$ y = [707758725, 708358228, 708991170, 709577739, 710198283, 710924804, 711536467, 712001443, 712531567, 713103592, 713661313, 714156747, 714337051, 714199424, 713901579, 713399172, 712744713, 712040424, 711304128, 710622072, 710052192, 709453285, 708648264, 707631052, 706474066, 705218434, 703928053, 702606142, 701184869, 699772716, 698481500, 697242558, 695899308, 694374919, 692854524, 691445053, 689951599, 688213229, 686338305, 684566677, 682912350, 681191206, 679377079, 677532911, 675681412, 673920155, 672301769, 670740545, 669108689, 667347431, 665552258, 663853586, 662315488, 660868108, 659292519, 657541931, 655752480, 653962314, 652192414, 650413632, 648489594, 646467865, 644554675, 642776132, 640926182, 638916016, 636928976, 635085285, 633246362, 631204605, 629070580]
3112.4F29070580j972020j915514k084196k350032k568543k546489k366364k239943
3128.7F11027479k290606k435148k425552k285599k286136k538681k750814k713263
3145E91301680k598942k474069k385021k538621k846897k954304k847195k743959k744019
3163.4E67168653k805710k833307k833187k827287k806842k802372k847970k870023
3179.7E44541955k862930k898097k889574k808630k811551k879203k875268k871812
3196E21644890k884686k829432k758444k732515k736568k793312k821625k721727k619922
3214.3D96746659k590656k608240k646565k648205k596408k544492k497912k395987
3230.7D76218194k294868k346755k466172k433359k297163k165377k054870k025009
$$ y = [629070580, 627098560, 625183046, 623098850, 620748818, 618180275, 615633786, 613267422, 611027479, 608736873, 606301725, 603876173, 601590574, 599304438, 596765757, 594014943, 591301680, 588702738, 586228669, 583843648, 581305027, 578458130, 575503826, 572656631, 569912672, 567168653, 564362943, 561529636, 558696449, 555869162, 553062320, 550259948, 547411978, 544541955, 541679025, 538780928, 535891354, 533082724, 530271173, 527391970, 524516702, 521644890, 518760204, 515930772, 513172328, 510439813, 507703245, 504909933, 502088308, 499366581, 496746659, 494156003, 491547763, 488901198, 486252993, 483656585, 481112093, 478614181, 476218194, 473923326, 471576571, 469110399, 466677040, 464379877, 462214500, 460159630, 458134621]
3247D58134621k054780k032012j976818j928419j925856j990348j969963j870990j830608
3265.3D40554827j793742j731217j821011k004147k030879j944691j872778j873493
3281.6D25482869j927316j916617j848340j788229j788408j863241j951605k053678
3298D10345435k108037j990170j780748j781970k064914k324134k371281k238095k119064
3316.3C91567022k129019k134144k071112k019197k128333k294183k267033k152979
3332.6C74371022k053648j973003k066911k225637k239734k254367k210230k008795
3348.9C57338697k034247k323449k440840k264827k044499j999349k006769j850635
3365.3C40374082j709431j858294k173841k209038j882106j621812j544148j542777
$$ y = [458134621, 456079841, 454047829, 452071011, 450142592, 448216736, 446226388, 444256425, 442385435, 440554827, 438761085, 437029868, 435208857, 433204710, 431173831, 429229140, 427356362, 425482869, 423555553, 421638936, 419790596, 418002367, 416213959, 414350718, 412399113, 410345435, 408237398, 406247228, 404466480, 402684510, 400619596, 398295462, 395924181, 393686086, 391567022, 389438003, 387303859, 385232747, 383213550, 381085217, 378791034, 376524001, 374371022, 372317374, 370344371, 368277460, 366051823, 363812089, 361557722, 359347492, 357338697, 355304450, 352981001, 350540161, 348275334, 346230835, 344231486, 342224717, 340374082, 338664651, 336806357, 334632516, 332423478, 330541372, 328919560, 327375412, 325832635]
3381.6C25832635j502901j278490r03815n99206o78807j008987r98229n10067j87457
3399.9C18164676n25951r35286p24286k99871r8974m7683j45346k14309j2159J89364
3420.3C15350175K08169L77715P17133R37998R11564R65238J185417J072049P19219
3438.7C22444677P17253J084804J427383J569151J572490J631320J767546J893997
3455C34108621K041817K179205K086580K054184K471865K751976K330154J736581J768053
3473.4C53529036K199441K582789K647042K272069K152712K527833K631604K498448
3489.7C73040974K623409K771348K797782K757430K766401K792865K632231K507150
3506C94689590K662301K966285L264218L237635K949953K930731L161877L432602L354937
$$ y = [325832635, 324329734, 323051244, 322147429, 321548223, 320869416, 319860429, 318862200, 318352133, 318164676, 317638725, 316703439, 315979153, 315679282, 315580308, 315532625, 315387279, 315172970, 315160811, 315350175, 315558344, 315936059, 316653192, 317591190, 318502754, 319467992, 320653409, 321725458, 322444677, 323161930, 324246734, 325674117, 327243268, 328815758, 330447078, 332214624, 334108621, 336150438, 338329643, 340416223, 342470407, 344942272, 347694248, 350024402, 351760983, 353529036, 355728477, 358311266, 360958308, 363230377, 365383089, 367910922, 370542526, 373040974, 375664383, 378435731, 381233513, 383990943, 386757344, 389550209, 392182440, 394689590, 397351891, 400318176, 403582394, 406820029, 409769982, 412700713, 415862590, 419295192, 422650129]
3524.4D22650129L028124L072977L409326L672183L829300L795594L619641L763289
3540.7D50840563M044413L984511L653467L673613L990650M114300M138857M250378
3557D82690752M389733M392951M171849L978759M541069N352735N301893M972816M964769
3575.3E24757326N131542N374194N625605N578995N225897N052864N550742N823791
3591.7E68120956N685687N759955O068766O202757O154657N942344N526186N508244
3608F14969552N878210O020248O005406N851567N813420O319046O335496N615294M906178
3626.3F67714417M940510N978167O118476N688846N403400N102098M816413M528343
3642.6G10290670M037321L486276L779649M865826M864335M191100M099012M203081
$$ y = [422650129, 425678253, 428751230, 432160556, 435832739, 439662039, 443457633, 447077274, 450840563, 454884976, 458869487, 462522954, 466196567, 470187217, 474301517, 478440374, 482690752, 487080485, 491473436, 495645285, 499624044, 504165113, 509517848, 514819741, 519792557, 524757326, 529888868, 535263062, 540888667, 546467662, 551693559, 556746423, 562297165, 568120956, 573806643, 579566598, 585635364, 591838121, 597992778, 603935122, 609461308, 614969552, 620847762, 626868010, 632873416, 638724983, 644538403, 650857449, 657192945, 662808239, 667714417, 672654927, 678633094, 684751570, 690440416, 695843816, 700945914, 705762327, 710290670, 714327991, 717814267, 721593916, 726459742, 731324077, 735515177, 739614189, 743817270]
3659G43817270L664255K987206K634048K224148J778125K083242K207816J689851K281845
3677.3G65367806L062546K860248K375663J920819J497924J287759J833081K344787
3693.6G82550633K097428J521170J038432R06527J193524J213788O65188J54198N46753
3712G91887641J551390J614809R81450M72903L18289M44650O81580Q58724M96208k05874
3732.4G99101770k47359P51614J501441J117945n4121p88987J89364N26488J22011
3750.7H02220166R34958J467884R19282M41075O33359P44819L92437J65761J25885
3769.1H08045626L48627O92487N87881K73227O8248J30117K20358K45869L93450M60387
3789.5H11466277L28242n602l70384l45409l44336l18527N26250O56545L65913O87897
$$ y = [743817270, 747481525, 750468731, 753102779, 755326927, 757105052, 759188294, 761396110, 763085961, 765367806, 768430352, 771290600, 773666263, 775587082, 777085006, 778372765, 780205846, 782550633, 784648061, 786169231, 787207663, 788114190, 789307714, 790521502, 791186690, 791340888, 791887641, 793439031, 795053840, 796035290, 796508193, 796826482, 797271132, 797952712, 798811436, 799307644, 799101770, 798854411, 799606025, 801107466, 802225411, 802171290, 801382303, 801571667, 802098155, 802220166, 803155124, 804623008, 805542290, 805983365, 806616724, 807361543, 807753980, 807919741, 808045626, 808394253, 809086740, 809674621, 809947848, 810016096, 810146213, 810366571, 810612440, 811005890, 811466277, 811794519, 811788917, 811418533, 811073124, 810728788, 810410261, 810936511, 811593056, 811958969, 812646866]
3809.9H12646866N79119j49012o52432k59161j41144J8656P23481O08981K21789j4246
3830.3H13582897k05099j28270l05593n39004J29163P84695Q55327N90026O56r07898
3850.7H13856900j728952l13640J523137J175881J58846m75287k79427Q7678k02596
3869H13802540j85489M07457N82397L82423j81079l06785K07842J71661J02759Q7678
3889.4H15071404j49190J14619L46303j08182o32823n67734n7340N59748Q18014M97997
3909.8H15892816Q3506j05381k37644k23219M0471J19805n4299J0490J37985m471Q584
3932.3H15668643K38537K32995K8729j32739j58787m113P6354J2755N2452J54078J98126
3954.7H16367030J46389Q5473M5598R358L5941L9816J908L7133J02341J13130J25766
$$ y = [812646866, 813225985, 813076973, 812424541, 812165380, 812024236, 812042892, 812766373, 813375354, 813597143, 813582897, 813377798, 813249528, 812943935, 812404931, 812534094, 813318789, 814174116, 814764142, 814764798, 813856900, 812127948, 811814308, 813337445, 814513326, 814672172, 814196885, 813917458, 814005136, 813802540, 813617051, 814024508, 814606905, 814989328, 814808249, 814501464, 814709306, 814880967, 814983726, 815071404, 814922214, 815036833, 815383136, 815274954, 814642131, 814074397, 814017057, 814576805, 815394819, 815892816, 815976322, 815870941, 815633297, 815410078, 815450549, 815570354, 815516055, 815526545, 815664530, 815660059, 815668643, 815907180, 816140175, 816168904, 816036165, 815877378, 815873265, 815949619, 815962374, 816014826, 816168904, 816367030, 816513419, 816598892, 816644490, 816653848, 816689789, 816729605, 816731513, 816768646, 816870987, 816984117, 817109883]
3977.1H17109883J28925J56700K03550J03831l1590j9610L8922M3392N4538Q6308
3997.5H17874849
$$ y = [817109883, 817238808, 817395508, 817599058, 817702889, 817671299, 817651689, 817690611, 817734003, 817788541, 817874849]
##END=$$ End of the data block
