##TITLE=$$ Begin of the data block
##JCAMP-DX=5.00 $$ ACD/SpecManager v 10.08
##SPECTROMETER/DATA SYSTEM=Alpha
##DATE=10 Apr 2014 09:27:12
##DATA TYPE=INFRARED SPECTRUM
##DATA CLASS=XYDATA
##ORIGIN=
##OWNER=
##NPOINTS=1765
##FIRSTX=399.75695801
##LASTX=3997.56933594
##MAXX=3997.56933594
##MINX=399.75695801
##MAXY=0.87043881
##MINY=0.32436329
##XFACTOR=1.0000000000
##YFACTOR=1.000000000000000e-9
##FIRSTY=0.69201595
##DELTAX=2.03957629
##XUNITS=1/CM
##YUNITS=ARBITRARY UNITS
##XYDATA=(X++(Y..Y))
$$ plain form
399.8 692015946 687150002 684712172 685894251 684496582 679639995 678328574 680500865 679821730 676704168
418.1 676704168 676793814 677087665 673670530 671262443 673328161 674005806 670055211 668106735 670324266
436.5 670324266 669755220 666003823 665983975 668467820 666620135 663475096 664624095 665974975 663132489
454.8 663132489 661329627 663884580 663954496 660087883 658869803 661003232 660127640 656545341 656726658
473.2 656726658 658780336 656454861 652952790 654121816 656151235 653611600 651182294 653052449
489.5 653052449 653901100 650647581 649021506 650875032 650388598 646600664 645739615 647768259 646782875
507.9 646782875 643855572 644255638 645776927 643435299 640388310 641461134 642631173 639914274 637326777
526.2 637326777 638198614 638238192 635143816 633437932 634792387 634521902 631727636 631115198 632892489
$$ packed form
399.8F92015946m865944k437830J182079j397669m856587j311421K172291o79135l117562
418.1F76704168Q9646K93851l417135k408087K065718O77645l950595j948476K217531
436.5F70324266n69046l751397j9848K483845j847685l145039J148999J350880k842486
454.8F63132489j802862K554953O9916l866613j218080K133429q75592l582299J81317
473.2F56726658K053678k325475l502071J169026K029419k539635k429306J870155
489.5F53052449Q48651l253519j626075J853526m86434l787934q61049K028644r85384
507.9F46782875k927303M00066J521289k341628l046989J072824J170039k716899k587497
526.2F37326777Q71837L9578l094376j705884J354455k70485k794266o12438J777291
$$ plain form
544.6 632892489 632277787 629620731 629516423 630864263 629438221 626978219 627272129 627966166 625693083
562.9 625693083 623284757 623526752 623090327 619833231 617462695 617668271 616811872 613704622 612029612
581.3 612029612 612474918 611451626 608956039 608437359 609565020 609226346 608234823 609421313 611411572
599.6 611411572 611369252 610641241 611644268 612957716 612484157 611601412 611940086 612165809 611733139 612888932
620 612888932 616077006 618980825 620941043 623754919 627509654 630246043 632001460 634671628 637745202
638.4 637745202 639145672 639357269 640301287 641911030 643043876 643933833 644886792 645080149 645126522
656.7 645126522 647176862 650951803 654022574 655509233 656860411 659828424 662593365 664760411
673.1 664760411 667488813 670278013 672353625 674298167 676623046 678635359 680019498 681533158
$$ packed form
544.6F32892489o14702k657056j04308J347840j426042k460002K93910O94037k273083
562.9F25693083k408326K41995m36425l257096k370536K05576q56399l107250j675010
581.3F12029612M45306j023292k495587n18680J127661l38674r91523J186490J990259
599.6F11411572m2320p28011J003027J313448m73559q82745L38674K25723m32670J155793
620F12888932L188074K903819J960218K813876L754735K736389J755417K670168L073574
638.4F37745202J400470K11597R44018J609743J132846Q89957R52959J93357M6373
656.7F45126522K050340L774941L070771J486659J351178K968013K764941K167046
673.1F64760411K728402K789200K075612J944542K324879K012313J384139J513660
$$ plain form
689.4 681533158 683238328 684284210 684859276 685836732 686985433 687700450 688585341 690344334 692251801
707.7 692251801 693593681 695147038 697420061 699341595 700510561 702235579 704839528 706923842
724 706923842 708353162 710351586 712765694 714379668 715516627 717359662 719343901 720277369 721052587
742.4 721052587 722983479 725032628 726066291 727312267 729782045 732022762 733049273 734400213
758.7 734400213 736797571 738456786 738772094 739605904 741199315 741573930 740650058 740314364 740457475
777.1 740457475 739221036 736993909 735787451 735290706 733997226 733005166 734323978 737148583 739847064
795.4 739847064 743432105 749099910 755061686 759431303 763324499 767883182 771487296 773144841
811.7 773144841 774605274 776577175 777198493 775920033 774553657 773342431 770339966 765589893 761351526
$$ packed form
689.4F81533158J705170J045882N75066R77456J148701P15017Q84891J758993J907467
707.7F92251801J341880J553357K273023J921534J168966J725018K603949K084314
724G06923842J429320J998424K414108J613974J136959J843035J984239R33468P75218
742.4G21052587J930892K049149J033663J245976K469778K240717J026511J350940
758.7G34400213K397358J659215L15308Q33810J593411L74615r23872l35694J43111
777.1G40457475j236439k227127j206458m96745j293480r92060J318812K824605K698481
795.4G39847064L585041N667805N961776M369617L893196M558683L604114J657545
811.7G73144841J460433J971901O21318j278460j366376j211226l002465m750073m238367
$$ plain form
830.1 761351526 757842898 753443956 748625219 745238602 742822528 739628911 736244977 734625936
846.4 734625936 734809518 735928357 738910496 744959533 752829731 760675490 768832028 777794302 785960913
864.8 785960913 792079628 797199667 802025080 805400252 807049096 808463633 809997678 810208142 808844447
883.1 808844447 807339728 805951357 803658843 800784945 798742473 797706544 796987891 796950221 798273981
901.5 798273981 800216556 801662326 802697361 803703249 804071307 803116202 801249981 799001276 796160698
919.8 796160698 792839587 789998710 788250268 787359178 787157178 787625134 788284659 788646877 788806677
938.2 788806677 788990974 789095342 788998723 788750470 788202643 786979437 784935296 782105565 778212488
956.6 778212488 772942603 766487718 758976102 749994874 739401102 727724314 715488076 703119457
$$ packed form
830.1G61351526l508628m398942m818737l386617k416074l193617l383934j619041
846.4G34625936J83582J118839K982139O049037P870198P845759Q156538Q962274Q166611
864.8G85960913O118715N120039M825413L375172J648844J414537J534045K10464j363695
883.1H08844447j504719j388371k292514k873898k042472j035929p18653l7670J323760
901.5G98273981J942575J445770J035035J005888L68058r55105j866221k248705k840578
919.8G96160698l321111k840877j748442q91090k02000M67956O59525L62218J59800
938.2G88806677J84297J04368r6619k48253n47827j223206k044141k829731l893077
956.6G78212488n269885o454885p511616q981228j0593772j1676788j2236238j2368619
$$ plain form
972.9 703119457 691498339 681636810 673632860 666808307 660917580 656134844 652080238 648116529
989.2 648116529 644481242 641741753 639532864 637244344 635168850 633686185 632142007 629701495
1005.5 629701495 626428366 622521758 617532790 611349761 604864001 598744154 592669725 586501598
1021.8 586501598 580865681 575954914 571157277 566376090 562399805 559482574 556970716 554707468
1038.1 554707468 553232670 552351415 551173925 549563885 548119545 546883881 545459747 544411123
1054.5 544411123 544943094 547149956 550055504 553169012 556399524 558931053 559917808 559933066 560124218
1072.8 560124218 560480773 560518682 560662806 561369777 561878085 561340272 560105145 558797836 557404280
1091.2 557404280 556233883 556491792 558737099 562018096 565420747 569123685 573160708 576711655
$$ packed form
972.9G03119457j1621118r861529q003950o824553n890727m782736m054606l963709
989.2F48116529l635287k739489k208889k288520k075494j482665j544178k440512
1005.5F29701495l273129l906608m988968o183029o485760o119847o074429o168127
1021.8E86501598n635917m910767m797637m781187l976285k917231k511858k263248
1038.1E54707468j474798q81255j177490j610040j444340j235664j424134j048624
1054.5E44411123N31971K206862K905548L113508L230512K531529R86755J5258J91152
1072.8E60124218L56555L7909J44124P06971N08308n37813j235127j307309j393556
1091.2E57404280j170397K57909K245307L280997L402651L702938M037023L550947
$$ plain form
1107.5 576711655 579471231 582217395 585143745 587213516 587755263 587022483 585277677 583228290 582571924
1125.8 582571924 584359825 587723553 590673447 592345357 594006658 596765637 600114703 603471279
1142.2 603471279 606818259 609610200 611195683 612158835 613566518 615434349 617370844 619936585
1158.5 619936585 623911440 629121482 635183394 642487049 651252270 660448611 669038177 677271903
1174.8 677271903 685437799 692791164 698769987 703824520 708037734 710332036 710067928 707890332
1191.1 707890332 704358280 699419081 693654776 688480794 684629261 681638539 679059982 676872313
1207.4 676872313 674603879 671437562 667377532 663128734 658926904 654580653 650359035 646822810
1223.7 646822810 643972337 641452849 639403045 638214588 637712419 637458682 637494862 638011336 638714552
$$ packed form
1107.5E76711655K759576K746164K926350K069771N41747p32780j744806k049387o56366
1125.8E82571924J787901L363728K949894J671910J661301K758979L349066L356576
1142.2F03471279L346980K791941J585483R63152J407683J867831J936495K565741
1158.5F19936585L974855N210042O061912P303655Q765221R196341Q589566Q233726
1174.8F77271903Q165896P353365N978823N054533M213214K294302k64108k177596
1191.1G07890332l532052m939199n764305n173982l851533k990722k578557k187669
1207.4F76872313k268434l166317m060030m248798m201830m346251m221618l536225
1223.7F46822810k850473k519488k049804j188457n02169k53737L6180N16474P03216
$$ plain form
1242.1 638714552 639155447 639338136 639442503 639305711 638769031 638168037 637946904 638189733 638954639 640577793
1262.5 640577793 643273711 646819890 650877893 655432999 660521209 665851355 671138465 676415503
1278.8 676415503 681830704 687342703 692801654 698239207 703693092 708897054 713550389 717685878
1295.1 717685878 721448541 724743307 727493167 729911149 732210934 734362364 736254513 737954974
1311.4 737954974 739643574 741266727 742752612 744308949 746010661 747587621 748787999 749653101
1327.8 749653101 750296831 750596166 750375152 749768972 749197483 749019146 749136209 749330342 749662220 750082552
1348.1 750082552 750376701 750515282 750593066 750502944 749980569 748927593 747549951 746115565 744680464
1366.5 744680464 743458211 742520511 741317630 739693403 738137901 736579657 734486282 731796801
$$ packed form
1242.1F38714552M40895J82689J04367j36792n36680o00994k21133K42829P64906J623154
1262.5F40577793K695918L546179M058003M555106N088210N330146N287110N277038
1278.8F76415503N415201N511999N458951N437553N453885N203962M653335M135489
1295.1G17685878L762663L294766K749860K417982K299785K151430J892149J700461
1311.4G37954974J688600J623153J485885J556337J701712J576960J200378Q65102
1327.8G49653101O43730K99335k21014o06180n71489j78337J17063J94133L31878M20332
1348.1G50082552K94149J38581P7784r0122n22375j052976j377642j434386j435101
1366.5G44680464j222253r37700j202881j624227j555502j558244k093375k689481
$$ plain form
1382.8 731796801 729155779 727097690 725485206 723844051 721951604 719995618 718084574 715984762
1399.1 715984762 713842213 711581707 709073722 706762195 704744935 702892780 701185942 699529171
1415.5 699529171 698046625 697366714 697351277 697507560 697995484 698678017 699540019 700734675 702004790
1433.8 702004790 703714252 706276000 708677888 710781455 712691426 714362025 716242671 718428969
1450.1 718428969 720405102 722122371 725102007 730844498 736009955 739826441 744179606 749407232
1466.4 749407232 754028559 758334041 764224708 771199107 776962101 781139135 784090877 786173642
1482.8 786173642 787198424 787071407 786218286 785443783 784554958 782600224 779500782 776486278 773799241
1501.1 773799241 770647228 765684068 758635879 754077196 750882626 746960282 742577255 738624632
$$ packed form
1382.8G31796801k641022k058089j612484j641155j892447j955986j911044k099812
1399.1G15984762k142549k260506k507985k311527k017260j852155j706838j656771
1415.5F99529171j482546o79911j5437J56283M87924O82533Q62002J194656J270115
1433.8G02004790J709462K561748K401888K103567J909971J670599J880646K186298
1450.1G18428969J976133J717269K979636N742491N165457L816486M353165N227626
1466.4G49407232M621327M305482N890667O974399N762994M177034K951742K082765
1482.8G86173642J024782j27017q53121p74503q88825j954734l099442l014504k687037
1501.1G73799241l152013m963160p048189m558683l194570l922344m383027l952623
$$ plain form
1517.4 738624632 735510528 732621014 730413496 728777647 727057159 725333571 723389030 721481383
1533.7 721481383 720094383 718382716 716164351 715437651 715940416 716503024 717026472 717709541 718541205
1552.1 718541205 719172955 719399989 720014751 722250700 723624527 723727286 723081052 721434653 719029069
1570.5 719029069 716576993 713121176 707746506 702487648 697567403 691665828 684789896 677323461
1586.8 677323461 669628143 661714911 653455853 645018578 636928201 629105687 621083438 613097012
1603.1 613097012 605579674 598191082 590559423 583235562 576505840 569294989 561491966 555760622
1619.4 555760622 551108778 545912206 541077316 537108898 533914447 531342387 528912306 527362227
1635.7 527362227 527968049 529345572 530853331 532662213 535893619 540768266 544442892 548821688
$$ packed form
1517.4G38624632l114104k889514k207518j635849j720488j723588j944541j907647
1533.7G21481383j387000j711667k218365p26700N02765N62608N23448O83069Q31664
1552.1G18541205O31750K27034O14762K235949J373827J02759o46234j646399k405584
1570.5G19029069k452076l455817n374670n258858m920245n901575o875932p466435
1586.8F77323461p695318p913232q259058q437275q090377p822514q022249p986426
1603.1F13097012p517338p388592p631659p323861o729722p210851p803023n731344
1619.4E55760622m651844n196572m834890l968418l194451k572060k430081j550079
1635.7E27362227O05822J377523J507759J808882L231406M874647L674626M378796
$$ plain form
1652 548821688 557635009 564737260 569859684 575722992 583302140 591413260 598049104 605332136 614841163
1670.4 614841163 623373032 631776214 641414523 649834991 656759977 664396405 676054060 686871171
1686.7 686871171 694884896 702863455 710073531 717581689 726097584 735208571 746570349 755623460
1703 755623460 762334883 769340515 775589347 780389607 783803523 786603212 790321112 794189572 796694696
1721.4 796694696 798735917 801169515 803337514 804906845 806313813 808601201 811516106 813604414
1737.7 813604414 815817297 818697631 821440458 823883533 826647282 830256641 834156752 837247670
1754 837247670 839913249 842420161 844173968 845706582 847530842 848927557 849476576 849720895 850685954
1772.4 850685954 852310479 853454769 854186356 855087399 856014252 856630206 857226253 857780576 857881010
$$ packed form
1652E48821688Q813321P102251N122424N863308P579148Q111120O635844P283032R509027
1670.4F14841163Q531869Q403182R638309Q420468O924986P636428J1657655J0817111
1686.7F86871171Q013725P978559P210076P508158Q515895R110987J1361778R053111
1703G55623460O711423P005632O248832M800260L413916K799689L717900L868460K505124
1721.4G96694696K041221K433598K167999J569331J406968K287388K914905K088308
1737.7H13604414K212883K880334K742827K443075K763749L609359L900111L090918
1754H37247670K665579K506912J753807J532614J824260J396715N49019K44319R65059
1772.4H50685954J624525J144290P31587R01043R26853O15954N96047N54323J00434
$$ plain form
1790.7 857881010 858065426 858922660 859868467 860337734 860626161 861351609 862221122 862632096 862662375 862977207
1811.1 862977207 863653660 864114404 864341617 864752412 865109146 865047276 864937305 865079343 865352452 865866184
1831.5 865866184 866457820 866881013 867160380 867234170 867084920 867021441 867410123 867924631 868367136 868758857
1851.9 868758857 868933976 868963003 869088709 869312048 869402528 869276822 868985832 868782163 869046926 869577348
1872.3 869577348 869988084 870160818 870135665 870133817 870270848 870306730 870103240 869930685 870052755 870169044
1892.7 870169044 870112717 870221913 870438814 870426536 870296896 870316386 870321989 870135307 870059490 870224655 870200038
1915.1 870200038 869851649 869665921 869743586 869787157 869760275 869787157 869898021 869866192 869614005 869466007
1935.5 869466007 869491279 869272947 868775368 868598104 868765533 868685186 868351221 868206084 868206203 867981732
$$ packed form
1790.7H57881010J84416Q57234R45807M69267K88427P25448Q69513M10974L0279L14832
1811.1H62977207O76453M60744K27213M10795L56734o1870j09971J42038K73109N13732
1831.5H65866184N91636M23193K79367P3790j49250o3479L88682N14508M42505L91721
1851.9H68758857J75119K9027J25706K23339R0480j25706k90990k03669K64763N30422
1872.3H69577348M10736J72734k5153j848J37031L5882k03490j72555J22070J16289
1892.7H70169044n6327J09196K16901j2278j29640J9490N603j86682p5817J65165k4617
1915.1H70200038l48389j85728P7665M3571k6882K6882J10864l1829k52187j47998
1935.5H69466007K5272k18332m97579j77264J67429q0347l33965j45137J19k24471
$$ plain form
1955.9 867981732 867646754 867554009 867525101 867163539 866691470 866640210 866768658 866534948 866189539 866149247
1976.3 866149247 866138935 865805507 865473628 865479052 865448773 865042150 864630282 864612341 864653528 864398479 864175022
1998.8 864175022 864209473 864107013 863712430 863445222 863433301 863257587 862824082 862543046 862492025 862304926
2019.2 862304926 861946523 861790657 861819923 861639380 861313105 861230075 861258864 861027956 860704541 860641062
2039.6 860641062 860678256 860481441 860227168 860223651 860276580 860083103 859846056 859846771 859877169 859687030 859490633
2062 859490633 859529674 859593511 859465420 859353542 859462559 859541237 859386563 859288633 859413445 859459937 859317720
2084.4 859317720 859305024 859485149 859551549 859457672 859466374 859599411 859633267 859572887 859625578 859777927 859825253
2106.9 859825253 859781206 859836459 859962463 859983146 859961629 860046685 860162914 860208690 860252321 860368252 860500574
$$ packed form
1955.9H67981732l34978r2745k8908l61562m72069n1260J28448k33710l45409m0292
1976.3H66149247j0312l33428l31879N424l0279m06623m11868j7941M1187k55049k23457
1998.8H64175022L4451j02460l94583k67208j1921j75714m33505k81036n1021j87099
2019.2H62304926l58403j55866K9266j80543l26275q3030K8789k30908l23415o3479
2039.6H60641062L7194j96815k54273l517N2929j93477k37047P15L0398j90139j96397
2062H59490633L9041O3837j28091j11878J09017P8678j54674r7930J24812M6492j42217
2084.4H59317720j2696J80125O6400r3877Q702J33037L3856o0380N2691J52349M7326
2106.9H59825253m4047N5253J26004K0683k1517Q5056J16229M5776M3631J15931J32322
$$ plain form
2129.3 860500574 860572100 860636294 860773921 860928595 861023128 861091375 861213863 861372292 861508965 861622810
2149.7 861622810 861731648 861860394 862005115 862140954 862268507 862408280 862557709 862685263 862776339 862914681
2170.1 862914681 863150716 863366008 863489449 863618016 863825798 863999486 864043176 864110768 864292741 864392757
2190.5 864392757 864378989 864502072 864747047 864824474 864771605 864897370 865139842 865191221 865117013 865208507 865402281
2212.9 865402281 865420043 865345061 865457952 865649760 865632117 865556479 865736246 865963161 865889788 865759492
2233.3 865759492 865911484 866086483 865979910 865872324 866048276 866198421 866032422 865888953 866068244 866190076
2253.7 866190076 865981042 865867496 866076767 866190732 866030693 865987062 866187871 866217196 865998149 865990818
2274.1 865990818 866210520 866213918 866080523 866248727 866564035 866501331 866164982 866106510 866261005 866097689
$$ packed form
2129.3H60500574P1526O4194J37627J54674R4533O8247J22488J58429J36673J13845
2149.7H61622810J08838J28746J44721J35839J27553J39773J49429J27554R1076J38342
2170.1H62914681K36035K15292J23441J28567K07782J73688M3690O7592J81973J00016
2190.5H64392757j3768J23083K44975P7427n2869J25765K42472N1379p4208R1494J93774
2212.9H65402281J7762p4982J12891J91808j7643p5638J79767K26915p3373j30296
2233.3H65759492J51992J74999j06573j07586J75952J50145j65999j43469J79291J21832
2253.7H66190076k09034j13546K09271J13965j60039m3631K00809K9325k19047p331
2274.1H65990818K19702L398j33395J68204L15308o2704l36349n8472J54495j63316
$$ plain form
2294.5 866097689 865743458 865744412 865887880 865634680 865198433 865042806 864963114 864583910 864202440 864177048
2314.9 864177048 864057183 863401651 862723768 862585127 862548351 862105727 861697733 861747086 861732900 861301184
2335.3 861301184 861006975 861166894 861264884 861293137 862086654 863192320 863303304 862241983 860900462
2353.6 860900462 859974742 859174609 858573139 858762026 859570265 860326648 861053765 862175524 863482118
2372 863482118 864452124 865250826 866305053 867362976 867964208 868286252 868735075 869117618 869073808 868931413
2392.4 868931413 869120121 869334936 869195163 869032025 869180858 869291723 869101048 868969858 869117856 869189203
2412.8 869189203 868992925 868884385 869009137 868979454 868695736 868575633 868691981 868660152 868452787 868404925
2433.2 868404925 868480027 868363976 868123472 868079662 868158519 868039429 867828488 867828250 867884994 867735386 867570460
$$ packed form
2294.5H66097689l54231R54J43468k53200m36247j55627p9692l79204l81470k5392
2314.9H64177048j19865o55532o77883j38641l6776m42624m07994M9353j4186m31716
2335.3H61301184k94209J59919R7990K8253P93517J105666J10984j061321j341521
2353.6H60900462r25720q00133o01470J88887Q08239P56383P27117J121759J306594
2372H63482118R70006P98702J054227J057923O01232L22044M48823L82543m3810j42395
2392.4H68931413J88708K14815j39773j63138J48833J10865j90675j31190J47998P1347
2412.8H69189203j96278j08540J24752k9683k83718j20103J16348l1829k07365m7862
2433.2H68404925P5102j16051k40504m3810P8857j19090k10941k38N6744j49608j64926
$$ plain form
2455.6 867570460 867583454 867546618 867308915 867131054 867167950 867150962 866927862 866744637 866736054 866676748 866448343
2478.1 866448343 866281986 866272211 866192281 865997553 865897834 865872324 865719199 865510881 865434825 865398228 865234315
2500.5 865234315 865053952 864992857 864923537 864779532 864693761 864687026 864593506 864369690 864229381 864243925 864183009
2522.9 864183009 863998055 863910973 863913655 863782227 863543808 863416910 863377154 863228381 863050044 863030493
2543.3 863030493 863028586 862864733 862685025 862648129 862607718 862402856 862206638 862194479 862161100 861947358 861778557
2565.8 861778557 861756265 861620307 861322761 861175179 861197352 861027718 860640347 860416949 860394895 860242426
2586.2 860242426 859938383 859748006 859650373 859366715 858950734 858717263 858596146 858281434 857874811 857661486
2606.6 857661486 857504606 857118666 856674731 856479824 856323838 855908394 855477929 855318606 855149865 854676604
$$ packed form
2455.6H67570460J2994l6836k37703j77861L6896j6988k23100j83225q583n9306k28405
2478.1H66448343j66357r775p9930j94728r9719k5510j53125k08318p6056l6597j63913
2500.5H65234315j80363o1095o9320j44005q5771o735r3520k23816j40309J4544o0916
2522.9H64183009j84954q7082K682j31428k38419j26898l9756j48773j78337j9551
2543.3H63030493j907j63853j79708l6896m0411k04862j96218j2159l3379k13742j68801
2565.8H61778557k2292j35958k97546j47582K2173j69634l87371k23398k2054j52469
2586.2H60242426l04043j90377r7633k83658m15981k33471j21117l14712m06623k13325
2606.6H57661486j56880l85940m43935j94907j55986m15444m30465j59323j68741m73261
$$ plain form
2626.9 854676604 854214191 854058325 853893518 853464305 853102922 853000283 852775574 852277040 851899028 851779640
2647.3 851779640 851542771 851086915 850790501 850690603 850374877 849840224 849530756 849460721 849201977 848757386
2667.7 848757386 848507583 848398507 848064065 847595990 847379029 847275734 846849859 846265674 845991910 845859349
2688.1 845859349 845453084 844965637 844759941 844602048 844132006 843599617 843343079 843112469 842614591 842132628
2708.5 842132628 841910958 841639698 841115415 840642989 840418756 840146422 839649439 839248300 839059889 838701665
2728.9 838701665 838105261 837663472 837452650 837136626 836618781 836224735 836057365 835807920 835408032 835092008
2749.3 835092008 834816039 834338725 833763838 833377957 833087981 832613945 832044959 831615865 831219792 830678046
2769.7 830678046 830156922 829827249 829453528 828814328 828122497 827591360 827075481 826460004 825884581 825390220
$$ packed form
2626.9H54676604m62413j55866j64807m29213l61383j02639k24709m98534l78012j19388
2647.3H51779640k36869m55856k96414r9898l15726n34653l09468p0035k58744m44591
2667.7H48757386k49803j09076l34442m68075k16961j03295m25875n84185k73764j32561
2688.1H45859349m06265m87447k05696j57893m70042n32389k56538k30610m97878m81963
2708.5H42132628k21670k71260n24283m72426k24233k72334m96983m01139j88411l58224
2728.9H38701665n96404m41789k10822l16024n17845l94046j67370k49445l99888l16024
2749.3H35092008k75969m77314n74887l85881k89976m74036n68986m29094l96073n41746
2769.7H30678046n21124l29673l73721o39200o91831n31137n15879o15477n75423m94361
$$ plain form
2790.1 825390220 824784994 824010074 823287606 822677255 821945786 821059585 820224285 819489241 818711817 817785919
2810.5 817785919 816808403 815897703 814955056 813911736 812882125 811869681 810711741 809382558 808035791
2828.9 808035791 806711018 805221379 803449690 801446199 799041986 795850813 791619956 786222219
2845.2 786222219 780025244 774519801 771377206 770715773 771297276 772046089 772502780 772401452 771608531
2863.5 771608531 770190716 768276751 766159892 764244497 762607217 761113584 759818494 758740902
2879.9 758740902 757676780 756450355 755056918 753561974 751931071 750132680 748282075 746395946
2896.2 746395946 744377494 742270827 740160525 737953544 735409200 732316136 728453100 723478675
2912.5 723478675 717431664 711384952 706894934 704646349 704173028 704711795 705855668 707409620 709082901
$$ packed form
2790.1H25390220o05226p74920p22468o10351p31469q86201q35300p35044p77424r25898
2810.5H17785919r77516r10700r42647j043320j029611j012444j157940j329183j346767
2828.9H08035791j324773j489639j771689k003491k404213l191173m230857n397737
2845.2G86222219o196975n505443l142595o61433N81503P48813M56691j01328p92921
2863.5G71608531j417815j913965k116859j915395j637280j493633j295090j077592
2879.9G58740902j064122j226425j393437j494944j630903j798391j850605j886129
2896.2G46395946k018452k106667k110302k206981k544344l093064l863036m974425
2912.5G23478675o047011o046712m490018k248585m73321N38767J143873J553952J673281
$$ plain form
2930.8 709082901 710818350 712887466 715350389 717985213 720665038 723304033 725564837 727034867
2947.2 727034867 727714121 727977872 727987289 727761269 727639496 728002489 728872478 730006874 731265962 732715368
2967.6 732715368 734349012 736049592 737687767 739199281 740652144 742016494 743165910 744209588
2983.9 744209588 745323420 746435165 747497261 748529315 749341846 749825120 750039399 750029385 749818146
3002.2 749818146 749356568 748750210 748283029 747957468 747512817 746887982 746195555 745403707 744414032 743360877
3022.6 743360877 742379189 741272330 739978194 738766968 737706602 736470103 734905064 733373880
3038.9 733373880 732081771 730724037 729075849 727314711 725680172 724079907 722351730 720635235
3055.3 720635235 719021201 717365980 715668499 714127362 712761223 711314619 709670722 708038747
$$ packed form
2930.8G09082901J735449K069116K462923K634824K679825K638995K260804J470030
2947.2G27034867O79254K63751R417k26020j21773L62993Q69989J134396J259088J449406
2967.6G32715368J633644J700580J638175J511514J452863J364350J149416J043678
2983.9G44209588J113832J111745J062096J032054Q12531M83274K14279j0014k11239
3002.2G49818146m61578o06358m67181l25561m44651o24835o92427p91848r89675j053155
3022.6G43360877r81688j106859j294136j211226j060366j236499j565039j531184
3038.9G33373880j292109j357734j648188j761138j634539j600265j728177j716495
3055.3G20635235j614034j655221j697481j541137j366139j446604j643897j631975
$$ plain form
3071.6 708038747 706560552 705171108 703811049 702393293 700856090 699221790 697531521 695900679
3087.9 695900679 694314301 692555726 690665781 688928068 687334120 685600817 683660448 681744158
3104.2 681744158 679956317 678136885 676157236 674158156 672280371 670380533 668341935 666124344
3120.5 666124344 663676918 661160588 658805490 656583607 654227078 651666522 649197161 646938086
3136.8 646938086 644597888 641939461 639148653 636454046 633768797 631087184 628496826 625784755
3153.2 625784755 622744679 619580686 616554141 613636732 610678077 607635498 604559779 601478279
3169.5 601478279 598398566 595311344 592190802 589044869 585897803 582753539 579633951 576526821
3185.8 576526821 573392272 570254445 567124069 563959539 560741246 557532966 554415226 551363111
$$ packed form
3071.6G08038747j478195j389444j360059j417756j537203j634300j690269j630842
3087.9F95900679j586378j758575j889945j737713j593948j733303j940369j916290
3104.2F81744158j787841j819432j979649j999080j877785j899838k038598k217591
3120.5F66124344k447426k516330k355098k221883k356529k560556k469361k259075
3136.8F46938086k340198k658427k790808k694607k685249k681613k590358k712071
3153.2F25784755l040076l163993l026545k917409k958655l042579l075719l081500
3169.5F01478279l079713l087222l120542l145933l147066l144264l119588l107130
3185.8E76526821l134549l137827l130376l164530l218293l208280l117740l052115
$$ plain form
3202.1 551363111 548277974 545159996 542080462 539069653 536120653 533189058 530227244 527248442
3218.4 527248442 524316311 521414399 518511593 515639126 512830079 510125220 507474184 504736483
3234.7 504736483 501942694 499233812 496610343 494045377 491568506 489135981 486649722 484164655
3251.1 484164655 481788695 479489386 477181643 474844724 472537994 470283031 468061149 465892255
3267.4 465892255 463794351 461683124 459461123 457165718 454878598 452649534 450486392 448337168
3283.7 448337168 446178168 444063395 442039520 440032959 437915862 435690224 433397293 431097776
3300 431097776 428908557 426811904 424667716 422336847 419814914 417256236 414770007 412331223 409885973
3318.4 409885973 407451272 405082643 402738839 400266081 397656083 395054638 392495692 390032053
$$ packed form
3202.1E51363111l085137l117978l079534l010809k949000k931595k961814k978802
3218.4E27248442k932131k901912k902806k872467k809047k704859k651036k737701
3234.7E04736483k793789k708882k623469k564966k476871k432525k486259k485067
3251.1D84164655k375960k299309k307743k336919k306730k254963k221882k168894
3267.4D65892255k097904k111227k222001k295405k287120k229064k163142k149224
3283.7D48337168k159000k114773k023875k006561k117097k225638k292931k299517
3300D31097776k189219k096653k144188k330869k521933k558678k486229k438784k445250
3318.4D09885973k434701k368629k343804k472758k609998k601445k558946k463639
$$ plain form
3334.7 390032053 387723118 385375112 382831097 380194873 377527803 374918550 372521847 370150268
3351 370150268 367560208 364880741 362338185 359974563 357650936 355345041 353258997 351344734 349271894
3369.3 349271894 346897125 344491661 342420787 340650767 338956356 337232143 335594535 334241062
3385.7 334241062 333236605 332552373 331870943 330814123 329649866 328968495 328681022 328104407 327080578
3404 327080578 326202303 325750500 325504333 325289369 324970216 324569404 324363291 324424297 324611485 324968249
3424.4 324968249 325599760 326458365 327315778 328145772 329102159 330008417 330639362 331278205 332282692
3442.8 332282692 333633304 335215092 336834788 338428646 340126544 341978222 343998373 346159846
3459.1 346159846 348256141 350368083 352868140 355585814 357946455 359832078 361764401 364078909
$$ packed form
3334.7C90032053k308935k348006k544015k636224k667070k609253k396703k371579
3351C70150268k590060k679467k542556k363622k323627k305895k086044j914263k072840
3369.3C49271894k374769k405464k070874j770020j694411j724213j637608j353473
3385.7C34241062j004457o84232o81430j056820j164257o81371k87473n76615j023829
3404C27080578q78275m51803k46167k14964l19153m00812k06113O1006J87188L56764
3424.4C24968249O31511Q58605Q57413Q29994R56387R06258O30945O38843J004487
3442.8C32282692J350612J581788J619696J593858J697898J851678K020151K161473
3459.1C46159846K096295K111942K500057K717674K360641J885623J932323K314508
$$ plain form
3475.4 364078909 366722196 369430870 371892363 374291390 376959443 379700303 382325321 385056764
3491.7 385056764 388005942 391069680 393991888 396766454 399692744 402638406 405316144 408056766
3508 408056766 411250174 414786190 418206185 421281815 424323320 427618712 431254148 434864581 438147515
3526.4 438147515 441539824 445287317 449150592 453147203 457223326 461080283 464926511 469039083
3542.7 469039083 473365307 477585465 481538832 485598594 490001380 494442850 498847753 503476620
3559 503476620 508117735 512256086 516354322 521861613 528090537 533438921 538367569 543600559 549123824
3577.4 549123824 554842591 560631096 566112518 571510315 577635288 584131777 590048671 595907569
3593.7 595907569 602226377 608747840 615315616 621786118 627834857 633588731 639792621 646348000
$$ packed form
3475.4C64078909K643287K708674K461493K399027K668053K740860K625018K731443
3491.7C85056764K949178L063738K922208K774566K926290K945662K677738K740622
3508D08056766L193408L536016L419995L075630L041505L295392L635436L610433L282934
3526.4D38147515L392309L747493L863275L996611M076123L856957L846228M112572
3542.7D69039083M326224M220158L953367M059762M402786M441470M404903M628867
3559E03476620M641115M138351M098236N507291O228924N348384M928648N232990N523265
3577.4E49123824N718767N788505N481422N397797O124973O496489N916894N858898
3593.7E95907569O318808O521463O567776O470502O048739N753874O203890O555379
$$ plain form
3610 646348000 652815640 659304619 665467620 671856582 679211855 685989499 691230237 695773482 701730490
3628.4 701730490 709267557 715687811 721330464 726841986 732143521 737258732 741871655 745646298
3644.7 745646298 749051332 753768206 759834051 764719307 768590927 772889018 777265728 780851662
3661 780851662 783762932 786149621 787963569 789756954 792126060 794240057 796266794 799150765 802132010
3679.4 802132010 804622650 806577861 808002770 809224308 810710430 812584937 814556062 816215098
3695.7 816215098 817316353 818055212 818976045 820193052 821124971 821425140 821478963 822231054 823717594
3714 823717594 824976087 825658441 825896740 825980186 826264322 826932132 827645123 827741086 827196002 827034116
3734.4 827034116 828183293 829663098 830237985 829807162 829303324 829565585 829722106 829915047 831119895
$$ packed form
3610F46348000O467640O488979O163001O388962P355273O777644N240738M543245N957008
3628.4G01730490P537067O420254N642653N511522N301535N115211M612923L774643
3644.7G45646298L405034M716874O065845M885256L871620M298091M376710L585934
3661G80851662K911270K386689J813948J793385K369106K113997K026737K883971K981245
3679.4H02132010K490640J955211J424909J221538J486122J874507J971125J659036
3695.7H16215098J101255P38859R20833J217007R31919L00169N3823P52091J486540
3714H23717594J258493O82354K38299Q3446K84136O67810P12991R5963n45084j61886
3734.4H27034116J149177J479805N74887m30823n03838K62261J56521J92941J204848
$$ plain form
3752.8 831119895 832419336 833017468 833359241 833953738 834453702 834593952 834679544 834949136 835477889 836079955
3773.2 836079955 836390138 836454690 836533129 836742401 836959958 837175131 837555826 837970078 838085353 837757945
3793.6 837757945 837225795 836829364 836434305 836229801 836675644 837170064 837643743 838265836 838534653 838160872
3814 838160872 837457955 837015033 836777925 837047338 837813318 838339746 838546753 838523746 838276982 837950647
3834.4 837950647 837524652 837141216 837325037 838029623 838870168 839367270 839072168 837871611 836435974
3852.7 836435974 836665809 838018179 838823795 838765562 838195503 837928534 838007510 837824404 837754548 838160694
3873.1 838160694 838649035 838867187 838612974 838356376 838496029 838730216 838896632 838830888 838707209 838958085
3893.5 838958085 839143038 838694811 837847531 837269545 837401748 838218689 839080989 839475453 839477777 839259684
$$ packed form
3752.8H31119895J299441N98132L41773N94497M99964J40250Q5592K69592N28753O02066
3773.2H36079955L10183O4552P8439K09272K17557K15173L80695M14252J15275l27408
3793.6H37757945n32150l96431l95059k04504M45843M94420M73679O22093K68817l73781
3814H38160872p02917m42922k37108K69413P65980N26428K07007k3007k46764l26335
3834.4H37950647m25995l83436J83821P04586Q40545M97102k95102j200557j435637
3852.7H36435974K29835J352370Q05616n8233n70059k66969P8976j83106o9856M06146
3873.1H38160694M88341K18152k54213k56598J39653K34187J66416o5744j23679K50876
3893.5H38958085J84953m48227q47280n77986J32203Q16941Q62300L94464K324k18093
$$ plain form
3913.9 839259684 838935435 838778019 838844121 838916123 838971496 839102507 839175820 839098334 839111090 839330256 839470863
3936.3 839470863 839401484 839263499 839192808 839244664 839277804 839210689 839220107 839354753 839497089 839620113 839697361
3958.8 839697361 839688003 839655817 839631259 839613855 839638472 839692950 839758456 839858651 839950085 839962065 840023696
3981.2 840023696 840213895 840317488 840238988 840155244 840166748 840234637 840341508 840438008
3997.5 840438008
$$ packed form
3913.9H39259684l24249j57416O6102P2002N5373J31011P3313p7486J2756K19166J40607
3936.3H39470863o9379j37985p0691N1856L3140o7115R418J34646J42336J23024P7248
3958.8H39697361r358l2186k4558j7404K4617N4478O5506J00195R1434J1980O1631
3981.2H40023696J90199J03593p8500q3744J1504O7889J06871R6500
3997.5H40438008
##END=$$ End of the data block
