##TITLE=$$ Begin of the data block
##JCAMP-DX=5.00 $$ ACD/SpecManager v 10.08
##SPECTROMETER/DATA SYSTEM=Alpha
##DATE=10 Apr 2014 09:27:12
##DATA TYPE=INFRARED SPECTRUM
##DATA CLASS=XYDATA
##ORIGIN=
##OWNER=
##NPOINTS=1765
##FIRSTX=399.75695801
##LASTX=3997.56933594
##MAXX=3997.56933594
##MINX=399.75695801
##MAXY=0.87055302
##MINY=0.32444933
##XFACTOR=1.0000000000
##YFACTOR=1.000000000000000e-9
##FIRSTY=0.69188011
##DELTAX=2.03957629
##XUNITS=1/CM
##YUNITS=ARBITRARY UNITS
##XYDATA=(X++(Y..Y))
$$ plain form
399.8 691880107 687330723 684717834 685652435 684350312 679583013 678151608 680332482 679882109 676897049
418.1 676897049 677009642 677383244 673810780 671114862 673038542 673739135 670007169 668361247 670606554
436.5 670606554 669705808 665824175 666108668 668815136 666895270 663668990 664867282 666270435 663288951
454.8 663288951 661048174 663166761 663208187 659658313 658869445 661159515 660090387 656346083 656439185
473.2 656439185 658325493 656025112 652736962 653901637 655802011 653302073 650958478 652901113
489.5 652901113 653847277 650615156 648959875 650762439 650257945 646564424 645839870 648069918 647186339
507.9 647186339 644066811 644217908 645630598 643317640 640377641 641453743 642475903 639619827 637040019
526.2 637040019 638043761 638123810 634994864 633341074 634713292 634334505 631417453 630733430 632479429
$$ packed form
399.8F91880107m549384k612889R34601j302123m767299j431405K180874m50373k985060
418.1F76897049J12593L73602l572464k695918J923680P00593l731966j645922K245307
436.5F70606554r00746l881633K84493K706468j919866l226280J198292J403153k981484
454.8F63288951k240777K118587M1426l549874p88868K290070j069128l744304R3102
473.2F56439185J886308k300381l288150J164675J900374k499938k343595J942635
489.5F52901113R46164l232121j655281J802564n04494l693521p24554K230048q83579
507.9F47186339l119528J51097J412690k312958k939999J076102J022160k856076k579808
526.2F37040019J003742Q0049l128946j653790J372218l78787k917052o84023J745999
$$ plain form
544.6 632479429 631841779 629102767 628970444 630472481 629152596 626590908 626824141 627643645 625428081
562.9 625428081 622884333 623045266 622736156 619572997 617051244 617070198 616283953 613409102 611784995
581.3 611784995 612110138 611124456 608824313 608392835 609500527 609206617 608228862 609204054 610900640
599.6 610900640 610805035 610281885 611449182 612726986 612252772 611554921 612046599 612276435 611751437 612814724
620 612814724 616030872 618956983 620841205 623672843 627525508 630282223 632008195 634624064 637628317
638.4 637628317 639046907 639369130 640380085 642065942 643359721 644262373 645038128 645139992 645199656
656.7 645199656 647113144 650712550 653871536 655551672 656993032 659975231 662766457 664927304
673.1 664927304 667589247 670351684 672450423 674412429 676723540 678653479 679966629 681531966
$$ packed form
544.6F32479429o37650k739012j32323J502037j319885k561688K33233Q19504k215564
562.9F25428081k543748J60933l09110l163159k521753J8954p86245k874851j624107
581.3F11784995L25143r85682k300143m31478J107692k93910r77755R75192J696586
599.6F10900640r5605n23150J167297J277804m74214o97851M91678K29836n24998J063287
620F12814724L216148K926111J884222K831638L852665K756715J725972K615869L004253
638.4F37628317J418590L22223J010955J685857J293779R02652P75755J01864N9664
656.7F45199656J913488L599406L158986J680136J441360K982199K791226K160847
673.1F64927304K661943K762437K098739J962006K311111J929939J313150J565337
$$ plain form
689.4 681531966 683327675 684405327 684989214 685949385 687040806 687734365 688653350 690391719 692222476
707.7 692222476 693586767 695280015 697649837 699549198 700637817 702318013 704947054 707014382
724 707014382 708373785 710383773 712876260 714519858 715646446 717476249 719408691 720304251 721097291
742.4 721097291 723039448 725063503 726094484 727383196 729850173 732059121 733084381 734461606
758.7 734461606 736903548 738547504 738803446 739634395 741275430 741688788 740780711 740469456 740630686
777.1 740630686 739365399 737081647 735819280 735307038 734070301 733134627 734472632 737332046 740029812
795.4 740029812 743539453 749127865 755022287 759384453 763355970 767971694 771589935 773229897
811.7 773229897 774655938 776656032 777312040 776003838 774592996 773351908 770347595 765619159 761406302
$$ packed form
689.4F81531966J795709J077652N83887R60171J091421O93559R18985J738369J830757
707.7F92222476J364291J693248K369822J899361J088619J680196K629041K067328
724G07014382J359403K009988K492487J643598J126588J829803J932442Q95560P93040
742.4G21097291J942157K024055J030981J288712K466977K208948J025260J377225
758.7G34461606K441942J643956K55942Q30949J641035M13358r08077l11255J61230
777.1G40630686j265287k283752j262367n12242j236737r35674J338005K859414K697766
795.4G40029812L509641N588412N894422M362166L971517M615724L618241J639962
811.7G73229897J426041K000094O56008j308202j410842j241088l004313m728436m212857
$$ plain form
830.1 761406302 757927299 753558517 748771906 745400429 742939591 739686787 736330092 734792948
846.4 734792948 735025942 736188769 739223659 745259881 753101766 760988951 769167125 778081775 786151052
864.8 786151052 792149186 797216475 802045763 805407405 807054698 808519661 810111046 810343564 808984995
883.1 808984995 807470441 806060791 803753912 800858855 798806846 797822118 797180533 797176540 798497677
901.5 798497677 800398886 801775455 802785099 803785920 804122150 803118050 801219463 799014390 796271384
919.8 796271384 793013394 790152907 788325369 787388027 787206829 787690341 788345933 788711786 788869500
938.2 788869500 789053440 789142370 789002717 788765907 788271844 787016571 784882724 782019019 778142810
956.6 778142810 772892952 766442299 758927047 749963105 739379108 727688134 715475857 703156054
$$ packed form
830.1G61406302l479003m368782m786611l371477k460838l252804l356695j537144
846.4G34792948K32994J162827L034890O036222P841885P887185Q178174Q914650Q069277
864.8G86151052N998134N067289M829288L361642J647293J464963J591385K32518j358569
883.1H08984995j514554j409650k306879k895057k052009r84728o41585l993J321137
901.5G98497677J901209J376569J009644J000821L36230j004100j898587k205073k743006
919.8G96271384l257990k860487j827538r37342j81198M83512O55592L65853J57714
938.2G88869500J83940Q8930j39653k36810m94063j255273k133847k863705l876209
956.6G78142810n249858o450653p515252q963942j0583997j1690974j2212277j2319803
$$ plain form
972.9 703156054 691550612 681689441 673732936 666970313 661071658 656248510 652176261 648210108
989.2 648210108 644565821 641797304 639544725 637209952 635094404 633582413 632024944 629561484
1005.5 629561484 626257002 622375071 617439091 611240387 604711890 598640442 592674017 586540997
1021.8 586540997 580896020 576014996 571217418 566384673 562368929 559449255 556984305 554804683
1038.1 554804683 553400457 552546024 551344037 549666405 548177660 546945453 545537531 544525862
1054.5 544525862 545096278 547300875 550188541 553291917 556499600 558999658 559980690 560017407 560240686
1072.8 560240686 560628951 560673535 560790241 561454892 561957359 561460853 560269713 558983088 557562411
1091.2 557562411 556363344 556664526 558970928 562257051 565627694 569286525 573266983 576787293
$$ packed form
972.9G03156054j1605442r861171p956505o762623n898655m823148m072249l966153
989.2F48210108l644287k768517k252579k334773k115548j511991j557469k463460
1005.5F29561484l304482l881931m935980o198704o528497o071448n966425o133020
1021.8E86540997n644977m881024m797578m832745m015744k919674k464950k179622
1038.1E54804683j404226q54433j201987j677632j488745j232207j407922j011669
1054.5E44525862N70416K204597K887666L103376L207683K500058R81032L6717K23279
1072.8E60240686L88265M4584J16706O64651N02467m96506j191140j286625j420677
1091.2E57562411j199067L01182K306402L286123L370643L658831L980458L520310
$$ plain form
1107.5 576787293 579573750 582355022 585280538 587351203 587897956 587142944 585364938 583290815 582616568
1125.8 582616568 584396124 587782025 590722144 592310250 593943715 596767008 600155294 603495419
1142.2 603495419 606799901 609553039 611162901 612212241 613697171 615600586 617505312 619960845
1158.5 619960845 623846829 629062951 635182977 642534018 651279867 660417736 668981135 677203178
1174.8 677203178 685369968 692763388 698766649 703792930 707962751 710228086 709958494 707790256
1191.1 707790256 704263330 699328840 693580806 688429117 684590697 681595325 679014266 676847219
1207.4 676847219 674598277 671443343 667391896 663141310 658954918 654634655 650403917 646826506
1223.7 646826506 643938303 641419709 639392793 638192832 637674749 637461841 637565970 638123810 638821363
$$ packed form
1107.5E76787293K786457K781272K925516K070665N46753p55012j778006k074123o74247
1125.8E82616568J779556L385901K940119J588106J633465K823293L388286L340125
1142.2F03495419L304482K753138J609862J049340J484930J903415J904726K455533
1158.5F19960845L885984N216122O120026P351041Q745849R137869Q563399Q222043
1174.8F77203178Q166790P393420O003261N026281M169821K265335k69592k168238
1191.1G07790256l526926m934490n748034n151689l838420k995372k581059k167047
1207.4F76847219k248942l154934m051447m250586m186392m320263m230738l577411
1223.7F46826506k888203k518594k026916j199961n18083k12908J04129N57840O97553
$$ plain form
1242.1 638821363 639231205 639404535 639519691 639374852 638818026 638211071 637978137 638201058 638959765 640576303
1262.5 640576303 643249452 646775484 650851965 655446768 660542190 665839493 671082616 676346660
1278.8 676346660 681783020 687301278 692743897 698173642 703626215 708818734 713472366 717627466
1295.1 717627466 721400440 724715114 727498591 729922771 732209206 734356940 736252725 737950087
1311.4 737950087 739635348 741263032 742754042 744311571 746004522 747583151 748822391 749721348
1327.8 749721348 750347912 750612974 750382841 749789119 749220848 749033928 749155223 749352872 749681056 750111520
1348.1 750111520 750418723 750544250 750607550 750534594 750036061 748988867 747614145 746191502 744747162
1366.5 744747162 743500233 742568851 741400778 739803016 738231421 736624599 734515667 731853604
$$ packed form
1242.1F38821363M09842J73330J15156j44839n56826o06955k32934K22921P58707J616538
1262.5F40576303K673149L526032M076481M594803N095422N297303N243123N264044
1278.8F76346660N436360N518258N442619N429745N452573N192519M653632M155100
1295.1G17627466L772974L314674K783477K424180K286435K147734J895785J697362
1311.4G37950087J685261J627684J491010J557529J692951J578629J239240Q98957
1327.8G49721348O26564K65062k30133n93722n68271j86920J21295J97649L28184M30464
1348.1G50111520L07203J25527O3300p2956m98533j047194j374722j422643j444340
1366.5G44747162j246929r31382j168073j597762j571595j606822k108932k662063
$$ plain form
1382.8 731853604 729223073 727136135 725494385 723859191 721985042 720020354 718088865 715994775
1399.1 715994775 713865042 711596906 709075570 706763744 704771459 702962160 701258361 699552000
1415.5 699552000 698028624 697355509 697358608 697521031 698026061 698736250 699615538 700802386 702029228
1433.8 702029228 703692675 706243753 708653629 710758269 712633908 714247286 716086984 718262851
1450.1 718262851 720253348 721954465 724853933 730625212 735927343 739806056 744154572 749376357
1466.4 749376357 753995776 758266449 764085829 771029115 776838601 781086445 784087420 786192596
1482.8 786192596 787194908 787001908 786121011 785395265 784536839 782539010 779380560 776383400 773744762
1501.1 773744762 770610452 765609741 758497000 753951967 750783920 746870399 742484570 738506138
$$ packed form
1382.8G31853604k630531k086938j641750j635194j874149j964688j931489k094090
1399.1G15994775k129733k268136k521336k311826j992285j809299j703799j706361
1415.5F99552000j523376o73115L099J62423N05030P10189Q79288J186848J226842
1433.8G02029228J663447K551078K409876K104640J875639J613378J839698K175867
1450.1G18262851J990497J701117K899468N771279N302131L878713M348516N221785
1466.4G49376357M619419M270673N819380O943286N809486M247844L000975K105176
1482.8G86192596J002312j93000q80897p25746q58426j997829l158450k997160k638638
1501.1G73744762l134310n000711p112741m545033l168047l913521m385829l978432
$$ plain form
1517.4 738506138 735388279 732563198 730426848 728809714 727096379 725398421 723481357 721602440
1533.7 721602440 720242977 718518138 716227055 715495944 716082335 716698408 717234254 717928946 718776762
1552.1 718776762 719408512 719600856 720156312 722397685 723812580 723936021 723268211 721568286 719159007
1570.5 719159007 716732979 713244379 707827449 702617347 697763979 691879153 684980929 677503467
1586.8 677503467 669813573 661889493 653599918 645126104 637012661 629174113 621128380 613128901
1603.1 613128901 605614901 598226547 590586424 583248258 576489389 569248497 561455667 555762351
1619.4 555762351 551131904 545925796 541074514 537108660 533915699 531337380 528912187 527346373
1635.7 527346373 527929246 529341459 530898094 532726347 535931587 540771067 544448316 548820138
$$ packed form
1517.4G38506138l117859k825081k136350j617134j713335j697958j917064j878917
1533.7G21602440j359463j724839k291083p31111N86391O16073N35846O94692Q47816
1552.1G18776762O31750J92344N55456K241373J414895J23441o67810j699925k409279
1570.5G19159007k426028l488600n416930n210102m853368n884826o898224p477462
1586.8F77503467p689894p924080q289575q473814q113443p838548q045733p999479
1603.1F13128901p514000p388354p640123p338166o758869p240892p792830n693316
1619.4E55762351m630447n206108m851282l965854l192961k578319k425193j565814
1635.7E27346373N82873J412213J556635J828253L205240M839480L677249M371822
$$ plain form
1652 548820138 557644486 564809799 569971323 575835347 583404005 591534078 598191798 605467021 614963233
1670.4 614963233 623471379 631838024 641498268 649964511 656883895 664455593 676026344 686833501
1686.7 686833501 694875002 702888310 710130930 717601001 726009667 735074639 746498525 755612314
1703 755612314 762332916 769352496 775633991 780433357 783795476 786555111 790295362 794200599 796729982
1721.4 796729982 798804760 801268935 803425789 804959655 806342006 808602393 811529398 813645959
1737.7 813645959 815853298 818744361 821505666 823942661 826707363 830325186 834234953 837335169
1754 837335169 839994252 842493415 844247580 845774889 847599089 848995686 849547565 849796534 850741327
1772.4 850741327 852367759 853539109 854270995 855146408 856061041 856700301 857337654 857895672 857954860
$$ packed form
1652E48820138Q824348P165313N161524N864024P568658Q130073O657720P275223R496212
1670.4F14963233Q508146Q366645R660244Q466243O919384P571698J1570751J0807157
1686.7F86833501Q041501Q013308P242620P470071Q408666R064972J1423886R113789
1703G55612314O720602P019580O281495M799366L362119K759635L740251L905237K529383
1721.4G96729982K074778K464175K156854J533866J382351K260387K927005K116561
1737.7H13645959K207339K891063K761305K436995K764702L617823L909767L100216
1754H37335169K659083K499163J754165J527309J824200J396597N51879K48969R44793
1772.4H50741327J626432J171350P31886Q75413R14633O39260O37353N58018N9188
$$ plain form
1790.7 857954860 858138025 859037459 859990239 860434532 860706031 861442924 862339437 862758398 862777829 863095343
1811.1 863095343 863781750 864255190 864483118 864862382 865194380 865127981 865010798 865144908 865405738 865924597
1831.5 865924597 866552711 867007911 867292047 867350161 867160022 867024064 867373288 867923439 868423641 868858039
1851.9 868858039 869061232 869094491 869200468 869403183 869483173 869351387 869037449 868794560 869055331 869622231
1872.3 869622231 870058894 870243371 870251536 870279193 870389700 870374262 870151937 869978786 870108068 870246053
1892.7 870246053 870202303 870320678 870553017 870535672 870388508 870398760 870397508 870232999 870192528 870348454 870292127
1915.1 870292127 869907856 869699061 869793177 869857252 869850397 869905293 870004296 869934618 869685173 869566739 869597733
1937.6 869597733 869334996 868776500 868591547 868796051 868754923 868451834 868306994 868270516 868014336 867684424
$$ packed form
1790.7H57954860J83165Q99434R52780M44293K71499P36893Q96513M18961J9431L17514
1811.1H63095343O86407M73440K27928L79264L31998o6399j17183J34110K60830N18859
1831.5H65924597O28114M55200K84136N8114j90139j35958L49224N50151N00202M34398
1851.9H68858039K03193L3259J05977K02715P9990j31786l13938k42889K60771N66900
1872.3H69622231M36663J84477Q165K7657J10507j5438k22325j73151J29282J37985
1892.7H70246053m3750J18375K32339j7345j47164J0252j252j64509m0471J55926n6327
1915.1H70292127l84271k08795R4116O4075o855N4896R9003o9678k49445j18434L0994
1937.6H69597733k62737n58496j84953K04504m1128l03089j44840l6478k56180l29912
$$ plain form
1958 867684424 867618084 867612541 867251277 866745234 866653383 866766572 866552055 866255403 866249800 866236329 865905166
1980.4 865905166 865598083 865596354 865514696 865072370 864666462 864670813 864743531 864506781 864252388 864240825 864120543
2002.8 864120543 863725007 863465011 863471270 863316536 862888098 862596333 862549663 862386942 862049639 861912191
2023.2 861912191 861954927 861774206 861429036 861301601 861310422 861104667 860784590 860696733 860721231 860523105
2043.6 860523105 860283256 860314548 860391617 860177994 859897494 859873474 859912634 859753549 859575868 859604359
2064 859604359 859649956 859523237 859420240 859511435 859570801 859428227 859354496 859497249 859548330 859410465 859392524
2086.5 859392524 859526694 859557867 859495163 859566629 859736562 859763503 859683156 859724998 859866381 859910250 859863937
2108.9 859863937 859883606 859972298 860007226 860017300 860123992 860266984 860328376 860379875 860516191 860675097 860757053
$$ packed form
1958H67684424o6340n543l61264n06043r1851J13189k14517k96652n603j3471l31163
1980.4H65905166l07083j729q1658m42326m05908M351P2718k36750k54393j1563j20282
2002.8H64120543l95536k59996O259j54734m28438k91765m6670j62721l37303j37448
2023.2H61912191M2736j80721l45170j27435Q821k05755l20077q7857K4498j98126
2043.6H60523105k39849L1292P7069k13623k80500k4020L9160j59085j77681K8491
2064H59604359M5597j26719j02997R1195N9366j42574p3731J42753N1081j37865j7941
2086.5H59392524J34170L1173o2704P1466J69933K6941q0347M1842J41383M3869m6313
2108.9H59863937J9669Q8692L4928J0074J06692J42992O1392N1499J36316J58906Q1956
$$ plain form
2131.3 860757053 860784173 860865057 860996783 861089408 861148715 861267388 861447573 861591995 861674845 861775756
2151.7 861775756 861930072 862092614 862248123 862392902 862510502 862611771 862710595 862804830 862971902 863242745
2172.1 863242745 863453627 863542914 863674045 863901854 864064813 864108860 864202976 864396334 864505351 864514470
2192.5 864514470 864632428 864826858 864874125 864855528 865023017 865271628 865313172 865240335 865348518 865548849
2212.9 865548849 865546465 865455508 865581214 865788162 865767598 865682602 865838706 866019428 865925848 865822196 865990520
2235.4 865990520 866148472 866017997 865912259 866132140 866320550 866148889 865994334 866166234 866272390 866070211
2255.8 866070211 865972102 866176009 866280913 866115868 866059601 866242647 866278410 866093099 866108239 866348684
2276.1 866348684 866385639 866257906 866396606 866684973 866609693 866288304 866291583 866495967 866322815 865943313
$$ packed form
2131.3H60757053K7120Q0884J31726R2625N9307J18673J80185J44422Q2850J00911
2151.7H61775756J54316J62542J55509J44779J17600J01269R8824R4235J67072K70843
2172.1H63242745K10882Q9287J31131K27809J62959M4047R4116J93358J09017R119
2192.5H64514470J17958J94430M7267j8597J67489K48611M1544p2837J08183K00331
2212.9H65548849k384r0957J25706K06948k0564q4996J56104J80722r3580j03652J68324
2235.4H65990520J57952j30475j05738K19881J88410j71661j54555J71900J06156k02179
2255.8H66070211r8109K03907J04904j65045n6267J83046L5763j85311J5140K40445
2276.1H66348684L6955j27733J38700K88367p5280l21389L279K04384j73152l79502
$$ plain form
2296.5 865943313 865911424 866025209 865800858 865415692 865278363 865186095 864762485 864352465 864346027 864259183
2316.9 864259183 863641262 863007367 862893045 862857342 862427652 862042010 862088382 862027645 861560941 861278474
2337.3 861278474 861439526 861541152 861605406 862391710 863478005 863626778 862635076 861352324 860435426
2355.7 860435426 859603584 858962536 859110475 859910190 860656083 861355126 862488568 863777220 864644945
2374 864644945 865372062 866440594 867515922 868102729 868424535 868880391 869244933 869180560 869029284 869208753
2394.4 869208753 869406283 869254529 869101882 869268656 869379580 869172096 869026482 869161069 869231582 869070649
2414.8 869070649 868996561 869125485 869090974 868801475 868691802 868832052 868798316 868573666 868521810 868613183
2435.2 868613183 868516445 868266344 868186593 868242025 868125379 867907166 867888331 867954373 867817104 867628932
$$ packed form
2296.5H65943313l1889J13785k24351l85166j37329r2268m23610m10020o438q6844
2316.9H64259183o17921o33895j14322l5703m29690l85642M6372o0737m66704k82467
2337.3H61278474J61052J01626O4254P86304J086295J48773r91702j282752r16898
2355.7H60435426q31842o41048J47939P99715P45893O99043J133442J288652Q67725
2374H64644945P27117J068532J075328N86807L21806M55856L64542o4373j51276J79469
2394.4H69208753J97530j51754j52647J66774J10924k07484j45614J34587P0513j60933
2414.8H69070649p4088J28924l4511k89499j09673J40250l3736k24650n1856R1373
2435.2H68613183r6738k50101p9751N5432j16646k18213j8835O6042j37269j88172
$$ plain form
2455.6 867628932 867629528 867640495 867451370 867250562 867239416 867217004 866996169 866798937 866813600 866791844 866562068
2478.1 866562068 866394997 866389573 866289437 866077960 865972698 865943551 865793347 865582168 865519762 865524530 865373671
2500.5 865373671 865168691 865098059 865026593 864837468 864710093 864733756 864693820 864478648 864312470 864295900
2520.9 864295900 864210606 864016116 863922596 863913536 863772631 863546550 863474548 863492072 863348186 863150656 863127470
2543.3 863127470 863119483 862930596 862730622 862699389 862675607 862484753 862301528 862290561 862230659 861997664 861865222
2565.8 861865222 861896098 861785352 861478090 861281753 861270607 861129105 860776663 860536277 860483289 860312521
2586.2 860312521 859991491 859816849 859751105 859458923 859029531 858821571 858712971 858370602 857947886 857751966
2606.6 857751966 857597113 857173800 856707811 856539369 856420755 856011271 855570674 855423272 855287194 854844689
$$ packed form
2455.6H67628932N96J0967j89125k00808j1146k2412k20835j97232J4663k1756k29776
2478.1H66562068j67071n424j00136k11477j05262k9147j50204k11179o2406M768j50859
2500.5H65373671k04980p0632p1466j89125j27375K3663l9936k15172j66178j6570
2520.9H64295900q5294j94490r3520r060j40905k26081p2002J7524j43886j97530k3186
2543.3H63127470p987j88887j99974l1233k3782j90854j83225j0967n9902k32995j32442
2565.8H61865222L0876j10746l07262j96337j1146j41502l52442k40386n2988j70768
2586.2H60312521l21030j74642o5744k92182m29392k07960j08600l42369m22716j95920
2606.6H57751966j54853m23313m65989j68442j18614m09484m40597j47402j36078m42505
$$ plain form
2626.9 854844689 854391098 854220092 854037881 853609025 853252947 853150487 852949977 852490604 852120996 851962507
2647.3 851962507 851653218 851149261 850871623 850820422 850527942 849989295 849676311 849609315 849366546 848941505
2667.7 848941505 848689735 848558605 848192573 847713411 847523272 847433925 846990705 846402347 846143484 846026838
2688.1 846026838 845631540 845156074 844958901 844801545 844345570 843838334 843593955 843348384 842811286 842297614
2708.5 842297614 842079759 841834068 841339648 840889871 840649188 840328574 839798689 839386880 839178264 838802516
2728.9 838802516 838235199 837864518 837709188 837397873 836875439 836485624 836312890 836067855 835664749 835309565
2749.3 835309565 834995151 834512830 833976567 833627880 833318651 832818091 832259595 831851482 831470370 830921412
2769.7 830921412 830364704 830010355 829626441 828969479 828265011 827762127 827318788 826740384 826153100 825646043
$$ packed form
2626.9H54844689m53591j71006j82211m28856l56078j02460k00510m59373l69608j58489
2647.3H51962507l09289n03957k77638n1201k92480n38647l12984o6996k42769m25041
2667.7H48941505k51770j31130l66032m79162j90139q9347m43220n88358k58863j16646
2688.1H46026838l95298m75466j97173j57356m55975n07236k44379k45571n37098n13672
2708.5H42297614k17855k45691m94420m49777k40683l20614n29885m11809k08616l75748
2728.9H38802516n67317l70681j55330l11315n22434l89815j72734k45035m03106l55184
2749.3H35309565l14414m82321n36263l48687l09229n00560n58496m08113l81112n48958
2769.7H30921412n56708l54349l83914o56962p04468n02884m43339n78404n87284n07057
$$ plain form
2790.1 825646043 825026691 824251175 823528469 822897077 822152734 821263194 820416689 819681406 818912923 817983508
2810.5 817983508 817000926 816083014 815124750 814082384 813055158 812021017 810863614 809587657 808298767
2828.9 808298767 806982338 805475473 803699315 801688373 799276352 796089947 791864812 786473334
2845.2 786473334 780285180 774765551 771607757 770979583 771590352 772307754 772717416 772611976 771846831
2863.5 771846831 770436823 768516541 766399384 764474511 762833655 761358321 760076463 758993506
2879.9 758993506 757920861 756712496 755361438 753876209 752218187 750413895 748574615 746681213
2896.2 746681213 744655728 742590070 740541220 738330603 735707998 732535064 728649020 723697841
2912.5 723697841 717678964 711664975 707214236 704977095 704480231 705000758 706166506 707761586 709454060
$$ packed form
2790.1H25646043o19352p75516p22706o31392p44343q89540q46505p35283p68483r29415
2810.5H17983508r82582r17912r58264j042366j027226j034141j157403j275957j288890
2828.9H08298767j316429j506865j776158k010942k412021l186405m225135n391478
2845.2G86473334o188154n519629l157794o28174O10769P17402M09662j05440p65145
2863.5G71846831j410008j920282k117157j924873j640856j475334j281858j082957
2879.9G58993506j072645j208365j351058j485229j658022j804292j839280j893402
2896.2G46681213k025485k065658k048850k210617k622605l172934l886044m951179
2912.5G23697841o018877o013989m450739k237141m96864N20527J165748J595080J692474
$$ plain form
2930.8 709454060 711175442 713212848 715668678 718326628 721020460 723663211 725927532 727396011
2947.2 727396011 728080392 728360057 728371739 728125572 727984130 728340864 729199111 730296671 731538177
2965.5 731538177 733040810 734746099 736465335 738091171 739585578 741028845 742411673 743573189
2981.8 743573189 744595349 745685458 746812582 747914255 748943567 749712825 750172377 750379086 750358999
3000.2 750358999 750160575 749737382 749172270 748718441 748382032 747929454 747277677 746535718 745719194 744768918
3020.6 744768918 743779957 742809713 741687477 740413964 739230931 738171458 736911416 735317886 733797908
3038.9 733797908 732531846 731157005 729487300 727746010 726134658 724527121 722795725 721101582
3055.3 721101582 719484985 717777193 716043174 714510381 713162541 711746335 710142434 708517373
$$ packed form
2930.8G09454060J721382K037406K455830K657950K693832K642751K264321J468479
2947.2G27396011O84381K79665J1682k46167j41442L56734Q58247J097560J241506
2965.5G31538177J502633J705289J719236J625836J494407J443267J382828J161516
2981.8G43573189J022160J090109J127124J101673J029312P69258M59552K06709k0087
3000.2G50358999j98424m23193n65112m53829l36409m52578o51777p41959q16524r50276
3020.6G44768918r88961r70244j122236j273513j183033j059473j260042j593530j519978
3038.9G33797908j266062j374841j669705j741290j611352j607537j731396j694143
3055.3G21101582j616597j707792j734019j532793j347840j416206j603901j625061
$$ plain form
3071.6 708517373 707015574 705628991 704293430 702872872 701313078 699649036 697924495 696282864
3087.9 696282864 694720149 693014443 691179395 689435720 687784493 686020911 684092343 682196677
3104.2 682196677 680415094 678592503 676627934 674659312 672805607 670906126 668842435 666616142
3120.5 666616142 664174438 661641002 659263670 657035887 654699445 652160287 649672449 647396266
3136.8 647396266 645078182 642440915 639641643 636918187 634201109 631510615 628951252 626291931
3153.2 626291931 623295069 620158494 617128491 614152670 611121476 608041227 604958832 601898491
3169.5 601898491 598853409 595775247 592660487 589534879 586374760 583177030 580005646 576893926
3185.8 576893926 573788285 570650458 567496896 564328432 561111510 557889283 554771364 551733732
$$ packed form
3071.6G08517373j501799j386583j335561j420558j559794j664042j724541j641631
3087.9F96282864j562715j705706j835048j743675j651227j763582j928568j895666
3104.2F82196677j781583j822591j964569j968622j853705j899481k063691k226293
3120.5F66616142k441704k533436k377332k227783k336442k539158k487838k276183
3136.8F47396266k318084k637267k799272k723456k717078k690494k559363k659321
3153.2F26291931k996862l136575l030003k975821l031194l080249l082395l060341
3169.5F01898491l045082l078162l114760l125608l160119l197730l171384l111720
3185.8E76893926l105641l137827l153562l168464l216922l222227l117919l037632
$$ plain form
3202.1 551733732 548662245 545580924 542546690 539521694 536486566 533468187 530482709 527543306
3218.4 527543306 524659932 521759391 518809497 515884221 513033450 510302305 507688403 505027711
3234.7 505027711 502257049 499516755 496847630 494232565 491726339 489317447 486895442 484448552
3251.1 484448552 482056946 479746252 477463245 475128621 472773015 470472544 468227953 466048449
3267.4 466048449 463960677 461865515 459679723 457440406 455184162 452979177 450825185 448642284
3283.7 448642284 446453393 444318324 442252636 440209389 438094676 435889035 433612585 431333572
3300 431333572 429170161 427106887 424981773 422645748 420101613 417513043 415032446 412626982 410216749
3318.4 410216749 407806009 405406117 403002113 400491059 397849172 395230353 392714113 390307069
$$ packed form
3202.1E51733732l071487l081321l034234l024996l035128l018379k985478k939403
3218.4E27543306k883374k900541k949894k925276k850771k731145k613902k660692
3234.7E05027711k770662k740294k669125k615065k506226k408892k422005k446890
3251.1D84448552k391606k310694k283007k334624k355606k300471k244591k179504
3267.4D66048449k087772k095162k185792k239317k256244k204985k153992k182901
3283.7D48642284k188891k135069k065688k043247k114713k205641k276450k279013
3300D31333572k163411k063274k125114k336025k544135k588570k480597k405464k410233
3318.4D10216749k410740k399892k404004k511054k641887k618819k516240k407044
$$ plain form
3334.7 390307069 387977362 385544538 382936597 380311579 377721697 375194162 372810274 370385885
3351 370385885 367744386 365051389 362518817 360169053 357833743 355455130 353284270 351334929 349262059
3369.3 349262059 346914321 344557732 342508644 340731055 339065671 337410331 335814029 334460914
3385.7 334460914 333436459 332683712 331925601 330873311 329757124 329064906 328686327 328024507 327002436
3404 327002436 326189280 325799435 325575769 325339019 324992776 324602187 324449331 324568689 324742943 325042486
3424.4 325042486 325647593 326472104 327269495 328125089 329219371 330192924 330769330 331388146 332417727
3442.8 332417727 333741307 335273564 336885661 338491797 340175688 342013419 344084233 346331269
3459.1 346331269 348457038 350513101 352966905 355744600 358169109 360010684 361873209 364177376
$$ packed form
3334.7C90307069k329707k432824k607941k625018k589882k527535k383888k424389
3351C70385885k641499k692997k532572k349764k335310k378613k170860j949341k072870
3369.3C49262059k347738k356589k049088j777589j665384j655340j596302j353115
3385.7C34460914j024455p52747p58111j052290j116187o92218l78579o61820j022071
3404C27002436q13156l89845k23666k36750l46243l90589j52856J19358J74254K99543
3424.4C25042486O05107Q24511P97391Q55594J094282R73553N76406O18816J029581
3442.8C32417727J323580J532257J612097J606136J683891J837731K070814K247036
3459.1C46331269K125769K056063K453804K777695K424509J841575J862525K304167
$$ plain form
3475.4 364177376 366831273 369529158 371991873 374418348 377115667 379889756 382524401 385222375
3491.7 385222375 388136446 391194224 394146800 396956861 399893433 402860343 405571699 408318520
3508 408318520 411488652 414999247 418432385 421545893 424608618 427897364 431504488 435111970 438434899
3526.4 438434899 441828996 445518881 449349999 453369349 457489640 461348355 465168297 469302088
3542.7 469302088 473657042 477882475 481850892 485915601 490326494 494817019 499242097 503819942
3559 503819942 508400321 512546480 516729772 522275388 528488457 533855140 538810134 544075489 549633503
3577.4 549633503 555352092 561123848 566602588 572013855 578148782 584606230 590449274 596244574
3593.7 596244574 602591634 609234035 615900993 622379065 628347516 634040952 640290320 646933973
$$ packed form
3475.4C64177376K653897K697885K462715K426475K697319K774089K634645K697974
3491.7C85222375K914071L057778K952576K810061K936572K966910K711356K746821
3508D08318520L170132L510595L433138L113508L062725L288746L607124L607482L322929
3526.4D38434899L394097L689885L831118M019350M120291L858715L819942M133791
3542.7D69302088M354954M225433L968417M064709M410893M490525M425078M577845
3559E03819942M580379M146159M183292N545616O213069N366683M954994N265355N558014
3577.4E49633503N718589N771756N478740N411267O134927O457448N843044N795300
3593.7E96244574O347060O642401O666958O478072N968451N693436O249368O643653
$$ plain form
3610 646933973 653442204 659934998 666094899 672468245 679802239 686550677 691809177 696447432 702438116
3628.4 702438116 709906161 716326118 722022653 727577031 732871294 737933934 742517292 746268749
3644.7 746268749 749654293 754420161 760485530 765334845 769250274 773593783 777965546 781537175
3661 781537175 784426749 786788821 788566172 790282667 792559028 794600368 796591341 799532175 802571595
3679.4 802571595 805056512 807002902 808424234 809619129 811107695 813073337 815158546 816906571
3695.7 816906571 818051398 818745911 819569230 820746183 821681380 821917117 821863532 822637498 824245036
3714 824245036 825541973 826186717 826409996 826532781 826908290 827633142 828329444 828408182 827835858 827642083
3734.4 827642083 828827024 830345809 830884159 830390394 829830527 830052078 830226421 830438316 831620336
$$ packed form
3610F46933973O508231O492794O159901O373346P333994O748438N258500M638255N990684
3628.4G02438116P468045O419957N696535N554378N294263N062640M583358L751457
3644.7G46268749L385544M765868O065369M849315L915429M343509M371763L571629
3661G81537175K889574K362072J777351J716495K276361K041340J990973K940834L039420
3679.4H02571595K484917J946390J421332J194895J488566J965642K085209J748025
3695.7H16906571J144827O94513Q23319J176953R35197K35737n3585P73966J607538
3714H24245036J296937O44744K23279J22785L75509P24852O96302P8738n72324j93775
3734.4H27642083J184941J518785N38350m93765n59867K21551J74343K11895J182020
$$ plain form
3752.8 831620336 832971454 833658636 833971322 834469557 834948540 835108399 835201323 835485339 836040080 836670041
3773.2 836670041 836979747 836954951 836920679 837112069 837373078 837598383 837942123 838358760 838517427 838213861
3793.6 838213861 837697208 837326884 836951196 836749256 837209046 837699592 838126481 838737011 838995934 838520229
3814 838520229 837703824 837270617 837124050 837532163 838368714 838825822 838973105 838960230 838698626 838328063
3834.4 838328063 837905109 837617755 837899446 838606596 839428246 839940786 839596868 838287115 836817384
3852.7 836817384 837066472 838399172 839180350 839156091 838713348 838551700 838603854 838323772 838160396 838555038
3873.1 838555038 839140773 839454532 839235783 839001179 839123666 839276433 839374363 839276969 839161515 839463890
3893.5 839463890 839669526 839183092 838314950 837824404 838082969 838927448 839768767 840169013 840136707 839831412
$$ packed form
3752.8H31620336J351118O87182L12686M98235M78983J59859R2924K84016N54741O29961
3773.2H36670041L09706k4796l4272J91390K61009K25305L43740M16637J58667l03566
3793.6H38213861n16653l70324l75688k01940M59790M90546M26889O10530K58923m75705
3814H38520229q16405m33207j46567M08113Q36551M57108J47283j2875k61604l70563
3834.4H38328063m22954k87354K81691P07150Q21650N12540l43918j309753j469731
3852.7H36817384K49088J332700P81178k4259m42743j61648N2154k80082j63376L94642
3873.1H38555038N85735L13759k18749k34604J22487J52767R7930r7394j15454L02375
3893.5H39463890K05636m86434q68142m90546K58565Q44479Q41319M00246l2306l05295
$$ plain form
3913.9 839831412 839445353 839289010 839399219 839439571 839332342 839374900 839556575 839589477 839606225 839824855
3934.3 839824855 840043664 840035141 839810550 839627028 839650810 839675128 839610577 839645684 839842856 840051651 840146005
3956.7 840146005 840147972 840111554 840095103 840084970 840044796 840108752 840276718 840379000 840513945 840731382 840799272
3979.2 840799272 840775013 840875447 841007233 841050386 841007173 840915143 840884447 840931118 840943098
3997.5 840943098
$$ packed form
3913.9H39831412l86059j56343J10209M0352j07229M2558J81675L2902J6748K18630
3934.3H39824855K18809q523k24591j83522K3782K4318o4551L5107J97172K08795R4354
3956.7H40146005J967l6418j6451j0133m0174O3956J67966J02282J34945K17437O7890
3979.2H40799272k4259J00434J31786M3153m3213r2030l0696M6671J1980
3997.5H40943098
##END=$$ End of the data block
