##TITLE=$$ Begin of the data block
##JCAMP-DX=5.00 $$ ACD/SpecManager v 10.08
##SPECTROMETER/DATA SYSTEM=Alpha
##DATE=10 Apr 2014 09:27:12
##DATA TYPE=INFRARED SPECTRUM
##DATA CLASS=XYDATA
##ORIGIN=
##OWNER=
##NPOINTS=1765
##FIRSTX=399.75695801
##LASTX=3997.56933594
##MAXX=3997.56933594
##MINX=399.75695801
##MAXY=0.87066090
##MINY=0.32438710
##XFACTOR=1.0000000000
##YFACTOR=1.000000000000000e-9
##FIRSTY=0.68935692
##DELTAX=2.03957629
##XUNITS=1/CM
##YUNITS=ARBITRARY UNITS
##XYDATA=(X++(Y..Y))
399.8F89356923l710389k136529R24349j403153m653036j309216K194643m53472l184677
418.1F75625443k73048J39653l414571k098441K426207O57797m027903j809299K143979
436.5F69369817p96437l653110J32680K477587j797676l117800J086652J433313k424002
454.8F62711024j542985K254784l52085m186511j288116K386332o07193l504991M6730
473.2F55916989J841247k182365l003835J364112J821041k640188k377391J882494
489.5F52622104Q08119l366410j727462J815259l91364l504693o70791J930833j228750
507.9F46286845l133654K24292J418233k288759k954304J185298J183867k944946k675474
526.2F36301398J063228Q4102l181100j646578J461804l36409k807259l52323J906454
$$ y = [689356923, 685646534, 683510005, 684434354, 683031201, 678378165, 677068949, 679263592, 678810120, 675625443, 675352395, 675492048, 672077477, 669979036, 672405243, 673063040, 669035137, 667225838, 669369817, 668573380, 664920270, 665052950, 667530537, 665732861, 662615061, 663701713, 665135026, 662711024, 661168039, 663422823, 663070738, 658884227, 657596111, 659982443, 659375250, 655870259, 655916989, 657758236, 655575871, 652572036, 653936148, 655757189, 653117001, 650739610, 652622104, 653430223, 650063813, 648336351, 650151610, 649760246, 646255553, 645584762, 647515595, 646286845, 643153191, 643377483, 644795716, 642506957, 639552653, 640737951, 641921818, 638976872, 636301398, 637364626, 637448728, 634267628, 632621050, 634082854, 633746445, 630939186, 630586863, 632493317]
544.6F32493317q15391k810777q0406J268685j697720k624034M24444Q97765k192318
562.9F24863565k348065L98814k96712l286421k519965K1279r24230k973795j603484
581.3F11330986L72529r67264k351940m56095J227141k00689r75072J078546J918137
599.6F10976279J6749o38664R88364J202345m87745o88851N53966K87056m62949J170098
620F12916648L274084K918303J856684K778292L768623K682507J753449K708018L031135
638.4F37687743J408219L54946J062393J635134J183510R53019R27448J27613j4126
656.7F45325899J938462L714323L175021J613021J422882L010988K778530K131939
673.1F65111065K645492K733827K079666K001166K363563J990199J378059J580775
$$ y = [632493317, 631677926, 628867149, 628786743, 630055428, 628357708, 625733674, 626158118, 627055883, 624863565, 622515500, 622914314, 622617602, 619331181, 616811216, 616832495, 615908265, 612934470, 611330986, 611703515, 610736251, 608384311, 607928216, 609155357, 608954668, 607979596, 609058142, 610976279, 610993028, 610354364, 611342728, 612545073, 612057328, 611368477, 611922443, 612209499, 611746550, 612916648, 616190732, 619109035, 620965719, 623744011, 627512634, 630195141, 631948590, 634656608, 637687743, 639095962, 639450908, 640513301, 642148435, 643331945, 644284964, 645212412, 645340025, 645325899, 647264361, 650978684, 654153705, 655766726, 657189608, 660200596, 662979126, 665111065, 667756557, 670490384, 672570050, 674571216, 676934779, 678924978, 680303037, 681883812]
689.4F81883812J791775J052618N31256R58980J117587O49154Q28326J687884J833439
707.7F92334831J362681J627207K281189J943290J288295J843810K651930K064347
724G07397580J395404K010823K437889J591385J103222J843989J964152Q82566P51674
742.4G21378684J927435K033771J024782J261413K455175K159476R38833J353026K460837
760.8G36993432J650631K54274Q27551J635551M14074q92580k90334J45554j333177
779.1G39404976k341032j249730m36723j137615q35716J358330K748310K621055L564060
797.5G43695915N653262N881011M263580L915549M678309L643155J575589J386404
813.8G74692774K034545P05242j297355j411199j252532l036678m765451m225195l416478
$$ y = [681883812, 683675587, 684728205, 685259461, 686218441, 687336028, 687985182, 688813508, 690501392, 692334831, 693697512, 695324719, 697605908, 699549198, 700837493, 702681303, 705333233, 707397580, 708792984, 710803807, 713241696, 714833081, 715936303, 717780292, 719744444, 720627010, 721378684, 723306119, 725339890, 726364672, 727626085, 730081260, 732240736, 733179569, 734532595, 736993432, 738644063, 738898337, 739725888, 741361439, 741775513, 740882933, 740592599, 740738153, 739404976, 737063944, 735814214, 735377491, 734239876, 733404160, 734762490, 737510800, 740131855, 743695915, 749349177, 755230188, 759493768, 763409317, 768087626, 771730781, 773306370, 774692774, 776727319, 777432561, 776135206, 774724007, 773471475, 770434797, 765669346, 761444151, 758027673]
832.1G58027673m280627m760742l390551k462506l229261l347814j530230K41578J126587
850.5G36394107L005803O093442P878066P810056Q089363Q853793Q063078O069303
866.8G92257011N088985M814684L411234J676798J403451J524269K42174j314342j510978
885.2H07593286j412451k290428k915859k112508j059353o87123o616J302004J892388
903.5H00303340J400530J031578J048982L81112r91642j869619k202630k810598l310680
921.9G92980373k854347j803160r37104k37584M22775O35684L52144J65701K28643
940.2G88953125J37270j20938k70486n34355j230479k064824k839327l905356n266726
958.6G72857904o452620p529735q973301j0577917j1682510j2180090j2261570j1552333
$$ y = [758027673, 753747046, 748986304, 745595753, 743133247, 739903986, 736556172, 735025942, 735267520, 736394107, 739399910, 745493352, 753371418, 761181474, 769270837, 778124630, 786187708, 792257011, 797345996, 802160680, 805571914, 807248712, 808652163, 810176432, 810418606, 809104264, 807593286, 806180835, 803890407, 800974548, 798862040, 797802687, 797115564, 797108948, 798410952, 800303340, 801703870, 802735448, 803784430, 804165542, 803173900, 801304281, 799101651, 796291053, 792980373, 790126026, 788322866, 787385762, 787148178, 787570953, 788206637, 788558781, 788724482, 788953125, 789090395, 788969457, 788698971, 788164616, 786934137, 784869313, 782029986, 778124630, 772857904, 766405284, 758875549, 749902248, 739324331, 727641821, 715461731, 703200161, 691647828]
974.9F91647828r837628q002162o816327n877197m801333m095495l982305l669918
991.2F44565463k823889k274633k321362k129853j535594j546801k457737l340364
1007.5F26135230l942549m983962o188512o462097o014883n983353o173909n643665
1023.9E80742300m869760m768431m737735l907442k892553k495706k214373j441478
1040.2E53414822q74281j182676j620471j453996j258314j416027r70364O01590K215266
1058.5E47455549K855122L029824L181040K515495R95636N7220K13266L57985M9472
1076.9E60710609J31547O79255N02884n40554j210630j258135j366436j137794K97785
1095.2E56808531K268017L281176L367662L656447M003704L534615K761900K735555
$$ y = [691647828, 681810200, 673808038, 666991711, 661114514, 656313181, 652217686, 648235381, 644565463, 641741574, 639466941, 637145579, 635015726, 633480132, 631933331, 629475594, 626135230, 622192681, 617208719, 611020207, 604558110, 598543227, 592559874, 586385965, 580742300, 575872540, 571104109, 566366374, 562458932, 559566379, 557070673, 554856300, 553414822, 552540541, 551357865, 549737394, 548283398, 547025084, 545609057, 544638693, 545240283, 547455549, 550310671, 553340495, 556521535, 559037030, 560032666, 560089886, 560303152, 560661137, 560710609, 560842156, 561521411, 562024295, 561483741, 560273111, 559014976, 557648540, 556510746, 556808531, 559076548, 562357724, 565725386, 569381833, 573385537, 576920152, 579682052, 582417607]
1111.6E82417607K896846K075612N69999p39932j798153k131640p36714J736522L370344
1129.9E87660491K990544J700938J709461K820432L386617L364504L309071K741992
1146.2F09684050J567245R89675J475811J908720J895010K485037L932357N205154
1162.6F29143059O063462P291078Q699536R135902Q600057Q249104Q152127P340133
1178.9F92674458N965591N033671M182935K275467k32696k131343l547371m986286
1195.2F99234426n757153n116403l824592l002047k551496k132595k250075l184080
1211.5F71415985m091978m265130m188418m327238m207134l539503k872646k521455
1227.8F41402483k029598j182079m92632j94550J18971N66661P15494M39525J81735
$$ y = [582417607, 585314453, 587390065, 587960064, 587220132, 585421979, 583290339, 582553625, 584290147, 587660491, 590651035, 592351973, 594061434, 596881866, 600268483, 603632987, 606942058, 609684050, 611251295, 612240970, 613716781, 615625501, 617520511, 620005548, 623937905, 629143059, 635206521, 642497599, 651197135, 660333037, 668933094, 677182198, 685334325, 692674458, 698640049, 703673720, 707856655, 710132122, 709899426, 707768083, 704220712, 699234426, 693477273, 688360870, 684536278, 681534231, 678982735, 676850140, 674600065, 671415985, 667324007, 663058877, 658870459, 654543221, 650336087, 646796584, 643923938, 641402483, 639372885, 638190806, 637698174, 637503624, 637622595, 638189256, 638904750, 639344275, 639526010]
1246.2F39526010Q9645j46985n16892n89192k56478J82688P49648J652598K686441
1264.5F43377483L482342M004419M536449N076230N302668N253732N270660N433917
1280.8F81737900N516827N445182N439103N469620N210936M658044M133343L754676
1297.2G21365631L314554K782166K435148K318382K174378J910805J710296J688957
1313.5G39700317J623512J479923J543999J694083J587332J231491Q84414O43611K91645
1331.8G50680327k43902o34610n95212j68622J58668K03430L15011M39942L34322J28150
1352.2G50617504M7684o6161m72546j034439j396119j453340j441002j222253r31799
1370.6G42647529j219750j657665j548707j528740k088368k696216k641916k099455
$$ y = [639526010, 639615655, 639468670, 638951778, 638362586, 638106108, 638288796, 639038444, 640691042, 643377483, 646859825, 650864244, 655400693, 660476923, 665779591, 671033323, 676303983, 681737900, 687254727, 692699909, 698139012, 703608632, 708819568, 713477612, 717610955, 721365631, 724680185, 727462351, 729897499, 732215881, 734390259, 736301064, 738011360, 739700317, 741323829, 742803752, 744347751, 746041834, 747629166, 748860657, 749745071, 750388682, 750680327, 750436425, 749801815, 749206603, 749037981, 749196649, 749400079, 749715090, 750155032, 750489354, 750617504, 750665188, 750599027, 750126481, 749092042, 747695923, 746242583, 744801581, 743579328, 742647529, 741427779, 739770114, 738221407, 736692667, 734604299, 731908083, 729266167, 727166712]
1386.9G27166712j680612j646877j850903j918196j899779k110481k147556k273738
1403.2G11638570k525628k294302j973033j803815j692832j698732j529813o66499
1419.5F97453916K0921J63853N02110P15435Q81195J187741J231552J650393K535641
1437.9G06342757K410233K096295J871228J625836J868606K202749J983404J670480
1454.2G22071588K861559N715907N264461L869712M344821N233825M644572M280091
1470.5G58286536N819320O929160N780100M245520L012002K100288J001299j99199
1486.8G86975026r18150p52747q48412j982868l148258k995133k644599l130853m998684
1505.2G65555322p127344m545510l139735l890097m394471l983021l100336k808988
$$ y = [727166712, 725486100, 723839223, 721988320, 720070124, 718170345, 716059864, 713912308, 711638570, 709112942, 706818640, 704845607, 703041792, 701348960, 699650228, 698120415, 697453916, 697474837, 697638690, 698140800, 698856235, 699737430, 700925171, 702156723, 703807116, 706342757, 708752990, 710849285, 712720513, 714346349, 716214955, 718417704, 720401108, 722071588, 724933147, 730649054, 735913515, 739783227, 744128048, 749361873, 754006445, 758286536, 764105856, 771035016, 776815116, 781060636, 784072638, 786172926, 787174225, 786975026, 786056876, 785304129, 784455717, 782472849, 779324591, 776329458, 773684859, 770554006, 765555322, 758427978, 753882468, 750742733, 746852636, 742458165, 738475144, 735374808, 732565820]
1521.5G32565820k125501j614690j692891j662553j926362j920879j378894j747847
1537.8G18496203k292513o58751O43611O49631N50687O77109Q32617O30319J60099
1556.2G19689012M86016K271831J496434J51038o63638j699388k407074k412855l482402
1574.5G13428974n413592n212784m872620n901575o892800p471144p697582p919729
1590.9F62047148q274079q467614q109689p849991q086920q043409p551670p416010
1607.2E98247766p638573p319451o736934p221698p801533n741716m692256n232990
1623.5E45862615m834652l966153l211140k583802k424836j551271O05822J408935
1639.8E29305518J537561J819074L229141M880131L698647M362225Q789540P182240
$$ y = [732565820, 730440319, 728825629, 727132738, 725470185, 723543823, 721622944, 720244050, 718496203, 716203690, 715544939, 716188550, 716838181, 717388868, 718065977, 718898594, 719528913, 719689012, 720175028, 722446859, 723943293, 724094331, 723430693, 721731305, 719324231, 716911376, 713428974, 708015382, 702802598, 697929978, 692028403, 685135603, 677664459, 669966877, 662047148, 653773069, 645305455, 637195766, 629345775, 621258855, 613215446, 605663776, 598247766, 590609193, 583289742, 576552808, 569331110, 561529577, 555787861, 551095605, 545862615, 541027963, 537061810, 533850670, 531266868, 528842032, 527290761, 527896583, 529305518, 530843079, 532662153, 535891294, 540771425, 544470072, 548832297, 557621837, 564804077]
1656.1E64804077N199552N903244P614672Q139193O632209P256388R494782Q532464
1672.4F23576581Q391679R669065Q476675O917655P543981J1536420J0793984Q031010
1688.8F94937050P982195P191658P440865Q429944R058953J1403143R138286O753564
1705.1G62335658P059276O303728M791260L348767K738118L727258L935098K566994
1721.4G96806157K097308K470434K153039J518309J353681K260208K961934K141833
1737.7H13762903K235413K884924K717912K417386K760887L607571L917575L132284
1754H37436855K664268K459764J726449J546442J872898J424133N33939K09748R08912
1772.4H50783408J608193J181662P68721R17017R24528O24835O36340N59389M3571
$$ y = [564804077, 570003629, 575906873, 583521545, 591660738, 598292947, 605549335, 615044117, 623576581, 631968260, 641637325, 650114000, 657031655, 664575636, 676112056, 686906040, 694937050, 702919245, 710110903, 717551768, 725981712, 735040665, 746443808, 755582094, 762335658, 769394934, 775698662, 780489922, 783838689, 786576807, 790304065, 794239163, 796806157, 798903465, 801373899, 803526938, 805045247, 806398928, 808659136, 811621070, 813762903, 815998316, 818883240, 821601152, 824018538, 826779425, 830386996, 834304571, 837436855, 840101123, 842560887, 844287336, 845833778, 847706676, 849130809, 849664748, 849874496, 850783408, 852391601, 853573263, 854341984, 855259001, 856183529, 856808364, 857444704, 858004093, 858047664]
1790.7H58047664J69099Q96453R46582M29153K69532P66218Q97169L84569J3948L40521
1811.1H63160908P09057M84526K27094L72469L11852q7142j04845J65999K89679N29766
1831.5H66059363O00099M25518K86579O6400j77324j06156L59595N42343N00321M18126
1851.9H68974864J67609J3590J10507K11238Q1659j39356l18885k29656K88903N84007
1872.3H69744480M25040J59502j6629O735J10924J7345j90198j61350J41442J43826
1892.7H70381117m7743J10089K17438j9252j37270J5140N960j71065o1810J65820l8803
1915.1H70419621m01973k26498J02282P8857m054M7625J05083o7175k73228j46150
1935.5H69634390l58k83956n34773j50740K06828m2618k87652j34408m0114k58446
$$ y = [858047664, 858216763, 859113216, 860059798, 860488951, 860758483, 861524701, 862421870, 862806439, 862820387, 863160908, 863869965, 864354491, 864581585, 864954054, 865265906, 865178764, 865073919, 865239918, 865529597, 866059363, 866659462, 867084980, 867371559, 867437959, 867260635, 867154479, 867514074, 868056417, 868556738, 868974864, 869142473, 869156063, 869266570, 869477808, 869559467, 869420111, 869101226, 868871570, 869160473, 869744480, 870169520, 870329022, 870312393, 870319128, 870430052, 870447397, 870257199, 870095849, 870237291, 870381117, 870333374, 870443463, 870660901, 870641649, 870504379, 870519519, 870525479, 870354414, 870292604, 870458424, 870419621, 870017648, 869791150, 869893432, 869972289, 869968235, 870015860, 870120943, 870053768, 869780540, 869634390, 869634032, 869350076, 868815303, 868664563, 868871391, 868828773, 868541121, 868406713, 868366599, 868108153]
1955.9H68108153l21567m9710J0252l44634m72188o1274R6679k66790l45886k6464
1976.3H66326571r001l32057l12329J8657n0009m28140m03523J073M9412k65837k50041
1998.8H64344776K0265r4533l88682k70664o557j66654m45128l04043m7088j58965
2019.2H62482727l32594j27912M0174k10882l72290j08004M6909j89960l15368r4831
2039.6H60817969J2159j93536k35677J1504M8339k14577k42412R895K0444k05517j97112
2062H59631479L5822N7399j16825r3937J06693P5698j40429p5698J51336N3466j68026
2084.4H59516978m6730J73509Q8156p5817K8073J49787K5749o7234N4598J25944k503
2106.9H59970510p7367M7684J42574N4419k742R1792J26659M6373M6313J22368J47104
$$ y = [868108153, 867786586, 867736876, 867747128, 867402494, 866930306, 866869032, 866965711, 866698921, 866353035, 866326571, 866317570, 865985513, 865673184, 865691841, 865641832, 865213692, 864810169, 864811242, 864860654, 864594817, 864344776, 864365041, 864270508, 863881826, 863611162, 863604605, 863437951, 862992823, 862688780, 862641692, 862482727, 862150133, 862022221, 862062395, 861851513, 861479223, 861371219, 861418128, 861228168, 860912800, 860817969, 860830128, 860636592, 860400915, 860412419, 860460758, 860246181, 860003769, 860013664, 860034108, 859828591, 859631479, 859667301, 859724700, 859607875, 859513938, 859620631, 859696329, 859555900, 859480202, 859631538, 859685004, 859516978, 859470248, 859643757, 859731913, 859656096, 859684169, 859833956, 859859705, 859792471, 859847069, 859973013, 859970510, 859893143, 859940827, 860083401, 860137820, 860135078, 860226870, 860353529, 860399902, 860446215, 860568583, 860715687]
2129.3H60715687J11342P1525R9421J32501R2447O7174J20580J59085J42932J15514
2149.7H61828208J01864J27137J53840J49250J36196J31250J30474J20223J05262J75714
2170.1H63159418K72811J98364P3910J18076K06709J45614M4048J15097K24173J11580
2190.5H64669800j3113J14262K20001O2108n6267J27256K61664O3956p3016J03772
2210.9H65480423J98364J848r2745R9659J86086O735l2186J85847J85370r9837j19925
2233.3H65999639J52171J67966q4520p7188J78099J22845j88649j35779J95146J44124
2253.7H66473854j72377r7871J95086R7811j70469n0723J94489K8670j90019L0756
2274.1H66339207K14219l0041j55926J41442K93136l8684k79307n424J78099j58430
$$ y = [860715687, 860827029, 860898554, 860997975, 861130476, 861222923, 861290097, 861410677, 861569762, 861712694, 861828208, 861930072, 862057209, 862211049, 862360299, 862496495, 862627745, 862758219, 862878442, 862983704, 863159418, 863432229, 863630593, 863704503, 863822579, 864029288, 864174902, 864218950, 864334047, 864558220, 864669800, 864656687, 864770949, 864990950, 865053058, 864996791, 865124047, 865385711, 865449667, 865376651, 865480423, 865678787, 865680635, 865587890, 865687549, 865873635, 865880370, 865848184, 866034031, 866219401, 866119564, 865999639, 866151810, 866319776, 866235256, 866158068, 866336167, 866459012, 866270363, 866134584, 866329730, 866473854, 866301477, 866203606, 866398692, 866496503, 866326034, 866275311, 866469800, 866498470, 866308451, 866339207, 866553426, 866523385, 866367459, 866508901, 866802037, 866763353, 866484046, 866478622, 866656721, 866498291]
2294.5H66498291l34441J9789J44720k51830m07994q8632k3603l83497m08411m9829
2314.9H64714563j38700o37174o31451j04428l4868m45784l71456J08421L278m32014
2335.3H62030387k65181J61707M2141o3062P10666J100421J89960r17792j179814q64745
2355.7H60944688q73089o58929J89901P77006P32958P84457J152515J174092P88510
2374H65012109P20680J031518J009345N57900L30507M58420L54290p7904j71363J72496
2394.4H69397998K15709j22309j19328J63436O3598k30491j18733J78457P5757j98722
2414.8H69305372j07229J15753l6896k83300j05978J33396k5690j97649m6611M7446
2435.2H68798614j37806k33591l4928Q0108j23143k13444J2398O9379j60515j84536
$$ y = [866498291, 866163850, 866183639, 866328359, 866076529, 865668535, 865579903, 865556300, 865172803, 864764392, 864714563, 864575863, 863938689, 863307238, 863202810, 863167942, 862722158, 862350702, 862459123, 862462401, 862030387, 861765206, 861926913, 861969054, 861905992, 862616658, 863717079, 863907039, 862989247, 861809433, 860944688, 860071599, 859412670, 859602571, 860379577, 861112535, 861896992, 863049507, 864223599, 865012109, 865732789, 866764307, 867773652, 868331552, 868662059, 869120479, 869474769, 869396865, 869225502, 869397998, 869613707, 869491398, 869372070, 869535506, 869599104, 869368613, 869249880, 869428337, 869504094, 869305372, 869198143, 869313896, 869277000, 868993700, 868887722, 869021118, 868995428, 868797779, 868751168, 868798614, 868660808, 868427217, 868392289, 868472397, 868349254, 868135810, 868148208, 868217587, 868057072, 867872536]
2455.6H67872536J8597j0193k23040j83046J8418l0637k22921j83583p927p3314k49743
2478.1H66725147j54555N364r7155k16663j15037l7491j43350j80780m1485j1981j71840
2500.5H65560174k12431q3685o8068j62423j07586K3841o3896k33054j51992M351o0439
2522.9H64444792j61588o9380j5855j89185k63929p2241J4663j53124k07961m1366
2543.3H63284826j8060j60754j38640j2815p7009k32041j70171Q881m7744k19404j31488
2565.8H62085581L3796j10269l23713j93000o55j60873l62158k18570m6551j85371
2586.2H60518217l19600j72973q9824k94447l93450k03431j28805l19422l85344k00689
2606.6H58010232j80184m34578m68552j74880j31845m13716m18544j36495j58429m42982
$$ y = [867872536, 867891133, 867880940, 867657900, 867474854, 867493272, 867462635, 867239714, 867056131, 867048204, 866974890, 866725147, 866570592, 866575956, 866478801, 866262138, 866147101, 866109610, 865966260, 865785480, 865743995, 865732014, 865560174, 865347743, 865264058, 865195990, 865033567, 864925981, 864949822, 864885926, 864652872, 864500880, 864505231, 864444792, 864283204, 864213824, 864197969, 864008784, 863744855, 863672614, 863687277, 863534153, 863326192, 863284826, 863266766, 863106012, 862967372, 862954557, 862877548, 862645507, 862475336, 862484217, 862436473, 862217069, 862085581, 862119377, 862009108, 861685395, 861492395, 861491740, 861330867, 860968709, 860750139, 860703588, 860518217, 860198617, 860025644, 859935820, 859641373, 859247923, 859044492, 858915687, 858596265, 858210921, 858010232, 857830048, 857395470, 856926918, 856752038, 856620193, 856206477, 855787933, 855651438, 855493009, 855050027]
2626.9H55050027m28855j81258k17736m43458l37899q4519k31266n06759l80278j30355
2647.3H52107644k44081m43399k76744j01030l23177n01811k69830p2658k84016m82202
2667.7H49108696k89500j25050l16024m25398j98246j27613m34756n45442k30134j26362
2688.1H46290171m25637m89711j95146j52707m50313n10037k74599k81095n21124m76837
2708.5H42512965k36034k99216n21361m30286j97709k86519n16713m06146j99914l66151
2728.9H39052916n68629m02510j93775l10003n14150m15385j98781k66612m12583l03805
2749.3H35466683k57433n02884n92947l64721k88963m82440n40972l82364l60369n45621
2769.7H31147969n63801l66330l97861o56664o84857n04017m79937o02126n95927n03898
$$ y = [855050027, 854621172, 854439914, 854222178, 853778720, 853440821, 853356302, 853125036, 852618277, 852237999, 852107644, 851863563, 851420164, 851143420, 851042390, 850719213, 850217402, 849947572, 849874914, 849590898, 849108696, 848819196, 848694146, 848378122, 847952724, 847754478, 847626865, 847192109, 846646667, 846416533, 846290171, 845864534, 845374823, 845179677, 845026970, 844576657, 844066620, 843792021, 843510926, 842989802, 842512965, 842276931, 841977715, 841456354, 841026068, 840828359, 840541840, 840025127, 839618981, 839419067, 839052916, 838484287, 838081777, 837888002, 837577999, 837063849, 836648464, 836449683, 836183071, 835770488, 835466683, 835209250, 834706366, 834113419, 833748698, 833459735, 832977295, 832436323, 832053959, 831693590, 831147969, 830584168, 830217838, 829819977, 829163313, 828478456, 827974439, 827494502, 826892376, 826296449, 825792551]
2790.1H25792551n76913p22707o99520o46174p70986q87513q41200p60258p79926q88944
2810.5H18218410r25541q91209r62019j068711j057923j034557j130760j260698j302242
2828.9H08584750j342297j515508j758337k012729k445936l201306m209280n376041
2845.2G86723316o199897n530476l145933o39379N84423P13051L99112j43230p97152
2863.5G71963835j391769j854062k058208j920223j678646j519203j300335j047790
2879.9G59193599j024425j198470j357913j512409j711309j822114j820206j873493
2896.2G46873260j995147k056300k084434k214790k549469l099859l874779m973888
2912.5G24024594o038129o023407m457236k246916n15044M97222J150191J595557J683473
$$ y = [825792551, 825215638, 824492931, 823793411, 823147237, 822376251, 821488738, 820647538, 819887280, 819107354, 818218410, 817292869, 816401660, 815439641, 814370930, 813313007, 812278450, 811147690, 809886992, 808584750, 807242453, 805726945, 803968608, 801955879, 799509943, 796308637, 792099357, 786723316, 780523419, 774992943, 771847010, 771207631, 771792054, 772505105, 772904217, 772760987, 771963835, 770572066, 768718004, 766659796, 764739573, 763060927, 761541724, 760241389, 759193599, 758169174, 756970704, 755612791, 754100382, 752389073, 750566959, 748746753, 746873260, 744878113, 742821813, 740737379, 738522589, 735973120, 732873261, 728998482, 724024594, 717986465, 711963058, 707505822, 705258906, 704743862, 705241084, 706391275, 707986832, 709670305]
2930.8G09670305J698971K041876K489269K686918K700567K646625K278745J477421
2947.2G27690697O77466K49267j4305k29359j22488L52681Q81016J150787J279235
2965.5G31914997J485050J640379J671255J605511J489162J458526J387357J167179
2981.8G43819416J067817J140356J123726J062870J040757Q07047M37558J76608k1696
3000.2G50654459k13325m38511n68092m51803l23356m51743o45817o75380p44104r61900
3020.6G45180428j034856r76026j129329j303613j200080j057327j237035j554429
3036.9G35687733j490414j265109j385450j670003j736462j602948j599074j734793
3053.2G23203480j702904j606882j645386j662076j566768j451313j466632j600444
$$ y = [709670305, 711369276, 713411152, 715900421, 718587339, 721287906, 723934531, 726213276, 727690697, 728368163, 728617430, 728603125, 728373766, 728251278, 728603959, 729484975, 730635762, 731914997, 733400047, 735040426, 736711681, 738317192, 739806354, 741264880, 742652237, 743819416, 744887233, 746027589, 747151315, 748214185, 749254942, 750061989, 750499547, 750676155, 750654459, 750441134, 750002623, 749434531, 748982728, 748659372, 748207629, 747561812, 746886432, 746142328, 745180428, 744145572, 743169546, 742040217, 740736604, 739536524, 738479197, 737242162, 735687733, 734197319, 732932210, 731546760, 729876757, 728140295, 726537347, 724938273, 723203480, 721500576, 719893694, 718248308, 716586232, 715019464, 713568151, 712101519, 710501075]
3069.5G10501075j596868j457036j371026j371443j460672j563906j623094j678109
3085.8F98378921j620532j566767j763940j920641j756072j575768j717865j945436
3102.2F84511900j911223j790702j818002j942157j952768j845121j880884k056122
3118.5F69314921k262354k479434k531171k364874k246618k366364k524734k462267
3134.8F50077105k298058k361714k664984k798438k675235k655268k687573k600074
3151.1F29335761k697110l013492l115892k996385k945543l002941l058732l073990
3167.4F05431676l087342l093123l117323l153324l150046l145814l161609l133893
3183.7E80389202l078342l090858l135145l145814l177881l235817l212989l123819
$$ y = [710501075, 708904207, 707447171, 706076145, 704704702, 703244030, 701680124, 700057030, 698378921, 696758389, 695191622, 693427682, 691507041, 689750969, 688175201, 686457336, 684511900, 682600677, 680809975, 678991973, 677049816, 675097048, 673251927, 671371043, 669314921, 667052567, 664573133, 662041962, 659677088, 657430470, 655064106, 652539372, 650077105, 647779047, 645417333, 642752349, 639953911, 637278676, 634623408, 631935835, 629335761, 626638651, 623625159, 620509267, 617512882, 614567339, 611564398, 608505666, 605431676, 602344334, 599251211, 596133888, 592980564, 589830518, 586684704, 583523095, 580389202, 577310860, 574220002, 571084857, 567939043, 564761162, 561525345, 558312356, 555188537]
3200.1E55188537l098071l140151l125549l055394l006279k987742k982140k955139
3216.4E30838072k946317k974331k956152k888739k848328k820789k759517k697110
3232.7E07946789k718985k776980k748370k662689k572000k456218k378911k442896
3249D87189740k513111k452522k330870k282798k342313k347738k261966k216667k184987
3267.4D66256768k115906k132445k206952k230137k217055k171755k164572k193272
3283.7D48824674k184600k149909k055526j992435k090990k233535k328783k334416
3300D31454480k192349k041131k102852k368629k570897k559364k472460k438903k424270
3318.4D10283625k422750k414048k386212k476841k613127k632380k591610k452850
$$ y = [555188537, 552090466, 548950315, 545824766, 542769372, 539763093, 536775351, 533793211, 530838072, 527891755, 524917424, 521961272, 519072533, 516224205, 513403416, 510643899, 507946789, 505227804, 502450824, 499702454, 497039765, 494467765, 492011547, 489632636, 487189740, 484676629, 482224107, 479893237, 477610439, 475268126, 472920388, 470658422, 468441755, 466256768, 464140862, 462008417, 459801465, 457571328, 455354273, 453182518, 451017946, 448824674, 446640074, 444490165, 442434639, 440442204, 438351214, 436117679, 433788896, 431454480, 429262131, 427221000, 425118148, 422749519, 420178622, 417619258, 415146798, 412707895, 410283625, 407860875, 405446827, 403060615, 400583774, 397970647, 395338267, 392746657, 390293807]
3334.7C90293807k278924k375722k613068k652347k624333k554208k367943k395064
3351C70432198k650469k727420k523064k311677k314448k344221k152056j970827k095104
3369.3C49342912k381056k412945k102047j800150j661867j649231j598924j375675
3385.7C34361017j032889p18892p47353j068323j121194o99043l40044n80550r89258
3404C27063471q24898m09782k71678k90186l57121l75271j47432J20432K06470L42488
3424.4C25056493O09875Q06481P71016Q12768J051575R81450O11395N81235R64999
3442.8C32247287J360476J642883J672953J612187J701504J828372K006799K196044
3459.1C46268505K101689K065868K501130K790242K402097J846105J884878K321839
$$ y = [390293807, 388014883, 385639161, 383026093, 380373746, 377749413, 375195205, 372827262, 370432198, 367781729, 365054309, 362531245, 360219568, 357905120, 355560899, 353408843, 351438016, 349342912, 346961856, 344548911, 342446864, 340646714, 338984847, 337335616, 335736692, 334361017, 333328128, 332609236, 331861883, 330793560, 329672366, 328973323, 328633279, 328052729, 327063471, 326238573, 325828791, 325557113, 325266927, 324909806, 324534535, 324387103, 324507535, 324714005, 325056493, 325666368, 326472849, 327243865, 328056633, 329108208, 330089658, 330701053, 331282288, 332247287, 333607763, 335250646, 336923599, 338535786, 340237290, 342065662, 344072461, 346268505, 348370194, 350436062, 352937192, 355727434, 358129531, 359975636, 361860514, 364182353]
3475.4C64182353K669573K710700K484262K441764K671927K722144K624542K722472
3491.7C85229737K891242L027827K966731K825559K923905K925188K687663K798199
3508D08276051L288955L620952L460556L051877K982974L253431L594815L586531L335387
3526.4D38451529L491938L820926L901511M021943M096895L834218L812581M116476
3542.7D69548017M319995M234255L991127M047990M388570M497499M460662M613281
3559E04101396M600346M149377M159272N526006O229222N392015M939794N201221N520940
3577.4E49819589N741357N803824N502522N424499O120861O476223N926431N887925
3593.7E96703231O378591O594479O621898O476044N953908N663812O244660O669223
$$ y = [364182353, 366851926, 369562626, 372046888, 374488652, 377160579, 379882723, 382507265, 385229737, 388120979, 391148806, 394115537, 396941096, 399865001, 402790189, 405477852, 408276051, 411565006, 415185958, 418646514, 421698391, 424681365, 427934796, 431529611, 435116142, 438451529, 441943467, 445764393, 449665904, 453687847, 457784742, 461618960, 465431541, 469548017, 473868012, 478102267, 482093394, 486141384, 490529954, 495027453, 499488115, 504101396, 508701742, 512851119, 517010391, 522536397, 528765619, 534157634, 539097428, 544298649, 549819589, 555560946, 561364770, 566867292, 572291791, 578412652, 584888875, 590815306, 596703231, 603081822, 609676301, 616298199, 622774243, 628728151, 634391963, 640636623, 647305846]
3610F47305846O560981O512344O140471O393432P382930O789565N260289M575669N937398
3628.4G02858925P516980O480813N723655N590022N322635N022764M483104L690124
3644.7G46689022L360033M720509O122768M938006L902495M276812M324496L574669
3661G81908810K928615K384007J754164J687468K325952K115309J989305K889573L006816
3679.4H02990019K489806J997530J496196J202941J397073J927674K109885J717925
3695.7H17329049J078487O67274Q43048J192450R06944K36571L3558Q16285J579762
3714H24683428J312613O48320J73509R6679L87847P38919O68824J3470n78701j53363
3734.4H27991545J155615J447916M63486n59449n72563K91109K73288K54452J146197
$$ y = [647305846, 653866827, 660379171, 666519642, 672913074, 680296004, 687085569, 692345858, 696921527, 702858925, 710375905, 716856718, 722580373, 728170395, 733493030, 738515794, 742998898, 746689022, 750049055, 754769564, 760892332, 765830338, 769732833, 774009645, 778334141, 781908810, 784837425, 787221432, 788975596, 790663064, 792989016, 795104325, 797093630, 799983203, 802990019, 805479825, 807477355, 808973551, 810176492, 811573565, 813501239, 815611124, 817329049, 818407536, 819074810, 819917858, 821110308, 822017252, 822253823, 822287381, 823103666, 824683428, 825996041, 826644361, 826817870, 826914549, 827302396, 828041315, 828710139, 828723609, 828144908, 827991545, 829147160, 830595076, 831058562, 830499113, 829926550, 830217659, 830490947, 830745399, 831891596]
3752.8H31891596J277745O18517L31343N96523N31375J61767R7275K69354N61595O79314
3773.2H37016404L48389K0623J6332J94072K14816J83880L38256M04299J11162l61442
3793.6H38486791n24223l07679l77953l26515M15027N75781N01454O45995K90275m57108
3814H38921845p63595l55482j97709K16007P41542N08189K00987K4795k03550l60250
3834.4H38732779m79460l88026K27392P74741Q78274N13792l02255j282573j523673
3852.7H37150991K96414J483977Q86500k4379n70297l50177m1008j86205o437M55021
3873.1H39094400N66364K27451l00229k36272J00732R7274J11103n7518j19031K93732
3893.5H39778006K38895m31358p60973m29332J10567O95467P81774L41356n722j93358
$$ y = [831891596, 833169341, 833787858, 834119201, 834715724, 835247099, 835408866, 835506141, 835775495, 836337090, 837016404, 837364793, 837385416, 837401748, 837595820, 837810636, 837994516, 838332772, 838737071, 838848233, 838486791, 837962568, 837654889, 837276936, 836950421, 837365448, 837941229, 838442683, 839088678, 839378953, 838921845, 838158250, 837802768, 837605059, 837821066, 838562608, 839070797, 839271784, 839296579, 839093029, 838732779, 838253319, 837865293, 838092685, 838867426, 839745700, 840259492, 839957237, 838674664, 837150991, 837447405, 838931382, 839817882, 839793503, 839223206, 838873029, 838832021, 838645816, 838639379, 839094400, 839660764, 839888215, 839587986, 839351714, 839452446, 839549720, 839660823, 839603305, 839484274, 839778006, 840016901, 839585543, 838824570, 838395238, 838505805, 839201272, 839983046, 840324402, 840318680, 840125322]
3913.9H40125322l49581k07245J13904J41382L7015J03891O8128j50442m9532L07203
3934.3H40140045K67446p7665k41280j12116O0856L6776j4305P6235J53422J09255
3954.7H40398669M3631L3200J4126K7835N6684K4677K443K7597N5015P9275J08778
3977.1H40871930Q8036J22070J86801Q0765o8724n0605K5928L398J311O0856
3997.5H41321766
$$ y = [840125322, 839775741, 839568496, 839682400, 839823782, 839860797, 839964688, 840032816, 839882374, 839832842, 840140045, 840407491, 840329826, 840088546, 839976430, 840037286, 840074062, 840059757, 840135992, 840289414, 840398669, 840442300, 840475500, 840489626, 840517461, 840574145, 840598822, 840601265, 840628862, 840683877, 840763152, 840871930, 840959966, 841082036, 841268837, 841349602, 841280878, 841230273, 841256201, 841259599, 841260910, 841321766]
##END=$$ End of the data block
