##TITLE=$$ Begin of the data block
##JCAMP-DX=5.00 $$ ACD/SpecManager v 10.08
##SPECTROMETER/DATA SYSTEM=Alpha
##DATE=10 Apr 2014 09:27:12
##DATA TYPE=INFRARED SPECTRUM
##DATA CLASS=XYDATA
##ORIGIN=
##OWNER=
##NPOINTS=1765
##FIRSTX=399.75695801
##LASTX=3997.56933594
##MAXX=3997.56933594
##MINX=399.75695801
##MAXY=0.87090272
##MINY=0.32479089
##XFACTOR=1.0000000000
##YFACTOR=1.000000000000000e-9
##FIRSTY=0.68858159
##DELTAX=2.03957629
##XUNITS=1/CM
##YUNITS=ARBITRARY UNITS
##XYDATA=(X++(Y..Y))
399.8F88581586l717423j927316J205266j321256m734457j418054J949489j005650
416.1F77612185l318548M99606N23746l561556k626181J462877J83761l541886j290679
434.4F65943325K398014n59628l556371J76668K459824j972258l160953J391708J788795
452.8F64909124k683043k381146J890778J10090l581404j139164K036512q54850l398180
471.1F54908717K36213J991510k222538l291368J160800J829863k538085k178133K033890
489.5F51930869Q20994l354669j763045J625478o59287l607035n04374K109229j146137
507.9F45452023l028512M09185J538516k290428k944887J047909R88722k839803k455831
526.2F35876894J112938N722l189325j499355J556515l13282k837419n68867J615346
$$ y = [688581586, 684864163, 682936847, 684142113, 682820857, 678086400, 676668346, 678617835, 677612185, 674293637, 674793243, 675316989, 671755433, 669129252, 670592129, 670775890, 667234004, 665943325, 668341339, 667781711, 664225340, 664402008, 666861832, 664889574, 661728621, 663120329, 664909124, 662226081, 659844935, 661735713, 661845803, 658264399, 657125235, 659161747, 658306897, 654908717, 655144930, 657136440, 654913902, 651622534, 652783334, 654613197, 652075112, 649896979, 651930869, 652751863, 649397194, 647634149, 649259627, 648600340, 644993305, 644488931, 646598160, 645452023, 642423511, 642832696, 644371212, 642080784, 639135897, 640183806, 641172528, 638332725, 635876894, 636989832, 636995554, 633806229, 632306874, 633863389, 633550107, 630712688, 630143821, 631759167]
544.6F31759167r87947k779961J04606J453042j560986k527058M62592R03964k260924
562.9F24566495k568602J18136m30524l192127k334177Q4817j022458l014505j485348
581.3F10721707M95971r57847k390206m75526J207590j68144q48174J200556J925171
599.6F10711098o2824p11917J020669J381517l31581o95467N38647L89398m00186J029789
620F12869143L035248K796590J900196K902985L898442K751827J770377K736628L036261
638.4F37697697J319468K71737J130343J822114J312732R13978Q43048J08898k1398
656.7F45398617J962006L786564L212750J593232J360774K923131K715468K116442
673.1F65068984K696931K824724K131224J994729K331197J928687J358032J633048
$$ y = [631759167, 630771220, 627991259, 628095865, 629548907, 627987921, 625460863, 625923455, 626827419, 624566495, 621997893, 622116029, 621685505, 618493378, 616159201, 616244018, 615221560, 612207055, 610721707, 611217678, 610259831, 607869625, 607394099, 608601689, 608433545, 607585371, 608785927, 610711098, 610648274, 609936357, 610957026, 612338543, 612006962, 611311495, 611850142, 612239540, 611839354, 612869143, 615904391, 618700981, 620601177, 623504162, 627402604, 630154431, 631924808, 634661436, 637697697, 639017165, 639288902, 640419245, 642241359, 643554091, 644468069, 645311117, 645420015, 645398617, 647360623, 651147187, 654359937, 655953169, 657313943, 660237074, 662952542, 665068984, 667765915, 670590639, 672721863, 674716592, 677047789, 678976476, 680334508, 681967556]
689.4F81967556J828731J096785N82695R45210J115680P11501Q87036J701176J761556
707.7F92597926J285970J682639K378345J915395J147270J732707K629399K029181
724G07398832J339674K033174K510190J621783J111984J894116K019167Q98242P50304
742.4G21577466J932024K043725J025617J226544K375662K137363J005888J368523
758.7G34692812K413809J653254K86341Q06928J596272M09543r11772l51548J14858
777.1G40710497j294911k246976j154244m34339j204431r12607J313627K766073K651453
795.4G40194142L613770N688012N846083M228949L910959M685640L629268J542091
811.7G73338914J374662K016485O99043j253247j395822j299918l082871m746437m165828
$$ y = [681967556, 683796287, 684893072, 685475767, 686420977, 687536657, 688248158, 689135194, 690836370, 692597926, 693883896, 695566535, 697944880, 699860275, 701007545, 702740252, 705369651, 707398832, 708738506, 710771680, 713281870, 714903653, 716015637, 717909753, 719928920, 720827162, 721577466, 723509490, 725553215, 726578832, 727805376, 730181038, 732318401, 733324289, 734692812, 737106621, 738759875, 739046216, 739853144, 741449416, 741858959, 740947187, 740595639, 740710497, 739415586, 737168610, 736014366, 735580027, 734375596, 733462989, 734776616, 737542689, 740194142, 743807912, 749495924, 755342007, 759570956, 763481915, 768167555, 771796823, 773338914, 774713576, 776730061, 777429104, 776175857, 774780035, 773480117, 770397246, 765650809, 761484981]
830.1G61484981l418327m305243m732371l332197k398610l196180l342688j511991
846.4G35247374K73823J170934L054618O082416P798552P761002Q052111Q758425P996619
864.8G86195874O106913N177379M860818L376901J633049J413583J539946K19583j337707
883.1H09186339j499176j423537k347052k898396j989066r70841p18593o9678J297832
901.5G98567832J881241J344264R85026J000703L45051r45807j773715k148270k836347
919.8G96419978l374457k879918j804173r62615k50399M33862O37949L40104J27494
938.2G88687825J76490J05619j06454k38955n42819j242757k046049k817809l891707
956.6G78083384n261004o459236p545412q969605j0550916j1657893j2166977j2244881
$$ y = [761484981, 758066654, 753761411, 749029040, 745696843, 743298233, 740102053, 736759365, 735247374, 735521197, 736692131, 739746749, 745829165, 753627717, 761388719, 769440830, 778199255, 786195874, 792302787, 797480166, 802340984, 805717885, 807350934, 808764517, 810304463, 810524046, 809186339, 807687163, 806263626, 803916574, 801018178, 799029112, 798058271, 797339678, 797270000, 798567832, 800449073, 801793337, 802778363, 803779066, 804124117, 803178310, 801404595, 799256325, 796419978, 793045521, 790165603, 788361430, 787398815, 787148416, 787582278, 788220227, 788560331, 788687825, 788864315, 788969934, 788863480, 788624525, 788081706, 786838949, 784792900, 781975091, 778083384, 772822380, 766363144, 758817732, 749848127, 739297211, 727639318, 715472341, 703227460]
972.9G03227460j1520683r822965q011937o825030n886138m811048m106641l982901
989.2F48260117l652335k831399k318561k357066k151012j575291j625956k525329
1005.5F29223168l353655l934622m958034o134987o423771o024420n976379o098211
1021.8E86319089n587280m881739m763663m696727l874958k857566k472043k205908
1038.1E54979205j423836q68559j181304j591384j420141j246631j424014j006902
1054.5E44816434N64039K183557K813637L030717L222287K555132J025736O2287K01166
1072.8E60474992L50654O9201J79708O85811M66406n32746j164436j231671j398504
1091.2E57899415j189172L23355K325476L260254L302873L629446L998875L534496
$$ y = [703227460, 691706777, 681883812, 673871875, 667046845, 661160707, 656349659, 652243018, 648260117, 644607782, 641776383, 639457822, 637100756, 634949744, 633374453, 631748497, 629223168, 625869513, 621934891, 616976857, 610841870, 604418099, 598393679, 592417300, 586319089, 580731809, 575850070, 571086407, 566389680, 562514722, 559657156, 557185113, 554979205, 553555369, 552686810, 551505506, 549914122, 548493981, 547247350, 545823336, 544816434, 545380473, 547564030, 550377667, 553408384, 556630671, 559185803, 560211539, 560273826, 560474992, 560825646, 560894847, 561074555, 561760366, 562226772, 561694026, 560529590, 559297919, 557899415, 556710243, 557033598, 559359074, 562619328, 565922201, 569551647, 573550522, 577085018]
1107.5E77085018K781570K762556K916277K066314N33342p69675j811385k128064p26819
1125.8E82709134J714646L338695L022373J767516J728535K787947L329337L335595
1142.2F03733778L327966K743244J558423J017153J520872J946509J895309K438008
1158.5F20181262L891588N212664O088555P290006Q673429R096027Q558869Q225501
1174.8F77217901Q137464P328391N961299N023241M166186K269387k37703k137720
1191.1G07728446l517747m936397n739213n120515l802061k969087k567052k162755
1207.4F76913619k259970l189981m081964m240215m164875m328787m221618l518820
1223.7F46907389k841592k516389k020061j150369m82798k27630J08063N93484P20143
$$ y = [577085018, 579866588, 582629144, 585545421, 587611735, 588145077, 587375402, 585564017, 583435953, 582709134, 584423780, 587762475, 590784848, 592552364, 594280899, 597068846, 600398183, 603733778, 607061744, 609804988, 611363411, 612380564, 613901436, 615847945, 617743254, 620181262, 624072850, 629285514, 635374069, 642664075, 651337504, 660433531, 668992400, 677217901, 685355365, 692683756, 698645055, 703668296, 707834482, 710103869, 709866166, 707728446, 704210699, 699274302, 693535089, 688414574, 684612513, 681643426, 679076374, 676913619, 674653649, 671463668, 667381704, 663141489, 658976614, 654647827, 650426209, 646907389, 644065797, 641549408, 639529347, 638378978, 637896180, 637668550, 637776613, 638370097, 639090240]
1242.1F39090240M29928J81258R0480j46866n19395n89728k45035K03490P39634J604140
1262.5F40838146K663136L491699L995061M511714N057693N272508N206644N231857
1278.8F76268458N419851N512893N445301N451620N494058N242527M684925M152417
1295.1G17672050L766835L297746K753735K433955K327979K188921J933217J715123
1311.4G38089561J683832J624584J485705J559913J699567J567364J230419R12726
1327.8G49853671O59763K97308k31504o15299n78880j93179J22249K33412L69609M22477
1348.1G50339627K81334J36972Q4757p8976n12302j048624j375198j428128j446724
1366.5G44952738j245379r41336j210273j631915j534462j545131k102971k691985
$$ y = [639090240, 639520168, 639701426, 639791906, 639645040, 639125645, 638535917, 638290882, 638494372, 639234006, 640838146, 643501282, 646992981, 650988042, 655499756, 660557449, 665829957, 671036601, 676268458, 681688309, 687201202, 692646503, 698098123, 703592181, 708834708, 713519633, 717672050, 721438885, 724736631, 727490366, 729924321, 732252300, 734441221, 736374438, 738089561, 739773393, 741397977, 742883682, 744443595, 746143162, 747710526, 748940945, 749853671, 750513434, 750810742, 750579238, 749963939, 749385059, 749191880, 749314129, 749547541, 749917150, 750339627, 750620961, 750757933, 750842690, 750763714, 750251412, 749202788, 747827590, 746399462, 744952738, 743707359, 742766023, 741555750, 739923835, 738389373, 736844242, 734741271, 732049286]
1382.8G32049286k651929k103806j640737j622677j870573j967608j939714k098263
1399.1G16153979k107322k228141k495765k297759j986921j818359j692891j686275
1415.5F99840546j535297o83427K7597J98663N18918O78241Q41200J176715J215637
1433.8G02278793J632273K553582K430201K075612J832009J597345J854300K208889
1450.1G18463004J992344J645327K819002N731404N306661L903806M368663N217790
1466.4G49448001M602790M251123N829811O992221N844533M252076K988577K090931
1482.8G86300063R85325k33710r44257p60257q51930j992046l174067l005862k639771
1501.1G73683488l168463n067110p096053m432082l091335l878117m370927l958941
$$ y = [732049286, 729397357, 727293551, 725652814, 724030137, 722159564, 720191956, 718252242, 716153979, 714046657, 711818516, 709322751, 707024992, 705038071, 703219712, 701526821, 699840546, 698305249, 697621822, 697649419, 697848082, 698367000, 699045241, 699886441, 701063156, 702278793, 703911066, 706464648, 708894849, 710970461, 712802470, 714399815, 716254115, 718463004, 720455348, 722100675, 724919677, 730651081, 735957742, 739861548, 744230211, 749448001, 754050791, 758301914, 764131725, 771123946, 776968479, 781220555, 784209132, 786300063, 787285388, 787051678, 786107421, 785347164, 784495234, 782503188, 779329121, 776323259, 773683488, 770515025, 765447915, 758351862, 753919780, 750828445, 746950328, 742579401, 738620460]
1517.4G38620460l115416k832829k108217j574993j661777j654089j915753j902640
1533.7G21854746j372993j748263k295733o47664O84977O89029N75841P09653Q52465
1552.1G19302058O02842J04427M49896K279103J515567J77979o48796j709938k419770
1570.5G19653368k427340l497421n400360n188405m863799n906642o921112p504106
1586.8F77944183p723331p968307q310258q462250q123517p857263q057952q030653
1603.1F13410652p560432p426560p651687p328987o730735p212878p806539n736113
1619.4E55956721m668891n218506m831433l950596l208280k622187k496362j613855
1635.7E27346611O04391J423419J541435J813293L217220M885018L718674M395187
$$ y = [738620460, 735505044, 732672215, 730563998, 728989005, 727327228, 725673139, 723757386, 721854746, 720481753, 718733490, 716437757, 715790093, 716475070, 717164099, 717739940, 718449593, 719302058, 719904900, 720009327, 720459223, 722738326, 724253893, 724431872, 723783076, 722073138, 719653368, 717226028, 713728607, 708328247, 703139842, 698276043, 692369401, 685448289, 677944183, 670220852, 662252545, 653942287, 645480037, 637356520, 629499257, 621441305, 613410652, 605850220, 598423660, 590771973, 583442986, 576712251, 569499373, 561692834, 555956721, 551287830, 546069324, 541237891, 537287295, 534079015, 531456828, 528960466, 527346611, 527951002, 529374421, 530915856, 532729149, 535946369, 540831387, 544550061, 548945248]
1652E48945248Q855045P230043N227626N927682P628023Q140326O634831P254184R472191
1670.4F15315199Q514345Q406102R680569Q435488O859482P524549J1574746J0810613
1686.7F87121093Q019984P996619P216155P419825Q353591R014308J1415184R144306
1703G55701065O747067P064939O314754M779399L324091K741516L789007M003287K586901
1721.4G97052026K089262K453923K138972J508951J345337K258897K983093K168000
1737.7H13998461K237797K878129K732694K422631K747059L612161L924310L116905
1754H37670147K660752K462208J718283J566767J892031J413822N22554K05278R21548
1772.4H51033390J619458J170516P44998R06348R31085O09696O13987N67198N6982
$$ y = [548945248, 557800293, 565030336, 570257962, 576185644, 583813667, 591953993, 598588824, 605843008, 615315199, 623829544, 632235646, 641916215, 650351703, 657211185, 664735734, 676310480, 687121093, 695141077, 703137696, 710353851, 717773676, 726127267, 735141575, 746556759, 755701065, 762448132, 769513071, 775827825, 780607224, 783931315, 786672831, 790461838, 794465125, 797052026, 799141288, 801595211, 803734183, 805243134, 806588471, 808847368, 811830461, 813998461, 816236258, 819114387, 821847081, 824269712, 827016771, 830628932, 834553242, 837670147, 840330899, 842793107, 844511390, 846078157, 847970188, 849384010, 849906564, 850111842, 851033390, 852652848, 853823364, 854568362, 855474710, 856405795, 857015491, 857629478, 858196676, 858253658]
1790.7H58253658J80661R23038R60767M32194K67267P41362Q87633M07457K7359L35157
1811.1H63416553P08878M71949K07663L84390L40045p5877j18256J35720K58148N24759
1831.5H66253972O23584M51922L12805R0719j89960j53721L50058N63741M99785M21286
1851.9H69224191J96576L6478J03891J77443N8651j25230l07619k34187K93076N93066
1872.3H70016336M31598J45733l2663K5212J27316r477k17259j47998J62839J49668
1892.7H70651305n0545R8646K03311l4869j44064J8060o437j71423k1696J79648p0333
1915.1H70651603m19557k19703J11222R2566J9193O2287Q7797r6500k77638j31011
1935.5H69880259J1623k79427n48720j82271J90854m2558k89976j30713k2412k25603
$$ y = [858253658, 858434319, 859357357, 860318124, 860750318, 861017585, 861758947, 862646580, 863054037, 863081396, 863416553, 864125431, 864597380, 864805043, 865189433, 865529478, 865453601, 865335345, 865471065, 865729213, 866253972, 866877556, 867329478, 867642283, 867733002, 867543042, 867389321, 867739379, 868303120, 868802905, 869224191, 869420767, 869457245, 869561136, 869738579, 869797230, 869672000, 869364381, 869130194, 869423270, 870016336, 870447934, 870593667, 870561004, 870586216, 870713532, 870704055, 870486796, 870338798, 870501637, 870651305, 870600760, 870699406, 870902717, 870867848, 870723784, 870741844, 870735407, 870563984, 870542288, 870721936, 870651603, 870232046, 870012343, 870123565, 870216131, 870235324, 870297611, 870385408, 870288908, 870011270, 869880259, 869891882, 869612455, 869063735, 868881464, 869072318, 869029760, 868739784, 868609071, 868586659, 868361056]
1955.9H68361056k93434n7816k7955l77417m88042p0513J09613k32815l20435j9789
1976.3H66582453j7464l41475l11434K1577n2750m25637l91245J2100N4955k67386
1996.7H64863694k60592R54j15454l91007k54273l457j81139m42385k88070n8233j80424
2019.2H62689614l32415j12951N4658k03610l59356j04666J9014k19583l06368n5611
2039.6H61068726L6537j96874k51591l100M8936k08557k36571J8478J4841k07185j79947
2062H59903693M2141M2379j47283j16230J06156O5625j46806n4002J73628P1287j46150
2084.4H59794438m8876J28269M7624o6638N5314J61945M0055n0605N1320J31309L4332
2106.9H60278487n2929L3498J22249M6969j7464Q0704J48714P3492M4406J09434J16348
$$ y = [868361056, 868067622, 868009806, 867981851, 867604434, 867116392, 867045879, 867155492, 866922677, 866602242, 866582453, 866564989, 866223514, 865912080, 865933657, 865880907, 865455270, 865064025, 865076125, 865131080, 864863694, 864603102, 864604056, 864488602, 864097595, 863843322, 863839865, 863658726, 863216341, 862928271, 862870038, 862689614, 862357199, 862244248, 862298906, 862095296, 861735940, 861631274, 861650288, 861430705, 861124337, 861068726, 861105263, 860908389, 860656798, 860653698, 860702634, 860494077, 860257506, 860275984, 860290825, 860083640, 859903693, 859945834, 859988213, 859840930, 859724700, 859830856, 859896481, 859749675, 859695673, 859869301, 859940588, 859794438, 859745562, 859873831, 859921455, 859854817, 859910131, 860072076, 860112131, 860061526, 860112846, 860244155, 860278487, 860225558, 860259056, 860381305, 860428274, 860410810, 860491514, 860640228, 860713720, 860758126, 860867560, 860983908]
2129.3H60983908N8353O0499J37746J50144Q4818P3850J28925J54197J48415J37747
2149.7H62118602J12772J16527J43111J54495J47641J42633J57118J45316R6202J36674
2170.1H63471091K28047J92106J12712J55628K31326J55747M5240J14202J98543Q0645
2190.5H64985287k7299J05024K30789J01924j8537J28388K18272J7405q9169J00673
2210.9H65752757J86920j3232o7413J64151K14219k1160o8843J74463K00450q7023
2231.3H66435289j21653J59383J72794r3281p5579J94132J37508j87754j42396J98424
2251.7H66676867J45793j87635j17422J84596R4056j71244k9445K27332L1412k19107
2272.1H66635203j847K26438O199j52708J44542K91645p6711k90751K2709J78814j79887
$$ y = [860983908, 861042261, 861102760, 861240506, 861390650, 861475468, 861549318, 861678243, 861832440, 861980855, 862118602, 862231374, 862347901, 862491012, 862645507, 862793148, 862935781, 863092899, 863238215, 863334417, 863471091, 863699138, 863891244, 864003956, 864159584, 864390910, 864546657, 864591897, 864706099, 864904642, 864985287, 864957988, 865063012, 865293801, 865395725, 865377188, 865505576, 865723848, 865741253, 865652084, 865752757, 865939677, 865926445, 865859032, 866023183, 866237402, 866216242, 866147399, 866321862, 866522312, 866435289, 866313636, 866473019, 866645813, 866552532, 866476953, 866671085, 866808593, 866620839, 866478443, 866676867, 866822660, 866635025, 866517603, 866702199, 866796255, 866625011, 866595566, 866822898, 866854310, 866635203, 866633356, 866859794, 866865993, 866713285, 866857827, 867149472, 867072761, 866782010, 866804719, 866983533, 866803646]
2294.5H66803646l19540O7234J55329k77757m17650r7632o8248m19795l52025P6234
2314.9H65149796n8889o32167o19293m1306L9816m10556m08352K9981m9412m57287
2335.3H62542331k86042J53064P3314K8074P53879J042366J34886r16362j129210p82490
2355.7H61613810p85589o15776K03848P78914O77645O89804J083732J159966P78317
2374H65584671O78599R86457R66132N12004L16799M51862L05474j00911j41918J72138
2394.4H69731307J90675j38938j39177J74940J06632k04265j25944J55210P1049j86324
2414.8H69635165q3149J28210o0380k90632p5817J30177q0526k17319l517Q5593j45018
2437.3H69022787k61009m9353Q3626j07170k16305k8133L9637j44720j56343L1173
$$ y = [866803646, 866484106, 866551340, 866706669, 866428912, 866011262, 865913630, 865845382, 865425587, 865073562, 865149796, 865090907, 864458740, 863839447, 863798141, 863837957, 863427401, 863019049, 863049030, 862999618, 862542331, 862256289, 862409353, 862482667, 862510741, 863264620, 864306986, 864441872, 863525510, 862396300, 861613810, 860828221, 860212445, 860416293, 861195207, 861872852, 862562656, 863646388, 864806354, 865584671, 866263270, 867249727, 868215859, 868727863, 869044662, 869496524, 869801998, 869701087, 869559169, 869731307, 869921982, 869783044, 869643867, 869818807, 869925439, 869721174, 869595230, 869750440, 869821489, 869635165, 869552016, 869680226, 869619846, 869329214, 869253397, 869383574, 869303048, 869085729, 869082212, 869167805, 869022787, 868761778, 868712425, 868796051, 868688881, 868472576, 868444443, 868484080, 868339360, 868183017, 868214190]
2457.7H68214190J0431j89841j75834m708o2407k41339j65045L1352m5776k53737j87755
2480.1H66929531l4511j23024k08914p5996J252j47343k19166o4552m590j56104k00093
2502.5H65696490o4016m9412j50740j03414J2875p0990k33948j60098L338n7697j85371
2525H64637017j17957l7074j43171k05457p5579k1100j58131j75953j3292k5987k03192
2547.4H63460124j80245j0073m2975k12252j69575R656m9830k41280j52707M4287p9096
2569.8H62376034l02791k05517k7955j67072l37064j68860k6941k21193l55005j85490
2590.2H60378146p6771k70962l94166k01106j17063l56496m38511j92106j47521m08948
2610.6H57774496m36962j74939j56701m25935m23550j40250j70529m66466m34637j54376
$$ y = [868214190, 868224621, 868034780, 867858946, 867854238, 867791831, 867550492, 867385447, 867416799, 867371023, 867117286, 866929531, 866895020, 866771996, 866563082, 866487086, 866488338, 866340995, 866121829, 866057277, 866052687, 865896583, 865696490, 865632474, 865583062, 865432322, 865328908, 865341783, 865270793, 865036845, 864876747, 864880085, 864822388, 864637017, 864519060, 864481986, 864338815, 864133358, 864057779, 864036679, 863878548, 863702595, 863689303, 863663316, 863460124, 863279879, 863269806, 863226831, 863014579, 862845004, 862854660, 862804830, 862563550, 862410843, 862455130, 862376034, 862073243, 861867726, 861839771, 861672699, 861335635, 861166775, 861139834, 860918641, 860563636, 860378146, 860301375, 860030413, 859636247, 859435141, 859318078, 858961582, 858523071, 858330965, 858183444, 857774496, 857337534, 857162595, 857005894, 856579959, 856156409, 856016159, 855845630, 855379164, 854944527, 854790151]
2631H54790151j78635m20749l56138j16289k23219m67062l37720j17540k76268m68075
2651.4H51828456k80738j09851l32475n15699k80083q1062k90930m58420k44617r7036
2671.8H49137545l20852m46379k12312j26958m25935n44309k51472j43350m09722m79877
2692.2H45776379k22027j88708m60625m99487k57075k44439m80532m54605k41041l32177
2712.6H42395663n46813m36067k12133l00765m98474l67165j77502l72112n90622m21346
2733H38472664j98006l05772m93825l73184j70946k63334m02093l02851k85923n14806
2753.4H35161924n59866l33369k91705m98831n60105l91066l55721n48482n53608l38554
2773.8H30730617l94821o80089p04169n05090m76241n97656n72205m92930o13511p61032
$$ y = [854790151, 854611516, 854190767, 853834629, 853718340, 853495121, 853028059, 852690339, 852572799, 852296531, 851828456, 851547718, 851437867, 851105392, 850589693, 850309610, 850228548, 849937618, 849479198, 849234581, 849137545, 848816693, 848370314, 848158002, 848031044, 847605109, 847060800, 846809328, 846665978, 846256256, 845776379, 845554352, 845365644, 844905019, 844405532, 844148457, 843904018, 843423486, 842968881, 842727840, 842395663, 841848850, 841412783, 841200650, 840899885, 840401411, 840034246, 839856744, 839484632, 838894010, 838472664, 838274658, 837968886, 837475061, 837101877, 836930931, 836667597, 836265504, 835962653, 835676730, 835161924, 834602058, 834268689, 833976984, 833478153, 832918048, 832526982, 832171261, 831622779, 831069171, 830730617, 830335796, 829655707, 828951538, 828446448, 827970207, 827372551, 826800346, 826307416, 825693905, 824932873]
2794.2H24932873o91533o10530p55251q96930q45135p62641p94232r11891r46820q98421
2814.6H16819489r65297j059473j019537j007796j148521j277030j295269j352846
2830.9H07693720j534164j754344k000093k436280l198386m213750n358159o145478
2847.2G81053066n504668l186583o88255N76496P42197M30107j08718p51198j386642
2865.6G71175802j904309k108276j928270j658976j493990j291335j071513j031756
2881.9G58687377j183331j358330j509488j707196j841545j818359j828730j978874
2898.2G45461524k092123k113581k211929k542913l111004l881574m955769o014645
2914.5G18537986o015420m460632k247572n15879M78149J120329J595914J713097J713872
$$ y = [824932873, 824241340, 823630810, 822875559, 821978629, 821133494, 820370853, 819576621, 818664730, 817717910, 816819489, 815854192, 814794719, 813775182, 812767386, 811618865, 810341835, 809046566, 807693720, 806159556, 804405212, 802405119, 799968839, 796770453, 792556703, 787198544, 781053066, 775548398, 772361815, 771673560, 772250056, 772992253, 773422360, 773313642, 772562444, 771175802, 769271493, 767163217, 765234947, 763575971, 762081981, 760790646, 759719133, 758687377, 757504046, 756145716, 754636228, 752929032, 751087487, 749269128, 747440398, 745461524, 743369401, 741255820, 739043891, 736500978, 733389974, 729508400, 724552631, 718537986, 712522566, 708061934, 705814362, 705298483, 705776632, 706896961, 708492875, 710205972, 711919844]
2932.9G11919844K060115K523602K714037K730847K640903K208888J417339O65665
2949.2G28881240K67804J3291k13503q7381M15743Q96573J099228J229167J487196
2967.6G33989358J659572J646578J593173J531422J469493J364171J169086J060724
2983.9G45483577J103759J119316J090944J029014P77960M46141K03728L398j78635
3002.2G51079202l94464n41389m45187l31998m45783o22511p11620q27968r84847r78351
3022.6G44795084r10282j102150j339018j264989j069367j199782j531840j480579
3038.9G34897077j234829j351655j663208j756787j643777j639307j722514j655519
3055.3G22229481j609803j704037j700699j519680j352489j426101j630604j626670
$$ y = [711919844, 713979959, 716503561, 719217598, 721948445, 724589348, 726798236, 728215575, 728881240, 729149044, 729162335, 728948832, 728861451, 729277194, 730173767, 731272995, 732502162, 733989358, 735648930, 737295508, 738888681, 740420103, 741889596, 743253767, 744422853, 745483577, 746587336, 747706652, 748797596, 749826610, 750604570, 751050711, 751254439, 751257837, 751079202, 750684738, 750143349, 749698162, 749366164, 748920381, 748297870, 747586250, 746758282, 745773435, 744795084, 743884802, 742782652, 741443634, 740178645, 739109278, 737909496, 736377656, 734897077, 733662248, 732310593, 730647385, 728890598, 727246821, 725607514, 723885000, 722229481, 720619678, 718915641, 717214942, 715695262, 714342773, 712916672, 711286068, 709659398]
3071.6G09659398j476467j397014j383245j424610j498163j605094j716733j662671
3087.9F97495401j567662j713931j858831j722157j604199j773954j955509j898229
3104.2F83400929j801133j844466j954257j933277j833022j910627k071619k231180
3120.5F67821348k446115k513349k368987k252340k342046k524793k487838k292693
3136.8F48593187k354324k686798k851129k739668k668380k638877k569318k713978
3153.2F27370715l033161l120899k986670k932489k992868l046393l067554l086209
3169.5F03104472l101587l108382l128231l172338l185689l153086l112137l108561
3185.8E78034461l129423l121257l130138l206253l274500l212095l087043l073454
$$ y = [709659398, 708182931, 706785917, 705402672, 703978062, 702479899, 700874805, 699158072, 697495401, 695927739, 694213808, 692354977, 690632820, 689028621, 687254667, 685299158, 683400929, 681599796, 679755330, 677801073, 675867796, 674034774, 672124147, 670052528, 667821348, 665375233, 662861884, 660492897, 658240557, 655898511, 653373718, 650885880, 648593187, 646238863, 643552065, 640700936, 637961268, 635292888, 632654011, 630084693, 627370715, 624337554, 621216655, 618229985, 615297496, 612304628, 609258235, 606190681, 603104472, 600002885, 596894503, 593766272, 590593934, 587408245, 584255159, 581143022, 578034461, 574905038, 571783781, 568653643, 565447390, 562172890, 558960795, 555873752, 552800298]
3202.1E52800298l135443l105342l043056l050923l021419k950728k941430k955496
3218.4E28596461k943874k948880k938330k881110k806723k724051k700866k781391
3234.7E05871236k808571k720236k653271k609134k522171k457320k485067k495468
3251.1D85119998k419322k335102k306342k309799k281666k251744k234519k180725
3267.4D66800779k101213k123236k226413k263009k239287k180994k119571k110958
3283.7D49436098k163082k196252k119542k045393k093136k198368k293527k312571
3300D32014227k199650k065360k124817k371668k563328k568692k477407k423525k418041
3318.4D10801739k419472k397895k382994k506554k663702k649724k565175k442062
$$ y = [552800298, 549664855, 546559513, 543516457, 540465534, 537444115, 534493387, 531551957, 528596461, 525652587, 522703707, 519765377, 516884267, 514077544, 511353493, 508652627, 505871236, 503062665, 500342429, 497689158, 495080024, 492557853, 490100533, 487615466, 485119998, 482700676, 480365574, 478059232, 475749433, 473467767, 471216023, 468981504, 466800779, 464699566, 462576330, 460349917, 458086908, 455847621, 453666627, 451547056, 449436098, 447273016, 445076764, 442957222, 440911829, 438818693, 436620325, 434326798, 432014227, 429814577, 427749217, 425624400, 423252732, 420689404, 418120712, 415643305, 413219780, 410801739, 408382267, 405984372, 403601378, 401094824, 398431122, 395781398, 393216223, 390774161]
3334.7C90774161k290607k344698k557247k685011k708524k573818k346576k409249
3351C70858431k692461k744079k535969k344191k345204k362877k131015j931429k086461
3369.3C49684745k370089k383948k092093j840323j734555j685202j559228j301080
3385.7C34718227j006603p33226p53224j068592j110554o96540l71873o32584j022459
3404C27322572q16494l72708k21431k57671l60757l74377j28239J10716J59949L19063
3424.4C25380623O39409Q38190P72685Q14021J068741R86546O14286O21766J021474
3442.8C32757741J368940J572818J599908J569896J665533J851887K065956K211213
3459.1C46663892K123982K136052K557844K813011K394497J812905J862497K279222
$$ y = [390774161, 388483554, 386138856, 383581609, 380896598, 378188074, 375614256, 373267680, 370858431, 368165970, 365421891, 362885922, 360541731, 358196527, 355833650, 353702635, 351771206, 349684745, 347314656, 344930708, 342838615, 340998292, 339263737, 337578535, 336019307, 334718227, 333711624, 332978398, 332225174, 331156582, 330046028, 329349488, 328977615, 328345031, 327322572, 326506078, 326133370, 325911939, 325654268, 325293511, 324919134, 324790895, 324901611, 325061560, 325380623, 326020032, 326858222, 327630907, 328444928, 329513669, 330500215, 331114501, 331736267, 332757741, 334126681, 335699499, 337299407, 338869303, 340534836, 342386723, 344452679, 346663892, 348787874, 350923926, 353481770, 356294781, 358689278, 360502183, 362364680, 364643902]
3475.4C64643902K584189K665370K491475K437949K673954K745449K632201K750367
3491.7C85624856K962947L055185K926945K802492K974480K991676K664686K734214
3508D08737481L257393L570974L408790L107220L116876L339916L628314L600865L313035
3526.4D39080864L447235L777921L876358M017622M093587L847778L854990M180938
3542.7D70177293M384905M235297L969580M084379M439950M485607M383147M540264
3559E04700422M577518M157185M180253N550623O232262N385339M986167N297064N570531
3577.4E50637364N723179N787492N501806N419791O166995O557762N918443N828679
3593.7E97541511O415367O690085O634712O458223O011069N753815O272197O621420
$$ y = [364643902, 367228091, 369893461, 372384936, 374822885, 377496839, 380242288, 382874489, 385624856, 388587803, 391642988, 394569933, 397372425, 400346905, 403338581, 406003267, 408737481, 411994874, 415565848, 418974638, 422081858, 425198734, 428538650, 432166964, 435767829, 439080864, 442528099, 446306020, 450182378, 454200000, 458293587, 462141365, 465996355, 470177293, 474562198, 478797495, 482767075, 486851454, 491291404, 495777011, 500160158, 504700422, 509277940, 513435125, 517615378, 523166001, 529398263, 534783602, 539769769, 545066833, 550637364, 556360543, 562148035, 567649841, 573069632, 579236627, 585794389, 591712832, 597541511, 603956878, 610646963, 617281675, 623739898, 629750967, 635504782, 641776979, 648398399]
3610F48398399O525815O515562O119192O363392P396817O817579N287707M624069N974829
3628.4G04023361P433176O345630N677342N619109N340338N032182M523694L721297
3644.7G47716129L356695M703522O076514M915357L958762M362821M334331L500760
3661G82924891K860665K375066J806438J777291K305687J969993J891613K878010L001154
3679.4H03790808K476930J997352J533091J266003J395702J824081K030909J765490
3695.7H18080366J213014P76768Q61644J151443Q76844K09272q643Q06332J581430
3714H25548470J266360N82397J06395M8935M13775P91610P03394J02997m20928q8036
3734.4H29055369R99451J318574N54919m38690o15240J70231J56224K40982J254558
$$ y = [648398399, 654924214, 661439776, 667558968, 673922360, 681319177, 688136756, 693424463, 698048532, 704023361, 711456537, 717802167, 723479509, 729098618, 734438956, 739471138, 743994832, 747716129, 751072824, 755776346, 761852860, 766768217, 770726979, 775089800, 779424131, 782924891, 785785556, 788160622, 789967060, 791744351, 794050038, 796020031, 797911644, 800789654, 803790808, 806267738, 808265090, 809798181, 811064184, 812459886, 814283967, 816314876, 818080366, 819293380, 820070148, 820931792, 822083235, 822960079, 823169351, 823160708, 823967040, 825548470, 826814830, 827397227, 827503622, 827552557, 827966332, 828757942, 829461336, 829564333, 829143405, 829055369, 830054820, 831373394, 831928313, 831489623, 830874383, 831044614, 831200838, 831441820, 832696378]
3752.8H32696378J290381N24521K98083O64174O21915K68579J34587J91927N23388
3771.1H37213933P24078L26276j09196q1539K32458L34441K94030L72529L88920J31310
3791.5H39827240l17634n72443n01692n26845k74420M71711N78284N03719N68986K78890
3811.9H40035796l00944p10487m75287j28985M08828P33495L69370R6619K0623j60455
3832.3H39888573l18349m18663l31461K17140P14421Q61585M93526m10616j414001
3850.7H39282155j546502M01139J467705P57575o0320m64737k59698k5809k14815k9385
3871.1H39307308M88997N87880K01643l80874l00705J77502K15531J20759q3506m8221
3891.5H40286314L69847K35796m33683q22544n78106K4796P39753R57072N10275M0114
$$ y = [832696378, 833986759, 834511280, 834809363, 835473537, 836095452, 836364031, 836498618, 836690545, 837213933, 837938011, 838264287, 838155091, 838073552, 838306010, 838640451, 838934481, 839307010, 839695930, 839827240, 839509606, 838937163, 838435471, 837908626, 837634206, 838105917, 838684201, 839187920, 839756906, 840035796, 839734852, 839024365, 838549078, 838420093, 838828921, 839562416, 839931786, 840028405, 840049028, 839888573, 839570224, 839151561, 838820100, 839037240, 839751661, 840613246, 841106772, 840696156, 839282155, 837735653, 838136792, 839604497, 840362072, 840301752, 839837015, 839577317, 839551508, 839336693, 839307308, 839796305, 840384185, 840585828, 840204954, 839904249, 840081751, 840297282, 840418041, 840334535, 840286314, 840656161, 840891957, 840458274, 839635730, 839057624, 839082420, 839822173, 840779245, 841289520, 841329634]
3911.9H41329634k17676m16279k68817Q6785P9751R775J58131R4235j61410n6684K77937
3934.3H40915382K38240j0968j29461j46508q226J04130M9054L4273O2645P8320J01507
3956.7H41288388R0956K5511R179J9193k7120P629R8706Q4757O8427J03831O6638O8903
3981.2H41904998J65820J20699n9425j07766J4484Q1718M8936O8485
3997.5H42237949
$$ y = [841329634, 841111958, 840695679, 840426862, 840513647, 840593398, 840603173, 840761304, 840855539, 840694129, 840637445, 840915382, 841153622, 841142654, 841013193, 840866685, 840858459, 840962589, 841011643, 841045916, 841108561, 841186881, 841288388, 841379344, 841404855, 841414034, 841433227, 841406107, 841413736, 841512442, 841597199, 841665626, 841769457, 841836095, 841904998, 842070818, 842191517, 842132092, 842024326, 842038810, 842120528, 842169464, 842237949]
##END=$$ End of the data block
