##TITLE=$$ Begin of the data block
##JCAMP-DX=5.00 $$ ACD/SpecManager v 10.08
##SPECTROMETER/DATA SYSTEM=Alpha
##DATE=10 Apr 2014 09:27:12
##DATA TYPE=INFRARED SPECTRUM
##DATA CLASS=XYDATA
##ORIGIN=
##OWNER=
##NPOINTS=1765
##FIRSTX=399.75695801
##LASTX=3997.56933594
##MAXX=3997.56933594
##MINX=399.75695801
##MAXY=0.87103605
##MINY=0.32483742
##XFACTOR=1.0000000000
##YFACTOR=1.000000000000000e-9
##FIRSTY=0.69061148
##DELTAX=2.03957629
##XUNITS=1/CM
##YUNITS=ARBITRARY UNITS
##XYDATA=(X++(Y..Y))
$$ plain form
399.8 690611482 686514974 684679925 685982049 684230268 679000616 677607000 679570317 678309321
416.1 678309321 674635112 674891353 675626516 672422290 670272291 672299027 672539830 668661058 667211235
434.4 667211235 669377267 668521464 665037632 665221691 667273581 664995372 661865234 663353324 665114522
452.8 665114522 662530065 660499454 662306070 661840200 658082604 657235444 659525335 658662558 655074537
471.1 655074537 655226529 657153070 654745877 651454389 652783453 654744267 652361751 650261283 652150452
489.5 652150452 652796924 649484158 647803247 649397254 648797929 645246565 644624650 646620810 645451605
507.9 645451605 642553329 643112540 644622087 642326236 639497578 640626431 641583383 638646245 636087716
526.2 636087716 637060881 636951685 633647859 632070422 633750260 633550048 630639493 630002975 631704688
$$ packed form
399.8F90611482m096508j835049J302124j751781n229652j393616J963317j260996
416.1F78309321l674209K56241P35163l204226k149999K026736K40803l878772j449823
434.4F67211235K166032q55803l483832J84059K051890k278209l130138J488090J761198
452.8F65114522k584457k030611J806616m65870l757596q47160K289891q62777l588021
471.1F55074537J51992J926541k407193l291488J329064J960814k382516k100468J889169
489.5F52150452O46472l312766j680911J594007n99325l551364o21915J996160j169205
507.9F45451605k898276N59211J509547k295851k828658J128853R56952k937138k558529
526.2F36087716R73165j09196l303826j577437J679838k00212k910555o36518J701713
$$ plain form
544.6 631704688 630951107 628443182 628666461 630058289 628400862 625758588 626057088 626811922 624544978
562.9 624544978 622165799 622522533 622214019 618978620 616510093 616581976 615713716 612717152 611017346
581.3 611017346 611315310 610320687 608032525 607680619 608867466 608583331 607700288 608909786 610833466
599.6 610833466 610833406 610237300 611268818 612502158 612088501 611469567 612002194 612254143 611837804 613028049
620 613028049 616217554 619102418 621047199 623913944 627709091 630408823 632275939 635130703 638172030
638.4 638172030 639511645 639848769 640974998 642709374 643920660 644842327 645764649 645914137 645924270
656.7 645924270 647918463 651690900 654830992 656419158 657945096 661004245 663689017 665764511
673.1 665764511 668401003 671171308 673354685 675447226 677771509 679606557 680875301 682467163
$$ packed form
544.6F31704688p53581k507925K23279J391828j657427k642274K98500P54834k266944
562.9F24544978k379179L56734l08514l235399k468527P1883q68260k996564j699806
581.3F11017346K97964r94623k288162l51906J186847k84135q83043J209498J923680
599.6F10833466o0n96106J031518J233340m13657o18934N32627K51949m16339J190245
620F13028049L189505K884864J944781K866745L795147K699732J867116K854764L041327
638.4F38172030J339615L37124J126229J734376J211286R21667R22322J49488J0133
656.7F45924270J994193L772437L140092J588166J525938L059149K684772K075494
673.1F65764511K636492K770305K183377K092541K324283J835048J268744J591862
$$ plain form
689.4 682467163 684323013 685447872 686008513 686963975 688094854 688731074 689544499 691277921 693160295
707.7 693160295 694542766 696185589 698471129 700357616 701526761 703283429 705919445 708021641
724 708021641 709482729 711509407 713867486 715367496 716493547 718414009 720367491 721213877 722032249
742.4 722032249 724058628 726071477 727006078 728214145 730588198 732650518 733588815 735008299 737516940
760.8 737516940 739165485 739358723 740102232 741688430 742097735 741263986 741045356 741189301 739856541
779.1 739856541 737558305 736333668 735848427 734605074 733759105 735223532 738043606 740631759 744126201
797.5 744126201 749744594 755597234 759833336 763727665 768382370 772012830 773620248 775064945
813.8 775064945 777035594 777606249 776303768 774940670 773664951 770603240 765891612 761719644 758256853
$$ packed form
689.4F82467163J855850J124859N60641R55462J130879O36220Q13425J733422J882374
707.7F93160295J382471J642823K285540J886487J169145J756668K636016K102196
724G08021641J461088K026678K358079J500010J126051J920462J953482Q46386Q18372
742.4G22032249K026379K012849R34601J208067K374053K062320R38297J419484K508641
760.8G37516940J648545J93238P43509J586198M09305q33749k18630J43945j332760
779.1G39856541k298236j224637m85241j243353q45969J464427K820074K588153L494442
797.5G44126201N618393N852640M236102L894329M654705L630460J607418J444697
813.8G75064945J970649N70655j302481j363098j275719l061711m711628m171968l462791
$$ plain form
832.1 758256853 753940463 749284208 746063292 743673503 740416646 737103939 735693276 735995114 737110198
850.5 737110198 740122855 746208072 753998220 761702657 769748747 778571486 786559701 792584956
866.8 792584956 797703087 802510798 805830836 807473063 808940113 810488522 810660422 809270024 807756722
885.2 807756722 806354582 804041088 801150918 799141467 798150301 797413409 797339141 798648834 800558269
903.5 800558269 801942408 802926302 803888619 804206848 803216636 801385045 799229741 796416819 793049753
921.9 793049753 790188730 788430154 787500322 787242353 787622392 788164616 788422167 788541079 788753629
940.2 788753629 788884640 788768530 788516045 788010955 786820889 784786284 781951666 778027475 772713065
958.6 772713065 766238332 758744061 749786317 739198446 727534592 715376258 703150630 691671014
$$ packed form
832.1G58256853m316390m656255l220916k389789l256857l312707j410663L01838J115084
850.5G37110198L012657O085217P790148P704437Q046090Q822739P988215O025255
866.8G92584956N118131M807711L320038J642227J467050J548409J71900j390398j513302
885.2H07756722j402140k313494k890170k009451r91166p36892p4268J309693J909435
903.5H00558269J384139R83894R62317L18229r90212j831591k155304k812922l367066
921.9G93049753k861023j758576r29832k57969L80039N42224K57551J18912K12550
940.2G88753629J31011j16110k52485n05090j190066k034605k834618l924191n314410
958.6G72713065o474733p494271q957744j0587871j1663854j2158334j2225628j1479616
$$ plain form
974.9 691671014 681899667 673930526 667104721 661211133 656413794 652297139 648270607 644588768
991.2 644588768 641762435 639422894 637016833 634842634 633224308 631520987 628949404 625576675
1007.5 625576675 621607482 616621137 610492885 604101837 598119795 592165589 586070597 580523551
1023.9 580523551 575746953 571088910 566434920 562559307 559686065 557224572 555076540 553704321
1040.2 553704321 552861273 551699698 550120234 548716128 547502160 546118081 545167446 545763075 547910810
1058.5 547910810 550697207 553722203 556886315 559348285 560304940 560350776 560580492 560957491 561026096
1076.9 561026096 561217904 561953664 562464893 561940789 560760200 559521437 558150470 557009161 557385564
1095.2 557385564 559739769 562994719 566306829 569961011 573944211 577410579 580138206 582899988
$$ packed form
974.9F91671014r771347p969141o825805n893588m797339m116655m026532l681839
991.2F44588768k826333k339541k406061k174199j618326j703321k571583l372729
1007.5F25576675l969193m986345o128252o391048n982042n954206o094992n547046
1023.9E80523551m776598m658043m653990l875613k873242k461493k148032j372219
1040.2E53704321q43048j161575j579464j404106j213968j384079r50635N95629K147735
1058.5E47910810K786397L024996L164112K461970R56655M5836K29716L76999O8605
1076.9E61026096J91808P35760N11229n24104j180589j238763j370967j141309L76403
1095.2E57385564K354205L254950L312110L654182L983200L466368K727627K761782
$$ plain form
1111.6 582899988 585815847 587846518 588357747 587626696 585857749 583683252 582823932 584428132 587767839
1129.9 587767839 590849280 592677653 594487190 597323477 600626171 603925705 607248187 609998941
1146.2 609998941 611575663 612611830 614118934 616014183 617883146 620353878 624267459 629436970
1162.6 629436970 635435581 642667949 651354432 660465539 669003904 677194357 685301900 692615628
1178.9 692615628 698573709 703592598 707755029 710028708 709795952 707664311 704142928 699191093
1195.2 699191093 693455279 688363969 684575498 681599140 679051936 676917195 674657583 671468556
1211.5 671468556 667391956 663138986 658965707 654676855 650522649 647030056 644179881 641668916
1227.8 641668916 639645994 638459623 637959182 637764513 637908399 638506830 639227927 639679968 639893353
$$ packed form
1111.6E82899988K915859K030671N11229p31051j768947k174497q59320J604200L339707
1129.9E87767839L081441J828373J809537K836287L302694L299534L322482K750754
1146.2F09998941J576722J036167J507104J895249J868963K470732L913581N169511
1162.6F29436970N998611P232368Q686483R111107Q538365Q190453Q107543P313728
1178.9F92615628N958081N018889M162431K273679k32756k131641l521383m951835
1195.2F99191093n735814n091310l788471k976358k547204k134741k259612l189027
1211.5F71468556m076600m252970m173279m288852m154206l492593k850175k510965
1227.8F41668916k022922j186371n00441j94669J43886N98431P21097M52041K13385
$$ plain form
1246.2 639893353 640004992 639864087 639351726 638773561 638534307 638731122 639443874 641008735 643616080
1264.5 643616080 647048473 651012838 655508399 660549104 665803134 670995831 676233053 681656301
1280.8 681656301 687160611 692613065 698064089 703527153 708744824 713425696 717584193 721360683
1297.2 721360683 724685490 727482975 729948103 732292116 734466970 736364961 738091230 739820957
1313.5 739820957 741454840 742919445 744479537 746223390 747842610 749073505 749954462 750597894 750896454
1331.8 750896454 750676394 750063539 749473810 749289274 749436021 749663234 750017583 750458539 750757992 750886738
1352.2 750886738 750961185 750889361 750379801 749296427 747870564 746423066 744997680 743790567 742862999
1370.6 742862999 741642714 740020156 738499463 736934245 734808743 732120156 729475617 727372825
$$ packed form
1246.2F39893353J11639j40905n12361n78165k39254J96815P12752J564861K607345
1264.5F43616080L432393L964365M495561N040705N254030N192697N237222N423248
1280.8F81656301N504310N452454N451024N463064N217671M680872M158497L776490
1297.2G21360683L324807K797485K465128K344013K174854J897991J726269J729727
1313.5G39820957J633883J464605J560092J743853J619220J230895Q80957O43432K98560
1331.8G50896454k20060o12855n89729j84536J46747K27213L54349M40956K99453J28746
1352.2G50886738P4447p1824n09560j083374j425863j447498j425386j207113r27568
1370.6G42862999j220285j622558j520693j565218k125502k688587k644539k102792
$$ plain form
1386.9 727372825 725734711 724112630 722233891 720258892 718321323 716229081 714128137 711890340
1403.2 711890340 709375978 707085252 705125034 703332007 701655090 699973345 698423326 697710931
1419.5 697710931 697739482 697974682 698533595 699227750 700058579 701221347 702431381 704061270 706598580
1437.9 706598580 709001601 711068153 712894499 714478254 716342151 718569160 720546365 722161770
1454.2 722161770 724963725 730703235 736035407 739928663 744270384 749510705 754121482 758319855
1470.5 758319855 764112115 771117747 776968360 781222284 784203827 786276937 787247717 786998153 786043227
1488.9 786043227 785304248 784474194 782467961 779270053 776250958 773604035 770450532 765412450 758315444
1507.2 758315444 753854394 750741541 746835709 742447913 738529623 735492408 732722580 730641663
$$ packed form
1386.9G27372825j638114j622081j878739j974999j937569k092242k100944k237797
1403.2G11890340k514362k290726j960218j793027j676917j681745j550019p12395
1419.5F97710931K8551K35200N58913O94155Q30829J162768J210034J629889K537310
1437.9G06598580K403021K066552J826346J583755J863897K227009J977205J615405
1454.2G22161770K801955N739510N332172L893256M341721N240321M610777M198373
1470.5G58319855N792260P005632N850613M253924K981543K073110R70780k49564r54926
1488.9G86043227p38979q30054k006233l197908l019095k646923l153503n038082p097006
1507.2G58315444m461050l112853l905832m387796l918290l037215k769828k080917
$$ plain form
1523.6 730641663 729083419 727457702 725832760 723917842 722029924 720681012 718919754 716610134
1539.9 716610134 715987504 716700912 717433274 718051672 718770504 719583988 720135093 720214546 720684707 723074973
1560.3 723074973 724667847 724846721 724152505 722397804 719989359 717604518 714113295 708692551 703521967
1578.6 703521967 698678374 692754507 685800433 678270698 670532882 662575185 654268861 645770192
1594.9 645770192 637636364 629781067 621677518 613603711 606043577 598628581 590970337 583627760
1611.3 583627760 576875210 569623888 561798811 556083620 551414132 546148837 541277468 537303507
1627.6 537303507 534074008 531440079 528944016 527342975 527939677 529353499 530918896 532772899
1643.9 532772899 536036074 540955901 544645309 548984170 557864726 565136254 570362151 576268733
$$ packed form
1523.6G30641663j558244j625717j624942j914918j887918j348912j761258k309620
1539.9G16610134o22630P13408P32362O18398P18832Q13484N51105P9453M70161K390266
1560.3G23074973J592874J78874o94216j754701k408445k384841l491223n420744n170584
1578.6G03521967m843593n923867o954074p529735p737816p957697q306324q498669
1594.9F45770192q133828p855297q103549q073807p560134p414996p658244p342577
1611.3E83627760o752550p251322p825077n715191m669488n265295m871369l973961
1627.6E37303507l229499k633929k496063j601041N96702J413822J565397J854003
1643.9E32772899L263175M919827L689408M338861Q880556P271528N225897N906582
$$ plain form
1660.2 576268733 583883345 592066586 598767698 606051385 615510762 624023616 632464945 642179966
1676.5 642179966 650620580 657450378 664917111 676460743 687257767 695247829 703215420 710403085
1692.8 710403085 717793226 726123989 735124409 746531010 755653560 762385666 769468665 775818825
1709.2 775818825 780636907 783997893 786762059 790559828 794588506 797228217 799374759 801851988
1725.5 801851988 803972900 805454075 806775212 809008598 811970711 814123273 816376448 819288850
1741.8 819288850 822018564 824432552 827180803 830774665 834685624 837809026 840477586 842933238
1758.1 842933238 844637811 846211791 848114908 849506974 849989831 850153625 851061523 852746367 853994131
1776.5 853994131 854768991 855655789 856555104 857187092 857837677 858379483 858383656 858529866 859439254 860390007
$$ packed form
1660.2E76268733P614612Q183241O701112P283687R459377Q512854Q441329R715021
1676.5F42179966Q440614O829798P466733J1543632J0797024P990062P967591P187665
1692.8G10403085P390141Q330763R000420J1406601R122550O732106P082999O350160
1709.2G75818825M818082L360986K764166L797769M028678K639711K146542K477229
1725.5H01851988K120912J481175J321137K233386K962113K152562K253175K912402
1741.8H19288850K729714K413988K748251L593862L910959L123402K668560K455652
1758.1H42933238J704573J573980J903117J392066M82857J63794R07898J684844J247764
1776.5H53994131P74860Q86798Q99315O31988O50585N41806M173J46210R09388R50753
$$ plain form
1796.9 860390007 860802233 861081958 861880422 862799466 863190413 863196552 863530099 864226520 864682078 864913881
1817.2 864913881 865343451 865695179 865604460 865473688 865591407 865838945 866408825 867100656 867558300 867812693
1837.6 867812693 867854476 867658019 867527962 867879689 868404567 868889153 869328558 869536579 869589329 869723916
1858 869723916 869916022 869960785 869808555 869473815 869226933 869542718 870167613 870609879 870757937 870724022
1878.4 870724022 870744288 870874643 870870531 870637596 870453000 870587289 870721161 870682061 870819986 871036053
1898.8 871036053 870992422 870851517 870871484 870864809 870692432 870660126 870836079 870773554 870373070 870168209 870261371
1921.3 870261371 870331228 870349646 870411217 870496333 870416224 870168269 870044470 870032489 869730353 869196355 869063735
1943.7 869063735 869271815 869205117 868911982 868801355 868775964 868502259 868165076 868119717 868121922 867747366
$$ packed form
1796.9H60390007M12226K79725P98464R19044L90947O139L33547O96421M55558K31803
1817.2H64913881M29570L51728r0719j30772J17719K47538N69880O91831M57644K54393
1837.6H67812693M1783j96457j30057L51727N24878M84586M39405K08021N2750J34587
1858H69723916J92106M4763j52230l34740k46882L15785O24895M42266J48058l3915
1878.4H70724022K0266J30355m112k32935j84596J34289J33872l9100J37925K16067
1898.8H71036053m3631j40905J9967o675j72377l2306J75953o2525m00484k04861R3162
1921.3H70261371O9857J8418O1571Q5116q0109k47955j23799j1981l02136n33998j32620
1943.7H69063735K08080o6698k93135j10627k5391k73705l37183m5359K205l74556
$$ plain form
1964.1 867747366 867261648 867222130 867351651 867101192 866763532 866739571 866704226 866342485 866037190 866073728
1984.5 866073728 866015911 865568876 865169466 865178585 865214109 864939511 864704430 864739954 864641607 864260733 864009559
2006.9 864009559 863990605 863804877 863378286 863101423 863051057 862882137 862558842 862438381 862469316 862243533
2027.3 862243533 861878335 861789048 861824572 861606598 861292720 861220062 861226797 860996485 860751450 860809386 860892117
2049.8 860892117 860673010 860440850 860454440 860430598 860180676 859990895 860057592 860111117 859971464 859889805
2070.2 859889805 860009015 860063314 859923601 859863460 859986722 859998345 859835744 859827638 859993994 860034227 859971941
2092.6 859971941 860064685 860238850 860257566 860188246 860232472 860352993 860375762 860336840 860399306 860522985 860555351
2115 860555351 860540628 860622764 860758543 860819936 860866010 860982358 861107409 861189842 861270547 861402094 861538470
$$ packed form
1964.1H67747366m85718l9518J29521k50459l37660k3961l5345l61741l05295L6538
1984.5H66073728n7817m47035l99410R119L5524k74598k35081L5524r8347l80874k51174
2006.9H64009559j8954j85728m26591k76863n0366j68920l23295j20461L0935k25783
2027.3H62243533l65198q9287L5524k17974l13878p2658O735k30312k45035N7936Q2731
2049.8H60892117k19107k32160J3590k3842k49922j89781O6697N3525j39653q1659
2070.2H59889805J19210N4299j39713o0141J23262J1623j62601q106J66356M0233o2286
2092.6H59971941R2744J74165J8716o9320M4226J20521K2769l8922O2466J23679L2366
2115H60555351j4723Q2136J35779O1393M6074J16348J25051Q2433Q0705J31547J36376
$$ plain form
2137.5 861538470 861632109 861741066 861891866 862031698 862145066 862253845 862377763 862518847 862656176 862788558
2157.9 862788558 862936676 863105774 863263309 863384366 863479853 863644779 863880575 864019990 864087760 864268064
2178.2 864268064 864537001 864707351 864755630 864858627 865044296 865120113 865112543 865267396 865520954 865578949
2198.6 865578949 865518272 865647435 865873098 865912557 865867734 865992129 866168499 866155803 866108239 866278470
2219 866278470 866469264 866405129 866328061 866523266 866709054 866605699 866520524 866712153 866865218 866743863
2239.4 866743863 866679788 866892695 867005825 866800487 866684735 866889000 866998732 866811574 866742969 866929352
2259.8 866929352 866974056 866808236 866819263 867028832 867026865 866824448 866870344 867112875 867100239 866950691 867101431
2282.3 867101431 867373765 867293715 867032468 867081285 867263734 867084980 866784453 866862476 866989851 866681695
$$ packed form
2137.5H61538470R3639J08957J50800J39832J13368J08779J23918J41084J37329J32382
2157.9H62788558J48118J69098J57535J21057R5487J64926K35796J39415O7770J80304
2178.2H64268064K68937J70350M8279J02997J85669P5817p570J54853K53558N7995
2198.6H65578949o0677J29163K25663L9459m4823J24395J76370j2696m7564J70231
2219H66278470J90794o4135p7068J95205J85788j03355q5175J91629J53065j21355
2239.4H66743863o4075K12907J13130k05338j15752K04265J09732j87158o8605J86383
2259.8H66929352M4704j65820J1027K09569j967k02417M5896K42531j2636j49548J50740
2282.3H67101431K72334q0050k61247M8817J82449j78754l00527P8023J27375l08156
$$ plain form
2302.7 866681695 866288900 866233587 866181910 865784466 865433335 865482450 865437925 864880979 864325225 864243150
2323.1 864243150 864192188 863751233 863365948 863412261 863394976 863021016 862838745 863074183 863157690 863141596
2343.5 863141596 863866329 864864469 864926875 863991797 862934411 862245142 861510694 860821247 860891521 861630380
2363.8 861630380 862314343 863041520 864179492 865296006 865995765 866679728 867683291 868596911 869035602
2382.2 869035602 869300127 869729102 870032609 869915307 869767666 869959474 870158792 870038092 869921803 870081902
2402.6 870081902 870168388 869971931 869859934 870004356 870051503 869856715 869753122 869853556 869813323 869569242
2423 869569242 869499683 869609237 869528115 869317889 869306207 869373083 869231224 869014144 868996680 869053304 868906736
2445.4 868906736 868697166 868701518 868758500 868604720 868432701 868449390 868425369 868202090 868017495 868022263 867989004
$$ packed form
2302.7H66681695l92795n5313n1677l97444l51131M9115m4525n56946n55754q2075
2323.1H64243150n0962m40955l85285M6313j7285l73960j82271K35438Q3507j6094
2343.5H63141596P24733R98140O2406r35078j057386o89269p34448o89447P0274P38859
2363.8H61630380O83963P27177J137972J116514O99759O83963J003563R13620M38691
2382.2H69035602K64525M28975L03507j17302j47641J91808J99318j20700j16289J60099
2402.6H70081902Q6486j96457j11997J44422M7147j94788j03593J00434m0233k44081
2423H69569242o9559J09554q1122k10226j1682O6876j41859k17080j7464N6624j46568
2445.4H68906736k09570M352N6982j53780j72019J6689k4021k23279j84595M768l3259
$$ plain form
2467.9 867989004 867774427 867604315 867608428 867547512 867329061 867187440 867143393 867002606 866806269 866743803
2488.3 866743803 866740882 866585851 866375923 866302311 866262078 866101563 865932703 865875840 865796089 865623772 865527391
2510.7 865527391 865554869 865473390 865214407 865061402 865082085 865010679 864818037 864720941 864696324 864534020 864304662
2533.1 864304662 864235997 864237905 864095449 863925457 863909662 863875926 863685131 863528907 863517880 863456845 863230348
2555.6 863230348 863060713 863072693 863015890 862779438 862635612 862652898 862529695 862222254 862070262 862094939
2576 862094939 861906648 861513913 861319005 861291945 861082494 860764086 860626996 860543370 860217929 859786212
2596.4 859786212 859560490 859414756 859080434 858716190 858549416 858381987 857985079 857574999 857397616 857219219
2616.8 857219219 856784940 856360376 856207490 856035590 855594456 855179727 855003536 854778945 854348540 854028940
$$ packed form
2467.9H67989004k14577j70112M113o0916k18451j41621m4047j40787j96337o2466
2488.3H66743803k921j55031k09928p3612m0233j60515j68860n6863p9751j72317r6381
2510.7H65527391K7478q1479k58983j53005K0683p1406j92642r7096k4617j62304k29358
2533.1H64304662o8665J908j42456j69992j5795l3736j90795j56224j1027o1035k26497
2555.6H63230348j69635J1980n6803k36452j43826J7286j23203l07441j51992K4677
2576H62094939j88291l92735j94908k7060k09451l18408j37090q3626l25441m31717
2596.4H59786212k25722j45734l34322l64244j66774j67429l96908m10080j77383j78397
2616.8H57219219m34279m24564j52886j71900m41134m14729j76191k24591m30405l19600
$$ plain form
2637.1 854028940 853936076 853692591 853186071 852821887 852709293 852462173 852014065 851728380 851615965 851317108
2657.5 851317108 850851655 850578249 850460529 850137889 849679649 849453568 849338591 848955274 848481715 848326921
2677.9 848326921 848265886 847859204 847315848 847045720 846862435 846432388 845978796 845792532 845597267 845109463
2698.3 845109463 844630897 844414294 844143927 843623698 843190968 842978656 842634141 842080295 841669977 841477871
2718.7 841477871 841155171 840623736 840256095 840077102 839688659 839111567 838715971 838497937 838149965 837646544
2739.1 837646544 837287724 837111115 836832345 836439013 836139917 835854411 835371673 834838569 834490776 834154606
2759.5 834154606 833634555 833117485 832756698 832371414 831810415 831263781 830905437 830492318 829827249 829151154
2779.9 829151154 828649580 828163266 827581346 827048004 826579332 825954497 825169027 824474275 823878765 823131740
$$ packed form
2637.1H54028940r2864k43485n06520l64184j12594k47120m48108k85685j12415k98857
2657.5H51317108m65453k73406j17720l22640m58240k26081j14977l83317m73559j54794
2677.9H48326921o1035m06682n43356k70128j83285m30047m53592j86264j95265m87804
2698.3H45109463m78566k16603k70367n20229m32730k12312l44515n53846m10318j92106
2718.7H41477871l22700n31435l67641j78993l88443n77092l95596k18034l47972n03421
2739.1H37646544l58820j76609k78770l93332k99096k85506m82738n33104l47793l36170
2759.5H34154606n20051n17070l60787l85284n60999n46634l58344m13119o65069o76095
2779.9H29151154n01574m86314n81920n33342m68672o24835p85470o94752n95510p47025
$$ plain form
2800.3 823131740 822242320 821419716 820677578 819886506 818970740 818022311 817116976 816123903 815035164
2818.7 815035164 814008594 812999785 811850488 810564578 809257507 807941079 806456208 804676712
2835 804676712 802626908 800199926 797049880 792881548 787540674 781373918 775839865 772643805 771966517
2853.3 771966517 772560596 773286581 773682654 773562670 772803009 771417439 769535720 767439723 765496910
2871.7 765496910 763809681 762298226 761017740 759951055 758881748 757679105 756355584 754894555
2888 754894555 753222883 751393080 749567509 747723639 745731175 743637621 741531312 739319026 736762941
2906.4 736762941 733650506 729784071 724840224 718845129 712851524 708363891 706058085 705540776
2922.7 705540776 706090450 707276583 708869398 710555971 712278008 714354038 716869354 719526112
$$ packed form
2800.3H23131740q89420q22604p42138p91072r15766r48429r05335r93073j088739
2818.7H15035164j026570j008809j149297j285910j307071j316428j484871j779496
2835H04676712k049804k426982l150046m168332n340874o166756n534053l196060o77288
2853.3G71966517N94079P25985L96073j19984p59661j385570j881719k095997j942813
2871.7G65496910j687229j511455j280486j066685j069307j202643j323521j461029
2888G54894555j671672j829803j825571j843870j992464k093554k106309k212286k556085
2906.4G36762941l112435l866435m943847n995095n993605m487633k305806n17309
2922.7G05540776N49674J186133J592815J686573J722037K076030K515316K656758
$$ plain form
2939 719526112 722179472 724816799 727087319 728550673 729233921 729524851 729575515 729387105 729304254 729715109
2959.4 729715109 730603993 731691301 732896090 734363496 736021280 737674594 739282191 740832865
2975.7 740832865 742320001 743687153 744838297 745898664 747031271 748146117 749195099 750211120
2992 750211120 751021624 751515031 751736641 751713514 751502693 751100361 750562608 750113070 749777317 749326050
3012.4 749326050 748707354 748027563 747233450 746272981 745287895 744333088 743217707 741932452 740736723
3030.8 740736723 739666402 738412023 736869872 735418439 734185636 732795835 731105328 729378819
3047.1 729378819 727785945 726175249 724474311 722833812 721218228 719505250 717809796 716281533
3063.4 716281533 714870334 713389993 711775899 710187197 708711386 707312286 705967903 704585135
$$ packed form
2939G19526112K653360K637327K270520J463354O83248K90930N0664j88410q2851M10855
2959.4G29715109Q88884J087308J204789J467406J657784J653314J607597J550674
2975.7G40832865J487136J367152J151144J060367J132607J114846J048982J016021
2992G50211120Q10504M93407K21610k3127k10821m02332n37753m49538l35753m51267
3012.4G49326050o18696o79791p94113r60469r85086r54807j115381j285255j195729
3030.8G40736723j070321j254379j542151j451433j232803j389801j690507j726509
3047.1G29378819j592874j610696j700938j640499j615584j712978j695454j528263
3063.4G16281533j411199j480341j614094j588702j475811j399100j344383j382768
$$ plain form
3079.7 704585135 703079462 701449990 699750185 698112607 696513295 694753468 692896843 691181302
3096 691181302 689581573 687851071 685918629 683986783 682160616 680335283 678409815 676484644 674637496
3114.4 674637496 672703087 670600176 668343306 665913224 663421392 661049306 658806920 656492591
3130.7 656492591 653995574 651510060 649187624 646807730 644141376 641343474 638611078 635905802
3147 635905802 633256555 630703628 628000736 624950886 621807575 618822753 615871489 612823308 609751105
3165.4 609751105 606712759 603664935 600575328 597440779 594292819 591166139 588038087 584864497
3181.7 584864497 581688464 578568995 575457335 572317362 569150150 565932572 562664807 559437394
3198 559437394 556315482 553236127 550156295 547103643 544052780 540980458 537932336 534929156 531957984
$$ packed form
3079.7G04585135j505673j629472j699805j637578j599312j759827j856625j715541
3096F91181302j599729j730502j932442j931846j826167j825333j925468j925171j847148
3114.4F74637496j934409k102911k256870k430082k491832k372086k242386k314329
3130.7F56492591k497017k485514k322436k379894k666354k797902k732396k705276
3147F35905802k649247k552927k702892l049850l143311k984822k951264l048181l072203
3165.4F09751105l038346l047824l089607l134549l147960l126680l128052l173590
3181.7E84864497l176033l119469l111660l139973l167212l217578l267765l227413
3198E59437394l121912l079355l079832l052652l050863l072322l048122l003180k971172
$$ plain form
3216.4 531957984 529013693 526094913 523181617 520261705 517334282 514431536 511642694 508963704
3232.7 508963704 506238282 503423035 500657082 497986585 495386690 492903620 490492105 488012969
3249 488012969 485500962 483088613 480776340 478445977 476067632 473741144 471480399 469228625 467012614
3267.4 467012614 464905262 462819904 460638523 458408445 456175536 453970134 451801986 449623585
3283.7 449623585 447433054 445280075 443206102 441181004 439103156 436897904 434573233 432242841
3300 432242841 430053174 427994728 425861180 423490942 420956731 418401837 415899724 413462013 411053300
3318.4 411053300 408640862 406224668 403792560 401253104 398619205 396041185 393550068 391127765
3334.7 391127765 388770163 386323124 383690298 381025136 378402323 375843823 373427898 370962977
$$ packed form
3216.4E31957984k944291k918780k913296k919912k927423k902746k788842k678990
3232.7E08963704k725422k815247k765953k670497k599895k483070k411515k479136
3249D88012969k512007k412349k312273k330363k378345k326488k260745k251774k216011
3267.4D67012614k107352k085358k181381k230078k232909k205402k168148k178401
3283.7D49623585k190531k152979k073973k025098k077848k205252k324671k330392
3300D32242841k189667k058446k133548k370238k534211k554894k502113k437711k408713
3318.4D11053300k412438k416194k432108k539456k633899k578020k491117k422303
3334.7C91127765k357602k447039k632826k665162k622813k558500k415925k464921
$$ plain form
3351 370962977 368264049 365527689 362985432 360616803 358272493 355929196 353776008 351844221 349804282
3369.3 349804282 347409308 344955117 342867196 341093034 339409381 337721765 336133033 334789991
3385.7 334789991 333734363 332975805 332226843 331174642 330067962 329372108 329025358 328442097 327444017
3404 327444017 326594323 326182902 325972795 325766057 325433671 325024217 324837416 324935228 325117767 325432152
3424.4 325432152 326045454 326873183 327665120 328525990 329636544 330652863 331297547 331930429 332916439
3442.8 332916439 334221631 335767657 337389678 339020401 340753347 342617422 344668150 346888691
3459.1 346888691 349033952 351146936 353641748 356427670 358834922 360651165 362512499 364857584
3475.4 364857584 367574364 370298386 372716695 375094086 377783567 380526960 383116782 385800838
$$ packed form
3351C70962977k698928k736360k542257k368629k344310k343297k153188j931787k039939
3369.3C49804282k394974k454191k087921j774162j683653j687616j588732j343042
3385.7C34789991j055628p58558p48962j052201j106680o95854l46750n83261r98080
3404C27444017q49694m11421k10107k06738l32386m09454j86801R7812J82539L14385
3424.4C25432152O13302Q27729P91937Q60870J110554J016319O44684O32882R86010
3442.8C32916439J305192J546026J622021J630723J732946J864075K050728K220541
3459.1C46888691K145261K112984K494812K785922K407252J816243J861334K345085
3475.4C64857584K716780K724022K418309K377391K689481K743393K589822K684056
$$ plain form
3491.7 385800838 388715148 391810805 394815475 397633195 400561363 403538078 406276852 409059107
3508 409059107 412252933 415773988 419220001 422359228 425454617 428764433 432388544 436031044 439384222
3526.4 439384222 442809314 446586877 450516194 454566568 458675027 462565333 466453254 470590323
3542.7 470590323 474905580 479114115 483097821 487215787 491663635 496148795 500585556 505187988
3559 505187988 509740591 513819396 517957866 523508430 529767394 535200059 540194929 545436442 550959349
3577.4 550959349 556715608 562594116 568141997 573531806 579688191 586307585 592298806 598160028
3593.7 598160028 604541779 611187339 617853820 624406934 630477011 636182845 642416537 649108589
3610 649108589 655629814 662080109 668233812 674651921 682051897 688871861 694153786 698729515 704667985
$$ packed form
3491.7C85800838K914310L095657L004670K817720K928168K976715K738774K782255
3508D09059107L193826L521055L446013L139227L095389L309816L624111L642500L353178
3526.4D39384222L425092L777563L929317M050374M108459L890306L887921M137069
3542.7D70590323M315257M208535L983706M117966M447848M485160M436761M602432
3559E05187988M552603M078805M138470N550564O258964N432665M994870N241513N522907
3577.4E50959349N756259N878508N547881N389809O156385O619394N991221N861222
3593.7E98160028O381751O645560O666481O553114O070077N705834O233692O692052
3610F49108589O521225O450295O153703O418109P399976O819964N281925M575729N938470
$$ plain form
3628.4 704667985 712161064 718593836 724296868 729873776 735170782 740192413 744719803 748405397
3644.7 748405397 751673579 756349742 762443841 767301738 771202087 775581956 780008018 783596873
3661 783596873 786438823 788703978 790394604 792082548 794359863 796351373 798284292 801210463 804249704
3679.4 804249704 806746244 808737993 810210884 811370611 812776029 814758718 816867650 818563581
3695.7 818563581 819668174 820385516 821254790 822448373 823352158 823582470 823610246 824463189 826050639
3714 826050639 827305019 827922463 828117192 828227580 828557849 829185665 829791069 829800606 829236865 829112709
3734.4 829112709 830302775 831792235 832299709 831768155 831237376 831559002 831755757 831934750 833152294
3752.8 833152294 834472477 835045695 835350811 835958719 836512923 836689115 836741149 836948812 837526083 838268161
$$ packed form
3628.4G04667985P493079O432772N703032N576908N297006N021631M527390L685594
3644.7G48405397L268182M676163O094099M857897L900349M379869M426062L588855
3661G83596873K841950K265155J690626J687944K277315J991510J932919K926171L039241
3679.4H04249704K496540J991749J472891J159727J405418J982689K108932J695931
3695.7H18563581J104593P17342Q69274J193583R03785K30312K7776Q52943J587450
3714H26050639J254380O17444J94729J10388L30269O27816O05404R537n63741j24156
3734.4H29112709J190066J489460N07474n31554n30779L21626J96755J78993J217544
3752.8H33152294J320183N73218L05116O07908N54204J76192N2034K07663N77271P42078
$$ plain form
3773.2 838268161 838611603 838523507 838459551 838675857 838891923 839054227 839446902 839920044 840055466 839704394
3793.6 839704394 839126468 838660121 838150084 837897897 838465035 839069724 839568734 840225816 840517998 840079665
3814 840079665 839307189 838849306 838581264 838893831 839700341 840139806 840283632 840258718 839987397 839680314
3834.4 839680314 839294672 838925958 839178085 839936674 840801299 841309607 840895653 839475572 837956429
3852.7 837956429 838304639 839746177 840587616 840581477 840140164 839957952 839938223 839625001 839529932 839995682
3873.1 839995682 840592861 840898573 840712190 840512097 840580583 840738237 840940356 840840995 840618014 840847433
3893.5 840847433 841084003 840675414 839769125 839014113 839049637 839996397 841044843 841520607 841488421 841224670
3913.9 841224670 840883195 840763152 840968549 841115892 841109097 841207266 841279030 841120660 841083646 841390133
$$ packed form
3773.2H38268161L43442q8096o3956K16306K16066J62304L92675M73142J35422l51072
3793.6H39704394n77926m66347n10037k52187N67138O04689M99010O57082K92182m38333
3814H40079665p72476m57883k68042L12567Q06510M39465J43826k4914k71321l07083
3834.4H39680314l85642l68714K52127P58589Q64625N08308m13954j420081j519143
3852.7H37956429L48210J441538Q41439o139m41313j82212j9729l13222r5069M65750
3873.1H39995682N97179L05712j86383k00093O8486J57654K02119r9361k22981K29419
3893.5H40847433K36570m08589r06289p55012L5524R46760J048446M75764l2186k63751
3913.9H41224670l41475j20043K05397J47343o795R8169P1764j58370l7014L06487
$$ plain form
3934.3 841390133 841670692 841647923 841413260 841243863 841281116 841323793 841284931 841331780 841449559 841527224 841598153
3956.7 841598153 841711581 841778159 841742873 841690660 841672242 841722012 841838539 841946483 842041016 842108250 842121303
3979.2 842121303 842239678 842498422 842597127 842434764 842330992 842426538 842515707 842543781 842589855
3997.5 842589855
$$ packed form
3934.3H41390133K80559k2769k34663j69397L7253M2677l8862M6849J17779P7665P0929
3956.7H41598153J13428O6578l5286n2213j8418M9770J16527J07944R4533O7234J3053
3979.2H42121303J18375K58744R8705j62363j03772R5546Q9169K8074M6074
3997.5H42589855
##END=$$ End of the data block
