##TITLE=$$ Begin of the data block
##JCAMP-DX=5.00 $$ ACD/SpecManager v 10.08
##SPECTROMETER/DATA SYSTEM=Alpha
##DATE=10 Apr 2014 09:27:12
##DATA TYPE=INFRARED SPECTRUM
##DATA CLASS=XYDATA
##ORIGIN=
##OWNER=
##NPOINTS=1765
##FIRSTX=399.75695801
##LASTX=3997.56933594
##MAXX=3997.56933594
##MINX=399.75695801
##MAXY=0.85138351
##MINY=0.18343808
##XFACTOR=1.0000000000
##YFACTOR=1.000000000000000e-9
##FIRSTY=0.57864827
##DELTAX=2.03957629
##XUNITS=1/CM
##YUNITS=ARBITRARY UNITS
##XYDATA=(X++(Y..Y))
399.8E78648269j743316j157880k454222k026438m01855j378178k266229k72333L00944
$$ 578648269 576904953 575747073 573292851 571266413 570864558 569486380 567220151 566947818 567248762
418.1E67248762k345264j557470M81129l80516j174688r239m9889j706124j574218
$$ 567248762 564903498 563346028 563827157 563446641 562271953 562262714 562212825 560506701 558932483
436.5E58932483l27587p75933r65119L02673Q4281j059234m43519J58132q65996j106620
$$ 558932483 558604896 557828963 556863844 557166517 557250798 556191564 555748045 555906177 555040181 553933561
456.9E53933561k16782p69913j676739r23812l19600j144469j316607p06553j117230
$$ 553933561 553716779 552946866 551270127 550346315 550026715 548882246 547565639 546859086 545741856
475.2E45741856j411796m46140m7565r55164j028002k37166q48532j704991r55284
$$ 545741856 544330060 543883920 543836355 542881191 541853189 541616023 540767491 539062500 538107216
493.6E38107216o62088j522720j236677l31760r44614j542747q03411p84636j600503
$$ 538107216 537445128 535922408 534685731 534353971 533409357 531866610 531063199 530278563 528678060
511.9E28678060j162291m57466j373231k026737j175821j147508k103329j715958j071990
$$ 528678060 527515769 527058303 525685072 523658335 522482514 521335006 519231677 517515719 516443729
530.3E16443729j921415k218246j030744p33077j465321j087606m02629j098037j680910
$$ 516443729 514522314 512304068 511273324 510540247 509074926 507987320 507584691 506486654 504805744
548.6E04805744j015544q65579j562178j441598j040369j686692k288253j866906j824439
$$ 504805744 503790200 502924621 501362443 499920845 498880476 497193784 494905531 493038625 491214186
567D91214186k607882k589732k079159k576620l009736k268255k057821k838731k787292
$$ 491214186 488606304 486016572 483937413 481360793 478351057 476082802 474024981 471186250 468398958
585.4D68398958k158492k604366l203004k626390k116054k385616k371252k281755
$$ 468398958 466240466 463636100 460433096 457806706 455690652 453305036 450933784 448652029
601.7D48652029k858221k631754j090646l40491r36837q82387M20720J767069K905994
$$ 448652029 445793808 443162054 442071408 441730917 440794080 439911693 440332413 442099482 445005476
620D45005476M065037M420549L849089L869146M372567L976613L327310L512383L248602
$$ 445005476 449070513 453491062 457340151 461209297 465581864 469558477 472885787 476398170 479646772
638.4D79646772J788855P41690J180113K271145K874106K557040Q51660r81658O82324
$$ 479646772 481435627 482177317 483357430 485628575 488502681 491059721 491911381 490929723 491612047
656.7D91612047N222321P024139N389928L710270L232003L558874L617167L781021
$$ 491612047 496834368 503858507 509248435 512958705 516190708 519749582 523366749 527147770
673.1E27147770L489137K733230K961219L277361K475858J980900K463103K292812
$$ 527147770 530636907 533370137 536331356 539608717 542084575 544065475 546528578 548821390
689.4E48821390J479327J581371J869500J084506P41899J634121J961589J548946K043247
$$ 548821390 550300717 551882088 553751588 554836094 555577993 557212114 559173703 560722649 562765896
707.7E62765896K771974K352893K064586K775133K828478K037824K350747L094793
$$ 562765896 565537870 567890763 569955349 572730482 575558960 577596784 579947531 583042324
724E83042324K503156J879156K517104K666891J739502J718044K379954J967728J442611
$$ 583042324 585545480 587424636 589941740 592608631 594348133 596066177 598446131 600413859 601856470
742.4F01856470K210140K613485J880169J953483K753496K408802J841963K537250
$$ 601856470 604066610 606680095 608560264 610513747 613267243 615676045 617518008 620055258
758.7F20055258K889574K021670J795829K387464J832604P88569J011491J130343r1732
$$ 620055258 622944832 624966502 626762331 629149795 630982399 631770968 632782459 633912802 633821070
777.1F33821070q45551n35012r73522j682759q26835N30422J006960J989663L987074
$$ 633821070 632975519 632440507 631466985 629784226 628957391 629487813 630494773 632484436 636471510
795.4F36471510N135298N327820O169379O864727N987108N035817N073607M393399
$$ 636471510 641606808 646934628 653104007 659968734 665955842 670991659 676065266 680458665
811.7F80458665K785921K234042K060294M85241j048803j392543k269447l914833m382134
$$ 680458665 683244586 685478628 687538922 688024163 686975360 685582817 683313370 679398537 675016403
830.1F75016403l996968m488707m918873m056156l570318m244983m140198k774954
$$ 675016403 671019435 666530728 661611855 657555699 653985381 649740398 645600200 642825246
846.4F42825246j532793O4969L075480O042064P681906R156287J0680496J0689557
$$ 642825246 641292453 641357422 644432902 650474966 658156872 667313159 677993655 688683212
862.7F88683212R648979R229362Q569300O492555M768848M359246L353834J715660
$$ 688683212 698332191 707561553 716130853 722623408 727392256 731751502 735105336 736820996
879.1G36820996J158356Q29578n88298j574576j272797j467765k105355j165509N44011
$$ 736820996 737979352 738808930 738220632 736646056 735373259 733905494 731800139 730634630 731178641
897.4G31178641J043797J338720K405107K547264J412392Q96156O99699q39770k551735
$$ 731178641 732222438 733561158 735966265 738513529 739925921 740822077 741521776 740682006 738130271
915.8G38130271k965569l439844m368543l819406j940966p60973l039J402974K037585
$$ 738130271 735164702 731724858 727356315 723536909 721595943 720834970 720831931 722234905 724272490
934.1G24272490J165330P61867J164972O10054m45783n13256p44283k231598l369927
$$ 724272490 725437820 726199687 727364659 727974713 727528930 727015674 726271391 724039793 720669866
952.5G20669866l650368m790067o655276p766187q939267j1287510j3490915j4728964
$$ 720669866 717019498 712229431 705574155 697807968 688868701 677581191 664090276 649361312
968.8F49361312j5969991j6765416j5664995j3397276j1449754r512723p353484o166459
$$ 649361312 633391321 616625905 600960910 587563634 576113880 566601157 559247673 553081214
985.1E53081214n945265n265117m197537l709436l320992k394795j700878j658738
$$ 553081214 547135949 541870832 537673295 533963859 530642867 528248072 526547194 524888456
1001.4E24888456j575470j648605k770722m360556n325258n991102o800174p093787
$$ 524888456 523312986 521664381 518893659 514533103 509207845 503216743 496416569 489322782
1017.7D89322782o787152o770163p002354o773204o397366o339252o002992n112529
$$ 489322782 482535630 475765467 468763113 461989909 455592543 449253291 443250299 438137770
1034.1D38137770m361600l986448l513604l086776l164172l395528l383219l377378
$$ 438137770 433776170 429789722 426276118 423189342 420025170 416629642 413246423 409869045
1050.4D09869045l207237k152323m61608R12070J707226J995355J331985k67923j859576
$$ 409869045 406661808 404509485 404047877 404959947 406667173 408662528 409994513 409726590 407867014
1068.7D07867014k981990l935844m635572m755289m717707m976124n295455n581618
$$ 407867014 404885024 400949180 396313608 391558319 386840612 381864488 376569033 370987415
1085C70987415o132036o680399o455064n241126l474295j524359L31432J531988J883119
$$ 370987415 364855379 358174980 351719916 346478790 343004495 341480136 341811568 343343556 345226675
1103.4C45226675J834393J641154J072943K25395o33061j886308l925830o188005p164806
$$ 345226675 347061068 348702222 349775165 350000560 349367499 347481191 343555361 337367356 330202550
1121.8C30202550n405605j709312J122474J852930J029521J1057N79983K528339M198969
$$ 330202550 324796945 323087633 324210107 326063037 327092558 327103615 327683598 330211937 334410906
1140.1C34410906M918754M792005M062325L308355K911926K693474K609253K927601
$$ 334410906 339329660 344121665 348183990 351492345 354404271 357097745 359706998 362634599
1156.4C62634599L602535M407137N499810O998033Q463174R428054R963333J0172517
$$ 362634599 366237134 370644271 376144081 383142114 391605288 401033342 410996675 421169192
1172.7D21169192R889781R275258Q777886Q218557P143229N771816M297674K452194
$$ 421169192 431058973 440334231 449112117 457330674 464473903 470245719 474543393 476995587
1189.1D76995587M57436r37789j452744j226694j59293J632333L270089M086197M255503
$$ 476995587 477453023 476515234 475062490 473835796 473676503 475308836 478578925 482665122 486920625
1207.4D86920625L903478K976150J955092J393258J152694R79275J021385J284659
$$ 486920625 490824103 493800253 495755345 497148603 498301297 499280572 500301957 501586616
1223.7E01586616J482308J666427K129435K651453K855718K962828L164887L088773
$$ 501586616 503068924 504735351 506864786 509516239 512371957 515334785 518499672 521588445
1240.1E21588445K695262K379775K020359J365245P72595N41568L77595K51115O19232
$$ 521588445 524283707 526663482 528683841 530049086 530821681 531363249 531740844 531991959 532611191
1258.4E32611191J477897K473176L553569M666150N419850N707443N934179O238341
$$ 532611191 534089088 536562264 540115833 544781983 550201833 555909276 561843455 568081796
1274.7E68081796O343246O334901O582677O917775O939590O848156O871045O683051
$$ 568081796 574425042 580759943 587342620 594260395 601199985 608048141 614919186 621602237
1291F21602237O244600N961597N728841N106151M343271L855229L368914K748251K407431
$$ 621602237 627846837 633808434 639537275 644643426 648986697 652841926 656210840 658959091 661366522
1309.4F61366522K294362J960456J630426J733958J875341J720250J729250J928091
$$ 661366522 663660884 665621340 667251766 668985724 670861065 672581315 674310565 676238656
1325.7F76238656J755238J279354R48012N98788O0797k39671r9420J073K741L20435
$$ 676238656 677993894 679273248 680221260 680820048 680880845 680641174 680541754 680542827 680545568 680866003
1346.1F80866003O77168N64397L06844K60175Q2373k63333m81367q21471j374066j633227
$$ 680866003 681543171 682107568 682414412 682674587 682756960 682493627 682012260 681190789 679816723 678183496
1366.5F78183496j562357j419127j659036k140939k308786k770602l730357l920317
$$ 678183496 676621139 675202012 673542976 671402037 669093251 666322649 662592292 658671975
1382.8F58671975k697646j378716j021385j025974j327754j991152k318263k700448
$$ 658671975 655974329 654595613 653574228 652548254 651220500 649229348 646911085 644210637
1399.1F44210637l085614l192782l388882l256678k954066k630532k085566j634777
$$ 644210637 641125023 637932241 634543359 631286681 628332615 625702083 623616517 621981740
1415.5F21981740j641035j672924j112044p58767n35905j72257j21057L3795N66662
$$ 621981740 620340705 618667781 617555737 616796970 616261065 616088808 615967751 616001546 616568208
1433.8F16568208R75370J262903J548350J927257K131760K295136K845526L478706
$$ 616568208 617543578 618806481 620354831 622282088 624413848 626708984 629554510 633033216
1450.1F33033216L840029M447043O641865Q850813P096887O202578P218897P468224
$$ 633033216 636873245 641320288 647962153 656812966 663909853 670112431 677331328 684799552
1466.4F84799552O587863P013917Q737206Q165241O000757M689038L614962K689123
$$ 684799552 691387415 698401332 707138538 715303779 721304536 725993574 729608536 732297659
1482.8G32297659J928985J183271n2034j129568j180470j671791l085852l624320l087699
$$ 732297659 734226644 735409915 735357881 734228313 733047843 731376052 728290200 724665880 721578181
1501.1G21578181k688587l710985p016778o567061m745066m366815m107118l785253
$$ 721578181 718889594 715178609 708161831 701594770 696849704 692482889 688375771 684590518
1517.4F84590518l125906l171682l184795k861679k804339k149522k034605k560258
$$ 684590518 681464612 678292930 675108135 672246456 669442117 667292595 665257990 662697732
1533.7F62697732j760900r54687j835227k356947j372993q03947l55661M8935M20273
$$ 662697732 660936832 659982145 658146918 655789971 654416978 653613031 653257370 653306305 653726578
1552.1F53726578N77390N71549k14458j435399j068115j296878k008676l382385m923344
$$ 653726578 654303968 654875517 654661059 653225660 652157545 650860667 648851991 645469606 640546262
1570.5F40546262m465282n078256q176505q167565p091999q028567q790314q983255
$$ 640546262 636080980 631002724 622826219 614658654 607566655 599538088 590747774 581764519
1586.8E81764519r205639r489715r448171r373665r229958q924246q746683q670450
$$ 581764519 572558880 563069165 553620994 544247329 535017371 526093125 517346442 508675992
1603.1E08675992q480072q390992q557201q274555p515311q062452r436936p256716
$$ 508675992 500195920 491804928 483247727 474973172 467457861 459395409 449958473 442701757
1619.4D42701757n745590o501823o073773n152852m390895k963811k154559k106577
$$ 442701757 436956167 430454344 424380571 419227719 414836824 411873013 409718454 407611877
1635.7D07611877p83265P10249J603305K379716L742188N019039M268408N122602Q281499
$$ 407611877 406828612 407538861 409142166 411521882 415264070 420283109 424551517 429674119 437955618
1654.1D37955618O685614N643815O671727Q155912Q699387P803083Q662611J0444164
$$ 437955618 444641232 450285047 456956774 465112686 473812073 481615156 490277767 500721931
1670.4E00721931R506345R837568J1009395R901881R218634J0639071J4007807J2158513
$$ 500721931 510228276 520065844 531075239 540977120 550195754 560834825 574842632 587001145
1686.7E87001145R934962J0487437R655833J0376811J1961639J1947334J3213634J0754168
$$ 587001145 596936107 607423544 617079377 627456188 639417827 651365161 664578795 675332963
1703F75332963Q978248R018302P618070O590128N928099N230009M499615K656817J218557
$$ 675332963 684311211 693329513 700947583 707537711 713465810 718695819 723195434 725852251 727070808
1721.4G27070808J410962K730965L675759M043162M070341M517615M416645L579974
$$ 727070808 728481770 731212735 734888494 738931656 743001997 747519612 751936257 755516231
1737.7G55516231L983140M368901M245460M486204M932224N251110N178630M532635
$$ 755516231 759499371 763868272 768113732 772599936 777532160 782783270 787961900 792494535
1754G92494535M104376L686071L117084K946317K497554K064467K090096K050638J692295
$$ 792494535 796598911 800284982 803402066 806348383 808845937 810910404 813000500 815051138 816743433
1772.4H16743433J486719J493693J461505J362384J350581J358033J234889J169681
$$ 816743433 818230152 819723845 821185350 822547734 823898315 825256348 826491237 827660918
1788.7H27660918J194597J126825R17793R80138J052440Q63254P06434P95841Q38399
$$ 827660918 828855515 829982340 830900133 831880271 832932711 833795965 834502399 835298240 836136639
1807H36136639O68168O07372O75559O31272N17011N72801O29246N44190N33998N98908
$$ 836136639 836804807 837412179 838087738 838719010 839236021 839808822 840438068 840982258 841516256 842115164
1827.4H42115164M57644L11435M65095N42283L96609L42965M72665L94404K22921L33488
$$ 842115164 842572808 842884243 843349338 843891621 844288230 844631195 845103860 845498264 845721185 846054673
1847.8H46054673M48704L38435K00808K88487L46124K19881K16961M23551L92616R4354
$$ 846054673 846503377 846841812 847042620 847331107 847677231 847897112 848114073 848537624 848930240 849024594
1868.2H49024594N6505J99974J19328O2227K39730K51711P4863J30773K73168J02639
$$ 849024594 849081099 849281073 849400401 849462628 849702358 849954069 850028932 850159705 850432873 850535512
1888.6H50535512k0206J81139J80363l8087P927J95801R5189n2571P8261J43170m5955
$$ 850535512 850515306 850696445 850876808 850838721 850846648 851042449 851137638 851085067 851163328 851306498 851260543
1911.1H51260543m8876J39177L2663j57892j4306P3255r7514j20222O5624L1591j94252
$$ 851260543 851211667 851350844 851383507 851225615 851211309 851284564 851187050 851066828 851132452 851164043 850969791
1933.5H50969791j43468M2498n5730k07961j29521j27911k90394k12789j6570j22010
$$ 850969791 850826323 850868821 850813091 850605130 850475609 850347698 850057304 849844515 849827945 849705935
1953.9H49705935k56241j36912j38282l37422k73884j01566k33650l40581j38343o2167
$$ 849705935 849449694 849312782 849174500 848837078 848563194 848461628 848227978 847887397 847749054 847686887
1974.3H47686887k87295k89380p6294j27256k59936j33812n8532k64227l48330j60992
$$ 847686887 847399592 847110212 847033918 846906662 846646726 846512914 846454382 846190155 845841825 845680833
1994.7H45680833j59443l31640k52247j38223k79724l43860j73390j53839k89559k42532
$$ 845680833 845521390 845189750 844937503 844799280 844519556 844175696 844002306 843848467 843558908 843316376
2015.1H43316376j72198l08394l77476k12789j75357l18110k83360j38343j87814k67386
$$ 843316376 843144178 842835784 842458308 842245519 842070162 841752052 841468692 841330349 841142535 840875149
2035.5H40875149j59979j22249k71738l04222j78575j94133k58803j54972q2493j98960
$$ 840875149 840715170 840592921 840321183 840016961 839838386 839644253 839385450 839230478 839147985 838949025
2055.9H38949025k43783j33396j32739k01285j27077m1723j28150j70112p6771m5180
$$ 838949025 838705242 838571846 838439107 838237822 838110745 838069022 837940872 837770760 837693989 837648809
2076.3H37648809r1076p0631k2650p4089j04368o1690r2209j42038n4836L1650l2007
$$ 837648809 837557733 837487102 837464452 837390363 837285995 837224305 837132096 836990058 836935222 836966872 836934865
2098.7H36934865r6322j4901N6386j0192m7326N9J1742j7166K6107J00196O8783L994
$$ 836934865 836838543 836823642 836880028 836869836 836822510 836822569 836834311 836817145 836843252 836943448 837012231 837016225
2123.2H37016225M9054J22250J08063Q4996R6023R1672Q9884J28567J44661J16646
$$ 837016225 837065279 837187529 837295592 837380588 837476611 837568283 837658167 837786734 837931395 838048041
2143.6H38048041J15096J51277J44541Q2553R0658J54853J29223Q1778J48356J86741
$$ 838048041 838163137 838314414 838458955 838541508 838632166 838787019 838916242 838998020 839146376 839333117
2164H39333117R3818O0379J70768K20060J24395Q8572J46091J19686O8963J23024J42276
$$ 839333117 839426935 839487314 839658082 839878142 840002537 840091109 840237200 840356886 840425849 840548873 840691149
2186.4H40691149O9320N3049J03116R2387L9637O5803Q9467K1338J1802R9063P9632
$$ 840691149 840760469 840813518 840916634 841009021 841048658 841114461 841203928 841225266 841237068 841336131 841415763
2208.8H41415763j2398M1485J16348K8312l7670M6015Q2493K682k980N6684%o7532
$$ 841415763 841403365 841444850 841561198 841589510 841551840 841597855 841680348 841683030 841680050 841736734 841736734 841669202
2233.3H41669202R239M2855p7188r6380N7041N5909r7572j06097m0114o2465n8115
$$ 841669202 841678441 841721296 841644108 841547728 841604769 841660678 841563106 841457009 841416895 841354430 841296315
2255.8H41296315K8849K5153p5161m4227O2704P510o1750L7789J19984N0009K3782
$$ 841296315 841325164 841350317 841275156 841230929 841293633 841301143 841239393 841277182 841397166 841447175 841470957
2278.2H41470957J33216J50085P5757P9453N7936r1732j41620Q225K8849j15752j17302
$$ 841470957 841604173 841754258 841830015 841909468 841967404 841875672 841734052 841742277 841771126 841655374 841538072
2300.6H41538072k8789j01984k13444j47522o5922j25409j27554j10864l36707n28991
$$ 841538072 841509283 841407299 841193855 841046333 840980411 840855002 840727448 840616584 840279877 839750886
2321H39750886l17872k6106r0003j68086L8028J24097k5928j23441q2731j8895J83225
$$ 839750886 839433014 839406908 839316905 839148819 839186847 839310944 839285016 839161575 839078844 839059949 839243174
2343.5H39243174P91847J022280L07262n76258r52780q80421n82099n3405K45750L11732
$$ 839243174 840035021 841057301 841364563 840788305 839835525 838955104 838373005 838319600 838565350 838877082
2363.8H38877082O69300J027346J017690R66191J111507J128436R15289Q60810R21905
$$ 838877082 839546382 840573728 841591418 842557609 843669116 844797552 845712841 846573651 847495556
2382.2H47495556P50840M20391K70128K60890J39952O0260J71959J64271L099L5465
$$ 847495556 848246396 848666787 848936915 849197805 849337757 849398017 849569976 849734247 849737346 849772811
2402.6H49772811J62065P3016n7757K3544R3162R298J9550J22011K7537j38700m4703
$$ 849772811 849934876 850007892 849950135 849973679 850066841 850076139 850095689 850217700 850245237 850106537 850061834
2425H50061834P4208n0307r2089Q9526R7335j01209j11699R775n4419j40071j0431
$$ 850061834 850136042 850085735 849993646 850083172 850180507 850079298 849967599 849977374 849922955 849782884 849772453
2447.5H49772453M0055j21355j22726K1576n2452j63972m1187O56j53601j40727r894
$$ 849772453 849812508 849691153 849568427 849590003 849537551 849373579 849332392 849333048 849179447 849038720 849028826
2469.9H49028826p8500j85489q6427j3232j58668k13563o8903o2883j68085r6560j5914
$$ 849028826 848950326 848764837 848678410 848665178 848506510 848292947 848224044 848161161 847993076 847896516 847880602
2492.3H47880602j46330k00927m9054o2824k29001j59800k384r5665k14875r9957m3333
$$ 847880602 847734272 847533345 847484291 847421467 847192466 847032666 847030282 846934617 846719742 846619785 846576452
2514.8H46576452j94609j91450l8743r3341j89125q6248n5313j89364j89066o5923
$$ 846576452 846381843 846190393 846151650 846058309 845869184 845782936 845727623 845538259 845349193 845283270
2535.2H45283270j00434k00033j18852l8445j64389k11895m3094m2200k36333k20060
$$ 845283270 845182836 844982803 844863951 844825506 844661117 844449222 844406128 844363928 844127595 843907535
2555.6H43907535q6725j51097k34604j45734j31786k66313k62141j41442k01106l37422
$$ 843907535 843820810 843669713 843435109 843289375 843157589 842891276 842629135 842487693 842286587 841949165
2576H41949165k63453j81377k98738l35157k22325k73228m08947l24727k19106l35872
$$ 841949165 841685712 841504335 841205597 840870440 840648115 840374887 839965940 839641213 839422107 839086235
2596.4H39086235m45426l92854l93689m84884m31478l28719m07338m78685l87132l89219
$$ 839086235 838640809 838247955 837854266 837369382 836937904 836609185 836201847 835723162 835336030 834946811
2616.8H34946811n34832n18859l74496m06205m91619m12703l85165n31852n51463l56793
$$ 834946811 834411979 833893120 833518624 833112419 832620800 832208097 831822932 831291080 830739617 830382824
2637.1H30382824l19600m69506m47214l34918m34041n50568m41373l72409m87745m86017
$$ 830382824 830063224 829593718 829146504 828811586 828377545 827826977 827385604 827013195 826525450 826039433
2657.5H26039433l57091m02689m81069l66330l37720m89891m84347l67820m33922n19693
$$ 826039433 825682342 825279653 824798584 824432254 824094534 823604643 823120296 822752476 822318554 821798861
2677.9H21798861m38571m18365n55336n72980m42266m50135n65350n21779m30643n15700
$$ 821798861 821360290 820941925 820386589 819813609 819371343 818921208 818355858 817834079 817403436 816887736
2698.3H16887736n79178m97818n36025o62624n91636m77433n79059o84143n73813n16832
$$ 816887736 816308558 815810740 815274715 814612091 814020455 813543022 812963963 812279820 811706007 811189175
2718.7H11189175o36876o12617m71651n58257p25210o48677n40734n96940n91457n03421
$$ 811189175 810552299 809939682 809468031 808909774 808184564 807535887 806995153 806398213 805806756 805303335
2739.1H05303335n38647o05106n22852m97580o46055o87718n91516o07491p14123p00891
$$ 805303335 804764688 804159582 803636730 803139150 802493095 801805377 801213861 800606370 799892247 799191356
2759.5G99191356o40989p31945q00311o99401o70672p72178p75993p43806q55923r47714
$$ 799191356 798550367 797818422 797018111 796318710 795648038 794875860 794099867 793356061 792500138 791552424
2779.9G91552424q70764q09491q72433q95858r10222j060724j135230r99451r50992
$$ 791552424 790681660 789872169 788999736 788103878 787193656 786132932 784997702 783998251 783047259
2798.3G83047259j105845j179934j122653j179934j305639j284540j231611j311362
$$ 783047259 781941414 780761480 779638827 778458893 777153254 775868714 774637103 773325741
2814.6G73325741j357197j300693j365125j508892j531184j544535j646876j719594
$$ 773325741 771968544 770667851 769302726 767793834 766262650 764718115 763071239 761351645
2830.9G61351645j775980j986146k305984k606631l033638l668368m315257m630267
$$ 761351645 759575665 757589519 755283535 752676904 749643266 745974898 741659641 737029374
2847.2G37029374m320920l422320k282262j389622j003027j001239j238525j655221
$$ 737029374 732708454 729286134 727003872 725614250 724611223 723609984 722371459 720716238
2863.5G20716238k132654k501309k643466k573133k390921k127707j809001j606524
$$ 720716238 718583584 716082275 713438809 710865676 708474755 706347048 704538047 702931523
2879.9G02931523j567304j584470j689196j871526j992226k041041k125442k249361
$$ 702931523 701364219 699779749 698090553 696219027 694226801 692185760 690060318 687810957
2896.2F87810957k315402k347350k402544k444029k560258k865195l278196l698349
$$ 687810957 685495555 683148205 680745661 678301632 675741374 672876179 669597983 665899634
2912.5F65899634m050493m138946l798068l196955k591490j979828j267434n94794
$$ 665899634 661849141 657710195 653912127 650715172 648123682 646143854 644876420 644281626
2928.8F44281626k07424J22666O98984J306474J759648K147317K371252K190232J657486
$$ 644281626 644074202 644196868 644895852 646202326 647961974 650109291 652480543 654670775 656328261
2947.2F56328261J082480N85914P0154k92241l12508j87158p3433k6345m1485K563
$$ 656328261 657410741 657996655 658066809 657774568 657462060 657274902 657201469 657175124 657133639 657136202
2967.6F57136202R0539J66595K46406L24786N00619O96063O85036O53863P40290P26461
$$ 657136202 657226741 657393336 657639742 657964528 658465147 659161210 659846246 660500109 661240399 661966860
2987.9F61966860O20783M33623M9770l07202n42879p60555r08018j026809j105845
$$ 661966860 662587643 663021266 663071036 662763834 662220955 661460400 660552382 659525573 658419728
3006.3F58419728j081943j051128j133680j318634j501560j646936j733363j727760
$$ 658419728 657337785 656286657 655152977 653834343 652332783 650685847 648952484 647224724
3022.6F47224724j786530j936316j916528j814008j857221k023220k157628k125860
$$ 647224724 645438194 643501878 641585350 639771342 637914121 635890901 633733273 631607413
3038.9F31607413k082646k157211k278626k384007k389848k367318k414405k439857
$$ 631607413 629524767 627367556 625088930 622704923 620315075 617947757 615533352 613093495
3055.3F13093495k473473k523661k441943k308845k267420k321601k419293k434313
$$ 613093495 610620022 608096361 605654418 603345573 601078153 598756552 596337259 593902946
3071.6E93902946k335668k188444k133370k285182k465665k527714k531231k491891
$$ 593902946 591567278 589378834 587245464 584960282 582494617 579966903 577435672 574943781
3087.9E74943781k456367k526999k630174k599001k486407k513528k675951k745807
$$ 574943781 572487414 569960415 567330241 564731240 562244833 559731305 557055354 554309547
3104.2E54309547k672553k628446k752661k863110k768933k706945k861738l106356
$$ 554309547 551636994 549008548 546255887 543392777 540623844 537916899 535055161 531948805
3120.5E31948805l269375l254830l151000l102481l145516l237546l256499l176988
$$ 531948805 528679430 525424600 522273600 519171119 516025603 512788057 509531558 506354570
3136.8E06354570l178656l379941l547460l504991l438592l401458l370762l506124
$$ 506354570 503175914 499795973 496248513 492743522 489304930 485903472 482532710 479026586
3153.2D79026586l727228l754705l657222l605276l622085l690034l728002l724903
$$ 479026586 475299358 471544653 467887431 464282155 460660070 456970036 453242034 449517131
3169.5D49517131l712595l699481l716946l742337l689975l653049l725350l738373
$$ 449517131 445804536 442105055 438388109 434645772 430955797 427302748 423577398 419839025
3185.8D19839025l619343l568203l660172l720254l692060l655374l624231l562898
$$ 419839025 416219682 412651479 408991307 405271053 401578993 397923619 394299388 390736490
3202.1C90736490l487437l428966l414810l397793l361046l367960l326774l226191
$$ 390736490 387249053 383820087 380405277 377007484 373646438 370278478 366951704 363725513
3218.4C63725513l192693l195524l143579l067970k991080k881944k788216k816707
$$ 363725513 360532820 357337296 354193717 351125747 348134667 345252723 342464507 339647800
3234.7C39647800k863407k794445k725422k653361k526313k457022k482683k461433
$$ 339647800 336784393 333989948 331264526 328611165 326084852 323627830 321145147 318683714
3251.1C18683714k333194k237171k288461k371043k325624k239824k220213k201140
$$ 318683714 316350520 314113349 311824888 309453845 307128221 304888397 302668184 300467044
3267.4C00467044k137869k133221k192497k233178k268552k261639k192020k155334
$$ 300467044 298329175 296195954 294003457 291770279 289501727 287240088 285048068 282892734
3283.7B82892734k160520k141833k111375k121777k199530k280682k299339k237797
$$ 282892734 280732214 278590381 276479006 274357229 272157699 269877017 267577678 265339881
3300B65339881k135128k087116k148270k308012k423197k393424k315149k285748k280459
$$ 265339881 263204753 261117637 258969367 256661355 254238158 251844734 249529585 247243837 244963378
3318.4B44963378k231151k158344k144515k208636k247363k189994k112478k034664
$$ 244963378 242732227 240573883 238429368 236220732 233973369 231783375 229670897 227636233
3334.7B27636233j953661j982660k093762k109304k066538j981511j810432j812219
$$ 227636233 225682572 223699912 221606150 219496846 217430308 215448797 213638365 211826146
3351B11826146k025396k065063j832664j649051j656801j642778j440660j288622j430810
$$ 211826146 209800750 207735687 205903023 204253972 202597171 200954393 199513733 198225111 196794301
3369.3A96794301j686066j696676j404613j143754j077756j076102r79797q07687n43326
$$ 196794301 195108235 193411559 192006946 190863192 189785436 188709334 187729537 186921850 186378524
3387.7A86378524k47971k85819n85884n95316j97530O6609j91182n43893l59460P6755
$$ 186378524 186130553 185844734 185258850 184663534 184466004 184532613 184341431 183797538 183438078 183514833
3408.1A83514833K16380J21236M262L1709K63185M36887M56571N87315Q70854J096650
$$ 183514833 183731213 183852449 183856711 183888420 184151605 184588492 185045063 185632378 186503232 187599882
3428.5A87599882J054988J051977J234517J123964P83891Q09833J195818J487777J568645
$$ 187599882 188654870 189706847 190941364 192065328 192849219 193659052 194854870 196342647 197911292
3446.8A97911292J543418J632199J789450J905874K074495K202630K093255K097026
$$ 197911292 199454710 201086909 202876359 204782233 206856728 209059358 211152613 213249639
3463.2B13249639K518713K782956K420232J890137J928360K361983K735644K808795
$$ 213249639 215768352 218551308 220971540 222861677 224790037 227152020 229887664 232696459
3479.5B32696459K555057K471134K731621K838150K774075K911255L128409L266960
$$ 232696459 235251516 237722650 240454271 243292421 246066496 248977751 252106160 255373120
3495.8B55373120L190309L071785L128767L096759K932579L055393L470540L778816
$$ 255373120 258563429 261635214 264763981 267860740 270793319 273848712 277319252 281098068
3512.1B81098068L678500L386617L437460L750264M096329M087061L769457L785134
$$ 281098068 284776568 288163185 291600645 295350909 299447238 303534299 307303756 311088890
3528.4C11088890M077405M285454M505366M597158M419148M551768M929125N061448
$$ 311088890 315166295 319451749 323957115 328554273 332973421 337525189 342454314 347515762
3544.7C47515762M844397M646123M794120N103767N220890N325556N616486N676240
$$ 347515762 352360159 357006282 361800402 366904169 372125059 377450615 383067101 388743341
3561.1C88743341N319774N264551O363451O958515O252259N978643O358028O678313
$$ 388743341 394063115 399327666 405691117 412649632 418901891 424880534 431238562 437916875
3577.4D37916875O914794P163316P054031O878257P332504P689357P194280P154852
$$ 437916875 444831669 451994985 459049016 465927273 473259777 480949134 488143414 495298266
3593.7D95298266P731915Q058369Q072078Q000434P687092P427990P953286Q345902
$$ 495298266 503030181 511088550 519160628 527161062 534848154 542276144 550229430 558575332
3610E58575332Q171737Q172512P852138P974028Q726597Q106351O991446O636381P899463
$$ 558575332 566747069 574919581 582771719 590745747 599472344 607578695 614570141 621206522 629105985
3628.4F29105985R052992P676661O987155O967067O777823O739080O505430N910158
$$ 629105985 638158977 645835638 652822793 659789860 666567683 673306763 679812193 685722351
3644.7F85722351N747080O784618P087052N410194M611611N297184N291105M476428
$$ 685722351 691469431 698254049 705341101 710751295 715362906 720660090 725951195 730427623
3661G30427623M051506L844798L519535L566623L854930L158987K849638L184080K866686
$$ 730427623 734479129 738323927 741843462 745410085 749265015 752424002 755273640 758457720 761324406
3679.4G61324406K570748K550185K543509K521693K332330K012134J889646J785695
$$ 761324406 763895154 766445339 768988848 771510541 773842871 775855005 777744651 779530346
3695.7G79530346J586318J452566J531124J588642J416087J169503R87232J118958
$$ 779530346 781116664 782569230 784100354 785688996 787105083 788274586 789261818 790380776
3712G90380776J391649J245797R37760P93040P89284P78437Q16762Q99554Q11875P69913
$$ 790380776 791772425 793018222 793955982 794749022 795538306 796316743 797133505 798033059 798844934 799614847
3732.4G99614847Q26120Q67665Q64863N51760O7711J84119P87616N24402J92940O16312
$$ 799614847 800440967 801308632 802173495 802725255 802792966 802977085 803764701 804289103 804482043 805098355
3752.8H05098355Q40306N60224L68178M91381N11288L78907K71559K20001L25203M50134
$$ 805098355 805938661 806498885 806867063 807358444 807869732 808248639 808520198 808740199 809065402 809515536
3773.2H09515536M42564M47989M13060K43068Q9884R3102K54452M02272L94702K36869
$$ 809515536 809958100 810406089 810819149 811062217 811152101 811245203 811499655 811901927 812296629 812533498
3793.6H12533498J63495K19643R3639J06931L07739R0718M2975L43442L54588J23799
$$ 812533498 812696993 812916636 813010275 813117206 813424945 813515663 813558638 813902080 814256668 814380467
3814H14380467J59562L20732j8656j30951J56641K13086J95325J89602K35140K67327
$$ 814380467 814540029 814860761 814842105 814711154 814867795 815080881 815276206 815465808 815700948 815968275
3834.4H15968275L4690k22266q6307J00791K39611L42309K24471k20894p91967k46525
$$ 815968275 816002965 815780699 815694392 815795183 816034794 816377103 816601574 816380680 815588713 815342188
3854.8H15342188N76079M60982J93238L0935P332m9532j61767j9312P3433J22130J76191
$$ 815342188 815918267 816379249 816572487 816603422 816610754 816561222 816399455 816380143 816453576 816575706 816751897
3877.2H16751897J5498o0P2896K623N066n7637n0366J62959J53363n3287j78695j77264
$$ 816751897 816767395 816767335 816840231 816842854 816847920 816790283 816739917 816902876 817056239 817002952 816824257 816646993
3901.7H16646993k9445J70887J44601L695j9371k6643r0480j4067J54018O7234j26719
$$ 816646993 816617548 816788435 816933036 816936731 816917360 816890717 816800237 816786170 816940188 817007422 816880703
3924.1H16880703l8981J05440L9876L5166J11461K3186q7082q3864l338Q3685J04487
$$ 816880703 816841722 816947162 816987038 817022204 817133665 817156851 817069769 816985905 816982567 817066252 817170739
3946.5H17170739J11401Q5354n126m6611K0027J05501J15275R0301Q1182Q1658O7294
$$ 817170739 817282140 817367494 817362368 817315757 817335784 817441285 817556560 817646861 817728043 817809701 817876995
3969H17876995J3589l6358K7477J59264J67489J30653J88590J59144k0802q8334M4584
$$ 817876995 817890584 817854226 817881703 818040967 818208456 818339109 818527699 818686843 818666041 818577707 818622291
3991.4H18622291J79172J77562R9480
$$ 818622291 818801463 818979025 819078505
3997.5H19078505
$$ 819078505
##END=$$ End of the data block
