##TITLE=$$ Begin of the data block
##JCAMP-DX=5.00 $$ ACD/SpecManager v 10.08
##SPECTROMETER/DATA SYSTEM=Alpha
##DATE=10 Apr 2014 09:27:12
##DATA TYPE=INFRARED SPECTRUM
##DATA CLASS=XYDATA
##ORIGIN=
##OWNER=
##NPOINTS=1765
##FIRSTX=399.75695801
##LASTX=3997.56933594
##MAXX=3997.56933594
##MINX=399.75695801
##MAXY=0.85154223
##MINY=0.18351166
##XFACTOR=1.0000000000
##YFACTOR=1.000000000000000e-9
##FIRSTY=0.58203781
##DELTAX=2.03957629
##XUNITS=1/CM
##YUNITS=ARBITRARY UNITS
##XYDATA=(X++(Y..Y))
$$ plain form
399.8 582037807 580004275 579011738 576772213 574559450 573465645 571745634 569882333 569610000 569287002
418.1 569287002 566835821 565569460 566267967 565969586 564480603 563970566 563706815 562245965 561038733
436.5 561038733 560782313 560019433 559120178 559352994 559213996 557849824 557128191 557134211 556378007 555496991
456.9 555496991 555237710 554229677 552519798 551768780 551545501 550413013 549130559 548334599 546935558
475.2 546935558 545277297 544701815 544528961 543554485 542667747 542546630 541927755 540420294 539291680
493.6 539291680 538454115 536942542 535693288 535252154 534229875 532855034 532356739 531689465 529831648
511.9 529831648 528175354 527407229 526112199 524266124 523113966 522013545 520050585 518261254 517040193
530.3 517040193 515229642 513178825 512117505 511244595 509662211 508508265 508067548 507050574 505627036
$$ packed form
399.8E82037807k033532r92537k239525k212763j093805j720011j863301k72333l22998
418.1E69287002k451181j266361O98507k98381j488983n10037k63751j460850j207232
436.5E61038733k56420p62880q99255K32816j38998j364172p21633O020p56204q81016
456.9E55496991k59281j008033j709879p51018k23279j132488j282454p95960j399041
475.2E46935558j658261n75482j72854r74476q86738j21117o18875j507461j128614
493.6E39291680q37565j511573j249254m41134j022279j374841m98295o67274j857817
511.9E29831648j656294p68125j295030j846075j152158j100421j962960j789331j221061
530.3E17040193j810551k050817j061320q72910j582384j153946m40717j016974j423538
$$ plain form
548.6 505627036 504768908 503818452 502066910 500527084 499630928 498138040 495967567 494199067 492274195
567 492274195 489346832 486568332 484599352 482235372 479331404 477002978 474766582 471830010 469092041
585.4 469092041 466963112 464370400 461289853 458851665 456794322 454226583 451510906 448983848
601.7 448983848 446163207 443653524 442589968 442339927 441607773 440793365 441032022 442633092 445600510
620 445600510 449797153 454274118 458111823 461953014 466351241 470361263 473646283 477067143 480233103
638.4 480233103 481967121 482699901 483933389 486279815 489241034 491897553 492731750 491665661 492356479
656.7 492356479 497545093 504509509 509988368 513891041 517308712 520787835 524188817 527935863
673.1 527935863 531490266 534231782 537179351 540461481 542881966 544829011 547351718 549674571
$$ packed form
548.6E05627036q58128r50456j751542j539826q96156j492888k170473j768500j924872
567D92274195k927363k778500j968980k363980k903968k328426k236396k936572k737969
585.4D69092041k128929k592712l080547k438188k057343k567739k715677k527058
601.7D48983848k820641k509683j063556k50041p32154q14408K38657J601070K967418
620D45600510M196643M476965L837705L841191M398227M010022L285020L420860L165960
638.4D80233103J734018P32780J233488K346426K961219K656519Q34197j066089O90818
656.7D92356479N188614O964416N478859L902673L417671L479123L400982L747046
673.1E27935863L554403K741516K947569L282130K420485J947045K522707K322853
$$ plain form
689.4 549674571 551104248 552635431 554474711 555548906 556301773 557902336 559801459 561329544 563370705
707.7 563370705 566131532 568470895 570562840 573410630 576269329 578297377 580642164 583731592
724 583731592 586273193 588201702 590691745 593284190 594971240 596675634 599080920 601140141 602696061
742.4 602696061 604875922 607324958 609121740 611133933 613963485 616355658 618140221 620697677
758.7 620697677 623633146 625625551 627369940 629750729 631593883 632403910 633450568 634605825 634532750
777.1 634532750 633708954 633178174 632180810 630472898 629660308 630220890 631164789 633054972 637078822
795.4 637078822 642317772 647663176 653816581 660723090 666745842 671720982 676685512 681025624
811.7 681025624 683833778 686127663 688248634 688766241 687681675 686220825 683921516 680018783 675687075
$$ packed form
689.4E49674571J429677J531183J839280J074195P52867J600563J899123J528085K041161
707.7E63370705K760827K339363K091945K847790K858699K028048K344787L089428
724E83731592K541601J928509K490043K592445J687050J704394K405286K059221J555920
742.4F02696061K179861K449036J796782K012193K829552K392173J784563K557456
758.7F20697677K935469J992405J744389K380789J843154Q10027J046658J155257p3075
777.1F34532750q23796n30780r97364j707912q12590N60582R43899J890183M023850
795.4F37078822N238950N345404O153405O906509O022752M975140M964530M340112
811.7F81025624K808154K293885K120971N17607j084566j460850k299309l902733m331708
$$ plain form
830.1 675687075 671711862 667194605 662258446 658168495 654529572 650245667 646130979 643410563
846.4 643410563 641891539 641922891 645019710 651127160 658806622 667903304 678542197 689205706
862.7 689205706 698789239 707953691 716543436 723121881 727942169 732276261 735533893 737143815
879.1 737143815 738324225 739284456 738774240 737172127 735827148 734321654 732234299 731070220 731572390
897.4 731572390 732602000 733984470 736431360 738987565 740402997 741283119 741938591 741052091 738451540
915.8 738451540 735446334 731994927 727618694 723816693 721924484 721165657 721138775 722521722 724534631
934.1 724534631 725703657 726465642 727582574 728111267 727615416 727134466 726444542 724249303 720912397
952.5 720912397 717253447 712429225 705766618 697982252 688996136 677694142 664240301 649544299
$$ packed form
830.1F75687075l975213m517257m936159m089951l638923m283905m114688k720416
846.4F43410563j519024L1352L096819O107450P679462R096682J0638893J0663509
862.7F89205706R583533R164452Q589745O578445M820288M334092L257632J609922
879.1G37143815J180410R60231n10216j602113j344979j505494k087355j164079N02170
897.4G31572390J029610J382470K446890K556205J415432Q80122O55472q86500k600551
915.8G38451540l005206l451407m376233l802001j892209p58827k6882J382947K012909
934.1G24534631J169026P61985J116932N28693m95851m80950o89924k195239l336906
952.5G20912397l658950m824222o662607p784366q986116j1301994j3453841j4696002
$$ plain form
968.8 649544299 633563876 616790771 601177454 587839663 576408207 566901803 559551597 553399861
985.1 553399861 547472835 542173624 537931859 534221590 530891359 528461397 526743591 525091648
1001.4 525091648 523491979 521773994 518936694 514537394 509181023 503159106 496360898 489287227
1017.7 489287227 482522368 475801706 468845308 462086916 455716223 449420631 443466127 438404500
1034.1 438404500 434051394 430058718 426559210 423464388 420290798 416927963 413594335 410262793
1050.4 410262793 407071352 404884309 404396713 405308604 406985670 408920556 410220504 409958452 408104390
1068.7 408104390 405126840 401214451 396617174 391882390 387145728 382142931 376866817 371330768
1085 371330768 365219444 358559698 352170169 346999884 343532592 341977358 342292637 343822271 345714986
$$ packed form
968.8F49544299j5980423j6773105j5613317j3337791j1431456r506404p350206o151736
985.1E53399861n927026n299211m241765l710269l330231k429962j717806j651943
1001.4E25091648j599669j717985k837300m399300n356371o021917o798208p073671
1017.7D89287227o764859o720662o956398o758392o370693o295592n954504n061627
1034.1D38404500m353106l992676l499508l094822l173590l362835l333628l331542
1050.4D10262793l191441k187043m87596R11891J677066J934886J299948k62052j854062
1068.7D08104390k977550l912389m597277m734784m736662n002797n276114n536049
1085C71330768o111324o659746o389529n170285l467292j555234L15279J529634J892715
$$ plain form
1103.4 345714986 347574890 349209428 350214541 350377142 349720716 347821951 343885899 337693751 330540866
1121.8 330540866 325139135 323360592 324390084 326232642 327331930 327427655 328037560 330542028 334705830
1140.1 334705830 339592099 344362795 348412931 351719826 354651421 357372969 359984070 362890303
1156.4 362890303 366495043 370917052 376412064 383408666 391865164 401260853 411190301 421325237
1172.7 421325237 431182206 440448672 449197471 457357466 464475244 470272481 474611670 477073729
1189.1 477073729 477508187 476582050 475177646 473973066 473803103 475418776 478683203 482772291 487017512
1207.4 487017512 490902096 493867010 495817006 497233808 498442829 499447048 500452101 501737118
1223.7 501737118 503231347 504895508 507019639 509651065 512476921 515454888 518660665 521760285
$$ packed form
1103.4C45714986J859904J634538J005113J62601o56426j898765l936052o192148p152885
1121.8C30540866n401731j778543J029492J842558J099288R5725O09905K504468M163802
1140.1C34705830M886269M770696M050136L306895K931595K721548K611101K906233
1156.4C62890303L604740M422009N495012O996602Q456498R395689R929448J0134936
1172.7D21325237R856969R266466Q748799Q159995P117778N797237M339189K462059
1189.1D77073729M34458r26137j404404j204580j69963J615673L264427M089088M245221
1207.4D87017512L884584K964914J949996J416802J209021J004219J005053J285017
1223.7E01737118J494229J664161K124131K631426K825856K977967L205777L099620
$$ plain form
1240.1 521760285 524452209 526834190 528877437 530291796 531085670 531585395 531917691 532157719 532765150
1258.4 532765150 534231961 536696076 540232182 544892967 550289214 555933356 561835110 568089366
1274.7 568089366 574434102 580742955 587306261 594227314 601195693 608068943 614914060 621565044
1291 621565044 627844334 633876860 639634430 644733548 649096906 652979732 656344175 659088492 661507607
1309.4 661507607 663791001 665734529 667365730 669085801 670948446 672688663 674446881 676392794
1325.7 676392794 678145170 679410994 680379331 681024551 681123734 680889428 680754960 680739462 680759966 681090355
1346.1 681090355 681747437 682292283 682611525 682881236 682944000 682670712 682198405 681374311 680003881 678371489
1366.5 678371489 676787317 675367177 673737168 671599925 669249594 666448772 662738919 658858299
$$ packed form
1240.1E21760285K691924K381981K043247J414359P93874M99725L32296K40028O07431
1258.4E32765150J466811K464115L536106M660785N396247N644142N901754O254256
1274.7E68089366O344736O308853O563306O921053O968379O873250O845117O650984
1291F21565044O279290O032526N757570N099118M363358L882826L364443K744317K419115
1309.4F61507607K283394J943528J631201J720071J862645J740217J758218J945913
1325.7F76392794J752376J265824R68337O45220R9183k34306j34468j5498K0504L30389
1346.1F81090355O57082N44846L19242K69711O2764k73288m72307q24094j370430j632392
1366.5F78371489j584172j420140j630009k137243k350331k800822l709853l880620
$$ plain form
1382.8 658858299 656162024 654748738 653725624 652724981 651389182 649361908 647011042 644301772
1399.1 644301772 641257644 638117433 634746253 631485045 628526568 625881255 623760581 622092426
1415.5 622092426 620447457 618797302 617697954 616938829 616415679 616273522 616172254 616193831 616729617
1433.8 616729617 617668867 618897915 620441139 622385979 624514759 626790106 629638970 633126557
1450.1 633126557 636930943 641292036 647856712 656722128 663861871 670085013 677331805 684845269
1466.4 684845269 691456676 698456526 707178533 715385258 721442401 726144850 729744852 732430696
1482.8 732430696 734354436 735487521 735394895 734312713 733173311 731495261 728423059 724836051 721754193
1501.1 721754193 719044089 715273619 708181262 701637566 696958959 692624331 688466847 684593201
$$ packed form
1382.8F58858299k696275j413286j023114j000643j335799k027274k350866k709270
1399.1F44301772l044128l140211l371180l261208k958477k645313k120674j668155
1415.5F22092426j644969j650155j099348p59125n23150j42157j01268K1577N35786
1433.8F16729617R39250J229048J543224J944840K128780K275347K848864L487587
1450.1F33126557L804386M361093O564676Q865416P139743O223142P246792P513464
1466.4F84845269O611407O999850Q722007Q206725O057143M702449L600002K685844
1482.8G32430696J923740J133085r2626j082182j139402j678050l072202l587008l081858
1501.1G21754193k710104l770470p092357o543696m678607m334628m157484l873646
$$ plain form
1517.4 684593201 681458235 678353548 675234318 672403634 669625819 667515635 665498555 662949383
1533.7 662949383 661222577 660268605 658351779 655938745 654624522 653887391 653560817 653637588 654085219
1552.1 654085219 654674411 655265152 655060947 653578699 652474046 651155651 649135470 645775080 640901744
1570.5 640901744 636467576 631375015 623163879 615002215 607911825 599850833 591052175 582090080
1586.8 582090080 572886169 563392222 553925574 544501543 535238922 526288927 517499208 508808315
1603.1 508808315 500329554 491940558 483387411 475109488 467575788 459483534 449999392 442691267
1619.4 442691267 436929196 430443287 424374431 419213086 414807945 411820829 409625441 407466471
1635.7 407466471 406705678 407493979 409137487 411495745 415207982 420262158 424578965 429694772 437982470
$$ packed form
1517.4F84593201l134966l104687l119230k830684k777815k110184k017080k549172
1533.7F62949383j726806r53972j916826k413034j314223p37131l26574P6771M47631
1552.1F54085219N89192N90741k04205j482248j104653j318395k020181l360390m873336
1570.5F40901744m434168n092561q211136q161664p090390q060992q798658q962095
1586.8E82090080r203911r493947r466648r424031r262621q949995q789719q690893
1603.1E08808315q478761q388996q553147q277923p533700q092254r484142p308125
1619.4D42691267n762071o485909o068856n161345m405141k987116k195388k158970
1635.7D07466471p60793P88301J643508K358258L712237N054176M316807N115807Q287698
$$ plain form
1654.1 437982470 444733173 450426012 457118094 465273023 473983943 481824160 490522385 500968456
1670.4 500968456 510456443 520290077 531298399 541195929 550413489 561008930 574964523 587174237
1686.7 587174237 597170472 607659638 617265344 627579510 639502108 651443183 664716661 675545514
1703 675545514 684526384 693527997 701170862 707770824 713664532 718847036 723329902 726040602 727345526
1721.4 727345526 728818893 731542885 735143900 739102602 743113518 747587025 752022386 755655944
1737.7 755655944 759660006 764030099 768271863 772730887 777615190 782825768 788013756 792592347
1754 792592347 796735108 800445735 803573251 806535065 809079409 811176956 813236594 815213740 816855311
1772.4 816855311 818339348 819850206 821335077 822716057 824064076 825399935 826622307 827788413
$$ packed form
1654.1D37982470O750703N692839O692082Q154929Q710920P840217Q698225J0446071
1670.4E00968456R487987R833634J1008322R897530R217560J0595441J3955593J2209714
1686.7E87174237R996235J0489166R605706J0314166J1922598J1941075J3273478J0828853
1703F75545514Q980870R001613P642865O599962N893708N182504M482866K710700J304924
1721.4G27345526J473367K723992L601015L958702M010916M473507M435361L633558
1737.7G55655944M004062M370093M241764M459024M884303N210578N187988M578591
1754G92592347M142761L710627L127516K961814K544344K097547K059638J977146J641571
1772.4H16855311J484037J510858J484871J380980J348019J335859J222372J166106
$$ plain form
1788.7 827788413 828953564 830077171 831061423 832079887 833122134 833987474 834705293 835496783 836332023
1807 836332023 837004185 837606192 838277042 838920176 839457095 840052247 840687096 841207802 841730297 842337668
1827.4 842337668 842775106 843057215 843512177 844053745 844466925 844835043 845313311 845697880 845915318 846228898
1847.8 846228898 846656501 847013712 847251654 847540021 847852886 848050356 848263621 848688602 849071085 849139631
1868.2 849139631 849190950 849412322 849560201 849653423 849903941 850149691 850223064 850328922 850549579 850623548
1888.6 850623548 850616515 850813985 851002514 850987375 851025701 851213515 851277888 851228416 851331353 851484776 851432264
1911.1 851432264 851377547 851515055 851542234 851387143 851375401 851440370 851338923 851221919 851278007 851285934 851094544
1933.5 851094544 850981236 851024270 850928426 850690901 850586116 850502849 850233674 850031674 850014627 849860072
$$ packed form
1788.7H27788413J165151J123607R84252J018464J042247Q65340P17819P91490Q35240
1807H36332023O72162O02007O70850O43134N36919N95152O34849N20706N22495O07371
1827.4H42337668M37438K82109M54962N41568M13180L68118M78268L84569K17438L13580
1847.8H46228898M27603L57211K37942K88367L12865J97470K13265M24981L82483O8546
1868.2H49139631N1319K21372J47879R3222K50518K45750P3373J05858K20657P3969
1888.6H50623548p033J97470J88529j5139L8326J87814O4373m9472J02937J53423n2512
1911.1H51432264n4717J37508K7179j55091j1742O4969j01447j17004N6088P927j91390
1933.5H51094544j13308M3034r5844k37525j04785q3267k69175k02000j7047j54555
$$ plain form
1953.9 849860072 849567652 849431276 849318862 848997653 848724961 848637760 848426640 848099768 847966492 847881973
1974.3 847881973 847571611 847294986 847231925 847083628 846794069 846640527 846563935 846277952 845913291 845759928
1994.7 845759928 845624566 845320165 845081568 844939590 844669282 844348609 844195545 844054401 843734801 843427479
2015.1 843427479 843226075 842937291 842591286 842403889 842223465 841875255 841599047 841500163 841313303 841009080
2035.5 841009080 840815663 840671837 840394795 840121925 840005279 839834571 839533925 839338541 839254379 839076698
2055.9 839076698 838859320 838731527 838582039 838370562 838230193 838167489 838041902 837900400 837866485 837839067
2076.3 837839067 837716520 837612808 837594450 837534845 837422013 837359965 837313056 837225020 837147951 837096691 837039948
2098.7 837039948 836983919 836972713 837001085 836996794 836965442 836985588 837030411 837013423 837014616 837106466 837202549 837258577
$$ packed form
1953.9H49860072k92420j36376j12414l21209k72692q7201k11120l26872j33276q4519
1974.3H47881973l10362k76625o3061j48297k89559j53542p6592k85983l64661j53363
1994.7H45759928j35362l04401k38597j41978k70308l20673j53064j41144l19600l07322
2015.1H43427479k01404k88784l46005j87397j80424l48210k76208r8884j86860l04223
2035.5H41009080j93417j43826k77042k72870j16646j70708l00646j95384q4162j77681
2055.9H39076698k17378j27793j49488k11477j40369o2704j25587j41502l3915k7418
2076.3H37839067j22547j03712j8358n9605j12832o2048m6909q8036p7069n1260n6743
2098.7H37039948n6029j1206K8372m291l1352K0146M4823j6988J193R1850R6083N6028
$$ plain form
2123.2 837258577 837341845 837461233 837540984 837597489 837691903 837783933 837834597 837911785 838052332 838192642 838323176
2145.6 838323176 838492930 838636875 838700056 838786721 838950872 839095473 839179754 839297950 839456737 839559495
2166 839559495 839638889 839826584 840063810 840198100 840304196 840470135 840603530 840674162 840766132 840866387
2186.4 840866387 840923071 840998054 841133893 841235220 841254473 841290891 841359258 841377378 841401219 841512680 841597378
2208.8 841597378 841602266 841654897 841750681 841769218 841741025 841785669 841866851 841879666 841892123 841958761 841939270 841818511
2233.3 841818511 841791630 841854632 841810763 841718972 841756582 841782033 841670930 841597080 841622949 841606617 841557086
2255.8 841557086 841587007 841602504 841490209 841398060 841454446 841519773 841515541 841557086 841656446 841713786 841765821
2278.2 841765821 841903925 842033267 842082202 842143357 842202127 842133820 842024028 842017472 841999114 841898084 841829717
$$ packed form
2123.2H37258577Q3268J19388P9751N6505R4414R2030N0664P7188J40547J40310J30534
2145.6H38323176J69754J43945O3181Q6665J64151J44601Q4281J18196J58787J02758
2166H39559495P9394J87695K37226J34290J06096J65939J33395P0632R1970J00255
2186.4H40866387N6684P4983J35839J01327J9253L6418O8367J8120K3841J11461Q4698
2208.8H41597378M888N2631R5784J8537k8193M4644Q1182J2815J2457O6638j9491j20759
2233.3H41818511k6881O3002m3869r1791L7610K5451j11103p3850K5869j6332m9531
2255.8H41557086K9921J5497j12295r2149N6386O5327m232M1545R9360N7340N2035
2278.2H41765821J38104J29342M8935O1155N8770o8307j09792o556j8358j01030o8367
$$ plain form
2300.6 841829717 841796100 841656029 841424465 841268957 841194510 841098726 840982974 840812922 840472102 840059578
2321 840059578 839851737 839841783 839712739 839450479 839372575 839451849 839458942 839444518 839410603 839262724 839327216
2343.5 839327216 840133786 841216683 841578126 841067493 840179622 839289963 838646352 838517666 838672817
2361.8 838672817 838957071 839664102 840767562 841883838 842866421 843870938 844904959 845842481 846765935
2380.2 846765935 847697198 848419726 848841548 849156439 849446952 849570990 849591851 849735320 849900365 849904299
2400.6 849904299 849929750 850093365 850177646 850141287 850191653 850287676 850274324 850271285 850373626 850375652 850219071
2423 850219071 850172043 850241065 850184917 850109100 850213528 850292265 850181997 850098073 850132346 850092053 849964321
2445.4 849964321 849939346 849948049 849823356 849723518 849764943 849712670 849529862 849470675 849455059 849282622 849133551
$$ packed form
2300.6H41829717l3617j40071k31564j55508p4447r5784j15752j70052l40820m12524
2321H40059578k07841r954j29044k62260p7904P9274P093j4424l3915j47879O4492
2343.5H39327216Q06570J082897L61443n10633q87871q89659o43611j28686J55151
2361.8H38672817K84254P07031J103460J116276R82583J004517J034021R37522R23454
2380.2H46765935R31263P22528M21822L14891K90513J24038K0861J43469J65045L934
2400.6H49904299K5451J63615Q4281l6359N0366R6023j3352l039J02341K026j56581
2423H50219071m7028O9022n6148p5817J04428P8737j10268q3924L4273m0293j27732
2445.4H49964321k4975Q703j24693r9838M1425n2273j82808n9187j5616j72437j49071
$$ plain form
2467.9 849133551 849125922 849042892 848849475 848775566 848783612 848637462 848448634 848419487 848363936 848158002 848014593
2490.3 848014593 847955048 847785413 847593725 847545326 847477674 847284079 847176313 847186804 847074449 846869588
2510.7 846869588 846789539 846736312 846541226 846365929 846308589 846164882 845938385 845864356 845862985 845698714 845487297
2533.1 845487297 845404088 845303535 845103025 844967723 844898224 844723642 844520390 844474852 844441235 844243646
2553.5 844243646 844066024 843986630 843793988 843521237 843375981 843235850 842944205 842706800 842621386 842415035
2573.9 842415035 842033863 841770709 841618717 841334105 840987444 840735912 840468347 840104461 839788139 839512348
2594.3 839512348 839112461 838668823 838343084 838005364 837517381 837055206 836702287 836288333 835825562 835443616
2614.7 835443616 835048020 834529221 834028959 833674729 833297431 832788646 832316875 831905127 831418514 830954254
$$ packed form
2467.9H49133551p629q3030j93417p3909Q046j46150j88828k9147n5551k05934j43409
2490.3H48014593n9545j69635j91688m8399o7652j93595j07766J0491j12355k04861
2510.7H46869588q0049n3227j95086j75297n7340j43707k26497p4029j371j64271k11417
2533.1H45487297q3209j00553k00510j35302o9499j74582k03252m5538l3617j97589
2553.5H44243646j77622p9394j92642k72751j45256j40131k91645k37405q5414k06351
2573.9H42415035l81172k63154j51992k84612l46661k51532k67565l63886l16322k75791
2594.3H39512348l99887m43638l25739l37720m87983m62175l52919m13954m62771l81946
2614.7H35443616l95596n18799n00262l54230l77298n08785m71771m11748m86613m64260
$$ plain form
2635.1 830954254 830618441 830221534 829688907 829249740 828923285 828454733 827878594 827463388 827139139 826684356
2655.5 826684356 826215744 825857639 825436652 824933529 824543893 824193537 823714793 823243618 822873175 822435200
2675.9 822435200 821916342 821490407 821084499 820512652 819916904 819480240 819040239 818486273 817995608 817574859
2696.3 817574859 817042410 816463232 815964222 815408409 814735413 814141691 813664317 813100338 812439680 811883688
2716.7 811883688 811369121 810722530 810107946 809635043 809079766 808379650 807751298 807200730 806585610 806008756
2737.1 806008756 805521131 804936171 804267049 803716779 803232670 802626967 801964223 801376760 800775886 800073087
2757.5 800073087 799380004 798728108 797978640 797188103 796512723 795848966 795076132 794285476 793495834 792619467
2777.9 792619467 791717887 790900290 790096998 789214849 788324773 787413836 786343336 785203755 784197986
$$ packed form
2635.1H30954254l35813l96907n32627m39167l26455m68552n76139m15206l24249m54783
2655.5H26684356m68612l58105m20987n03123l89636l50356m78744m71175l70443m37975
2675.9H22435200n18858m25935m05908n71847n95748m36664m40001n53966m90665m20749
2696.3H17574859n32449n79178m99010n55813o72996n93722m77374n63979o60658n55992
2716.7H11883688n14567o46591o14584m72903n55277p00116o28352n50568o15120n76854
2737.1H06008756m87625n84960o69122n50270m84109o05703o62744n87463o00874p02799
2757.5H00073087o93083o51896p49468p90537o75380o63757p72834p90656p89642q76367
2777.9G92619467r01580q17597q03292q82149q90076r10937j070500j139581j005769
$$ plain form
2796.2 784197986 783239365 782113969 780900478 779766023 778600752 777312815 776040316 774816036
2812.5 774816036 773515403 772169352 770861447 769466400 767923295 766394734 764914989 763316154
2828.9 763316154 761562288 759741664 757758617 755493820 752928555 749896467 746209800 741895020
2845.2 741895020 737275600 732963920 729556859 727281094 725886106 724871635 723834693 722556174
2861.5 722556174 720903635 718794346 716276705 713588715 710979939 708582282 706503093 704748929
2877.8 704748929 703131795 701529622 699955046 698283732 696405828 694431663 692416489 690289676
2894.1 690289676 688045204 685726047 683351338 680961430 678563595 676002264 673089743 669792235
2910.4 669792235 666110337 662067056 657947540 654178739 650994301 648416877 646435976 645146072
$$ packed form
2796.2G84197986r58621j125396j213491j134455j165271j287937j272499j224280
2812.5G74816036j300633j346051j307905j395047j543105j528561j479745j598835
2828.9G63316154j753866j820624j983047k264797k565265l032088l686667m314780
2845.2G41895020m619420m311680l407061k275765j394988j014471j036942j278519
2861.5G22556174j652539k109289k517641k687990k608776k397657k079189j754164
2877.8G04748929j617134j602173j574576j671314j877904j974165k015174k126813
2894.1F90289676k244472k319157k374709k389908k397835k561331k912521l297508
2910.4F69792235l681898m043281m119516l768801l184438k577424j980901j289904
$$ plain form
2926.8 645146072 644556701 644404173 644580007 645282090 646546960 648279011 650447011 652811050 654936969
2945.1 654936969 656560063 657652438 658239365 658304393 658009350 657712519 657566190 657518208 657527268 657538831
2965.5 657538831 657508552 657492697 657636762 657936633 658253908 658713400 659441233 660217643 660928786 661654770
2985.9 661654770 662349522 662976682 663451493 663530350 663201511 662621856 661851227 660948694 659937978 658843160
3006.3 658843160 657743931 656678081 655560017 654261351 652770221 651144564 649432182 647698045
3022.6 647698045 645915210 644022226 642145395 640353978 638510644 636476159 634287119 632133603
3038.9 632133603 630042255 627882659 625578821 623136759 620697439 618321419 615893960 613419890
3055.3 613419890 610956311 608497024 606089711 603775799 601529658 599234760 596804023 594347417
$$ packed form
2926.8F45146072n89371j52528J75834P02083J264870J732051K168000K364039K125919
2945.1F54936969J623094J092375N86927O5028k95043k96831j46329m7982R060J1563
2965.5F57538831l0279j5855J44065K99871L17275M59492P27833P76410P11143P25984
2985.9F61654770O94752O27160M74811P8857l28839n79655p70629r02533j010716j094818
3006.3F58843160j099229j065850j118064j298666j491130j625657j712382j734137
3022.6F47698045j782835j892984j876831j791417j843334k034485k189040k153516
3038.9F32133603k091348k159596k303838k442062k439320k376020k427459k474070
3055.3F13419890k463579k459287k407313k313912k246141k294898k430737k456606
$$ plain form
3071.6 594347417 591987312 589752018 587597668 585342288 582891226 580367625 577880442 575450838
3087.9 575450838 573020518 570473492 567842662 565256357 562731862 560182989 557511151 554767668
3104.2 554767668 552082121 549421668 546648085 543822944 541111350 538413823 535522163 532396138
3120.5 532396138 529139698 525893509 522723794 519612849 516497433 513298750 510042727 506848395
3136.8 506848395 503665805 500274956 496694475 493152797 489703804 486323327 482992470 479523569
3153.2 479523569 475788236 471989691 468307674 464675158 461030543 457388490 453713626 449966639
3169.5 449966639 446208477 442510396 438844293 435130537 431393474 427680731 423962802 420248806
3185.8 420248806 416592419 412986040 409354776 405688643 402018905 398359925 394743532 391207933
$$ packed form
3071.6E94347417k360105k235294k154350k255380k451062k523601k487183k429604
3087.9E75450838k430320k547026k630830k586305k524495k548873k671838k743483
3104.2E54767668k685547k660453k773583k825141k711594k697527k891660l126025
3120.5E32396138l256440l246189l169715l110945l115416l198683l256023l194332
3136.8E06848395l182590l390849l580481l541678l448993l380477l330857l468901
3153.2D79523569l735333l798545l682017l632516l644615l642053l674864l746987
3169.5D49966639l758162l698081l666103l713756l737063l712743l717929l713996
3185.8D20248806l656387l606379l631264l666133l669738l658980l616393l535599
$$ plain form
3202.1 391207933 387743115 384294450 380826443 377378434 373998165 370666742 367375553 364122391
3218.4 364122391 360884398 357674390 354537427 351469994 348455548 345549047 342764705 339962870
3234.7 339962870 337073296 334223866 331497431 328869283 326339096 323906511 321472079 318991393
3251.1 318991393 316568434 314279705 312037736 309728503 307404488 305124879 302868009 300677955
3267.4 300677955 298580229 296457291 294238538 291977346 289721221 287505984 285325050 283126175
3283.7 283126175 280912250 278740257 276632220 274524003 272339463 270085692 267815948 265589654
3300 265589654 263427287 261323154 259212375 256942481 254497796 252055794 249720961 247456685 245231643
3318.4 245231643 243030041 240856826 238717765 236512810 234210953 231947675 229794219 227773830
$$ packed form
3202.1C91207933l464818l448665l468007l448009l380269l331423l291189l253162
3218.4C64122391l237993l210008l136963l067433l014446k906501k784342k801835
3234.7C39962870k889574k849430k726435k628148k530187k432585k434432k480686
3251.1C18991393k422959k288729k241969k309233k324015k279609k256870k190054
3267.4C00677955k097726k122938k218753k261192k256125k215237k180934k198875
3283.7B83126175k213925k171993k108037k108217k184540k253771k269744k226294
3300B65589654k162367k104133k110779k269894k444685k442002k334833k264276k225042
3318.4B45231643k201602k173215k139061k204955k301857k263278k153456k020389
$$ plain form
3334.7 227773830 225868791 223912895 221830562 219720393 217612386 215589330 213771731 211956441
3351 211956441 209936857 207883403 206022993 204342410 202689230 201058567 199632153 198357880 196927831
3369.3 196927831 195230022 193517670 192086577 190926015 189865574 188782692 187777385 187004596
3385.7 187004596 186522007 186304286 186022356 185426518 184824407 184630185 184704691 184496090 183905572 183511660
3406.1 183511660 183577627 183824956 184018776 184064388 184066236 184282824 184702769 185163006 185792774 186713308
3426.5 186713308 187782153 188783199 189840525 191083431 192178175 192962393 193795189 194977030 196441382
3444.8 196441382 198012799 199574023 201212585 203011811 204941198 207038045 209289715 211407557
3461.1 211407557 213448763 215922713 218701750 221118361 223032773 224989980 227318019 230006605
$$ packed form
3334.7B27773830j905039j955896k082333k110169k108007k023056j817599j815290
3351B11956441k019584k053454j860410j680583j653180j630663j426414j274273j430049
3369.3A96927831j697809j712352j431093j160562j060441j082882j005307p72789
3385.7A87004596m82589k17721k81930n95838o02111j94222P4506k08601n90518l93912
3406.1A83511660O5967K47329J93820M5612J848K16588M19945M60237O29768R20534
3426.5A86713308J068845J001046J057326J242906J094744P84218Q32796J181841J464352
3444.8A96441382J571417J561224J638562J799226J929387K096847K251670K117842
3461.1B11407557K041206K473950K779037K416611J914412J957207K328039K688586
$$ plain form
3477.4 230006605 232803330 235357746 237848967 240627125 243499830 246255115 249118790 252211243
3493.8 252211243 255458653 258662492 261770755 264920324 268009573 270923048 273987114 277501762
3510.1 277501762 281297326 284948140 288323343 291777730 295541316 299643070 303711683 307451576
3526.4 307451576 311257750 315379471 319680005 324195355 328826815 333279938 337829918 342718005
3542.7 342718005 347732246 352561384 357166231 361908287 367055684 372343421 377665132 383281469
3559 383281469 389016032 394379407 399608523 405905783 412877709 419196457 425199509 431549370 438226163
3577.4 438226163 445148587 452309668 459335089 466195375 473554313 481286675 488519222 495715708
3593.7 495715708 503467262 511508405 519568741 527599096 535326481 542727292 550585270 558871448
$$ packed form
3477.4B30006605K796725K554416K491221K778158K872705K755285K863675L092453
3493.8B52211243L247410L203839L108263L149569L089249K913475L064066L514648
3510.1B77501762L795564L650814L375203L454387L763586M101754M068613L739893
3526.4C07451576L806174M121721M300534M515350M631460M453123M549980M888087
3542.7C42718005N014241M829138M604847M742056N147397N287737N321711N616337
3559C83281469N734563N363375N229116O297260O971926O318748O003052O349861O676793
3577.4D38226163O922424P161081P025421O860286P358938P732362P232547P196486
3593.7D95715708P751554Q041143Q060336Q030355P727385P400811P857978Q286178
$$ plain form
3610 558871448 567074537 575333118 583226085 591159761 599896967 608074963 615077674 621657848 629497707
3628.4 629497707 638578355 646311641 653316259 660294533 667086244 673832893 680370986 686333537
3644.7 686333537 692051649 698710322 705750465 711164296 715726137 721027136 726443350 731006801
3661 731006801 735050321 738861084 742345750 745864451 749641716 752720714 755534828 758750141 761663020
3679.4 761663020 764254749 766787767 769275665 771784365 774216533 776321769 778248549 780061662
3695.7 780061662 781658173 783074915 784530461 786075473 787507653 788684905 789661586 790819585
3712 790819585 792245328 793478131 794394135 795147657 795870066 796589792 797365427 798239052 799081087 799916267
3732.4 799916267 800721884 801533282 802426279 803013027 803106725 803359807 804161310 804629147 804820359 805441916
$$ packed form
3610E58871448Q203089Q258581P892967P933676Q737206Q177996P002711O580174P839859
3628.4F29497707R080648P733286P004618O978274O791711O746649O538093N962551
3644.7F86333537N718112O658673P040143N413831M561841N300999N416214M563451
3661G31006801M043520L810763L484666L518701L777265L078998K814114L215313K912879
3679.4G61663020K591729K533018K487898K508700K432168K105236J926780J813113
3695.7G80061662J596511J416742J455546J545012J432180J177252R76681J157999
3712G90819585J425743J232803R16004P53522P22409P19726P75635Q73625Q42035Q35180
3732.4G99916267Q05617Q11398Q92997N86748R3698K53082Q01503M67837J91212O21557
$$ plain form
3752.8 805441916 806252539 806862772 807356417 807916641 808371186 808613777 808815598 809123397 809564054 810033798
3773.2 810033798 810426831 810793519 811182737 811501980 811664283 811792493 812054873 812430620 812773943 812936902
3793.6 812936902 813020289 813213110 813351691 813524008 813835323 813865364 813886881 814286232 814712584 814856887
3814 814856887 814938188 815149069 815088272 815034270 815286040 815526724 815742493 815949917 816176236 816411436
3834.4 816411436 816367328 816042364 815901577 816047609 816392362 816788554 816960514 816607833 815741181 815599263
3854.8 815599263 816312075 816836059 817012548 816967666 816898823 816831231 816656947 816619515 816736698 816941798
3875.2 816941798 817170918 817164004 817126870 817223668 817278802 817316115 817269742 817212939 817359328 817487299 817336917
3897.6 817336917 817040801 816868365 816915035 817149937 817330480 817335844 817332327 817377985 817353427 817266941 817229092
$$ packed form
3752.8H05441916Q10623O10233M93645N60224M54545K42591K01821L07799M40657M69744
3773.2H10033798L93033L66688L89218L19243J62303J28210K62380L75747L43323J62959
3793.6H12936902Q3387J92821J38581J72317L11315L0041K1517L99351M26352J44303
3814H14856887Q1301K10881o0797n4002K51770K40684K15769K07424K26319K35200
3834.4H16411436m4108l24964j40787J46032L44753L96192J71960l52681q66652j41918
3854.8H15599263P12812N23984J76489m4882o8843o7592j74284l7432J17183K05100
3875.2H16941798K29120o914l7134R6798N5134L7313m6373n6803J46389J27971j50382
3897.6H17336917k96116j72436M6670K34902J80543N364l517M5658k4558q6486l7849
$$ plain form
3920 817229092 817200601 817152977 817204058 817305207 817321897 817363977 817478478 817500889 817458510 817452729 817477047 817546368
3944.5 817546368 817631483 817686796 817737997 817810297 817897081 817956269 817993522 818084598 818209529 818269134 818273544
3966.9 818273544 818302453 818380654 818461537 818538427 818673790 818803191 818879783 819020629 819177866 819187105 819130838
3989.4 819130838 819196522 819364548 819482327 819517851
3997.5 819517851
$$ packed form
3920H17229092k8491m7624N1081J01149J6690M2080J14501K2411m2379n781K4318O9321
3944.5H17546368Q5115N5313N1201P2300Q6784N9188L7253R1076J24931N9605M410
3966.9H18273544K8909P8201Q0883P6890J35363J29401P6592J40846J57237R239n6267
3989.4H19130838O5684J68026J17779L5524
3997.5H19517851
##END=$$ End of the data block
