##TITLE=$$ Begin of the data block
##JCAMP-DX=5.00 $$ ACD/SpecManager v 10.08
##SPECTROMETER/DATA SYSTEM=Alpha
##DATE=10 Apr 2014 09:27:12
##DATA TYPE=INFRARED SPECTRUM
##DATA CLASS=XYDATA
##ORIGIN=
##OWNER=
##NPOINTS=1765
##FIRSTX=399.75695801
##LASTX=3997.56933594
##MAXX=3997.56933594
##MINX=399.75695801
##MAXY=0.85119796
##MINY=0.18302587
##XFACTOR=1.0000000000
##YFACTOR=1.000000000000000e-9
##FIRSTY=0.57790637
##DELTAX=2.03957629
##XUNITS=1/CM
##YUNITS=ARBITRARY UNITS
##XYDATA=(X++(Y..Y))
399.8 577906370 576275945 575344205 573117971 570930123 570343196 569324017 567418158 566876233 566644251
418.1 566644251 564288795 562830925 563078284 562464893 561254799 561193287 560940504 559200644 557815313
436.5 557815313 557566345 556819260 556049943 556682110 556980491 555939794 555401325 555460453 554576218 553450286
456.9 553450286 553269327 552595198 550961614 550030589 549565256 548165500 546697199 546010673 544893146
475.2 544893146 543433487 543028772 542924523 541787922 540765107 540718555 540074110 538408220 537353754
493.6 537353754 536710501 535290956 534151554 533818126 532627821 530877054 530203462 529636860 528004110
511.9 528004110 526657224 526099086 524777949 522873640 521782041 520732880 518690050 516831756 515683174
530.3 515683174 513975382 511938810 510834038 509937823 508364081 507227659 506756485 505568564 503922045
548.6 503922045 503032804 502175808 500480235 498935193 497892141 496298283 494271636 492644012 490750253
567 490750253 487935543 485259235 483207285 480729938 477913141 475775510 473507822 470326692 467422575
585.4 467422575 465337843 462949932 460070223 457648396 455466092 452925384 450457007 448083937
601.7 448083937 445239395 442665458 441506147 441144496 440368563 439670622 440091491 441772044 444747299
620 444747299 448927402 453361124 457183301 461043537 465412199 469399929 472764909 476292431 479527056
638.4 479527056 481304914 482030660 483192503 485469669 488395542 491075099 491986781 490916252 491515011
656.7 491515011 496709704 503748596 509205639 512960792 516168952 519773543 523521066 527340353
673.1 527340353 530793846 533521831 536530256 539769232 542121053 544152260 546840787 549210727
689.4 549210727 550582767 552124918 554023683 555065334 555754721 557424188 559485137 561098754 563117206
707.7 563117206 565835834 568142533 570226431 573113382 576028824 578090191 580451131 583570898
724 583570898 586098015 587983370 590506554 593166351 594894290 596615970 598978639 600922048 602382541
742.4 602382541 604599774 607155621 608966887 610913396 613704026 616099298 617899001 620477438
758.7 620477438 623449385 625506103 627282143 629564464 631247997 631980956 633051872 634252310 634201407
777.1 634201407 633395076 632861495 631832182 630150080 629422545 629992247 630919695 632848442 636850417
795.4 636850417 641986847 647294939 653504372 660403550 666328847 671242833 676210880 680583179
811.7 680583179 683405280 685626864 687646449 688165784 687178493 685801506 683514178 679614425 675302267
830.1 675302267 671309292 666804135 661970913 657980502 654365718 650088310 645989120 643251240
846.4 643251240 641771913 641918361 645032108 651044071 658644557 667726576 678383231 689047992
862.7 689047992 698616207 707750976 716265738 722758830 727543831 731899619 735224366 736886859
879.1 736886859 738051772 738948226 738373220 736754775 735430360 733921349 731812119 730671465 731246412
897.4 731246412 732296586 733596027 735952079 738471448 739898503 740851879 741580606 740688145 738057733
915.8 738057733 735052824 731624246 727300942 723531365 721625388 720861912 720820189 722134113 724070787
934.1 724070787 725221634 726019025 727168798 727709532 727217376 726688325 725915194 723710537 720453501
952.5 720453501 716868162 712052882 705400527 697677076 688716114 677348912 663835824 649152517
968.8 649152517 633220911 616496623 600916624 587612987 576210558 566709042 559338152 553146660
985.1 553146660 547199488 541893840 537600160 533807576 530438125 528006792 526271164 524548411
1001.4 524548411 522845745 521090388 518295646 513933122 508596838 502603352 495822251 488771588
1017.7 488771588 482052624 475369781 468446285 461708039 455307931 448983371 443057030 438032329
1034.1 438032329 433689922 429713637 426253647 423199892 420028627 416641265 413326174 410041481
1050.4 410041481 406861126 404629797 404071331 404953599 406647384 408606201 409904212 409624875 407781601
1068.7 407781601 404801518 400827229 396181434 391469061 386777192 381801754 376527995 371000946
1085 371000946 364922136 358271569 351867646 346688807 343223512 341685802 342026681 343560129 345434338
1103.4 345434338 347270757 348901004 349933118 350106388 349427521 347506076 343579531 337425202 330276102
1121.8 330276102 324849457 323076904 324110389 325941384 327044964 327136666 327727199 330224186 334420532
1140.1 334420532 339357436 344136506 348144799 351392478 354282409 357000172 359630853 362553298
1156.4 362553298 366143197 370520890 375989586 383002847 391501755 400911599 410816491 420945138
1172.7 420945138 430803686 440056175 448799789 456950337 464045256 469830066 474144787 476571739
1189.1 476571739 477012366 476110041 474704564 473503411 473368526 475017995 478291988 482392460 486664027
1207.4 486664027 490562409 493504703 495416403 496810704 498004973 499001265 500015974 501302123
1223.7 501302123 502788603 504472971 506641746 509320199 512190700 515168428 518315554 521380246
1240.1 521380246 524091005 526520491 528621852 530056834 530849218 531369448 531710863 531936586 532526851
1258.4 532526851 533983111 536449134 539958775 544548452 549889445 555537641 561462760 567705870
1274.7 567705870 574016750 580297828 586851060 593763053 600695968 607536733 614397764 621073723
1291 621073723 627342284 633366287 639146566 644272625 648643136 652535081 655931711 658708692 661140323
1309.4 661140323 663424909 665374756 667027235 668762088 670611739 672340989 674107790 676068664
1325.7 676068664 677844226 679135084 680100620 680712938 680766523 680496037 680378377 680416882 680465162 680787444
1346.1 680787444 681447506 682026386 682372689 682650149 682708144 682402492 681869626 681020498 679693222 678094923
1366.5 678094923 676491857 675020337 673347950 671213150 668889463 666109622 662430823 658566177
1382.8 658566177 655835211 654397964 653404772 652408063 651031733 648998439 646689773 644001603 640940845
1401.2 640940845 637778282 634423971 631207049 628268540 625630975 623511672 621798813 620067000
1417.5 620067000 618406594 617379189 616652668 616145551 616010070 615890205 615905046 616411209 617277682
1435.9 617277682 618517816 620145142 622110426 624209344 626461923 629292369 632769942 636559427
1452.2 636559427 640844524 647249341 656100452 663416326 669731617 676952004 684468865 691121161
1468.5 691121161 698067605 706651807 714809537 720940173 725743055 729385257 732056797 733953297
1484.8 733953297 735021949 734858513 733823061 732755601 731023490 727830768 724241734 721229255
1501.1 721229255 718479156 714494407 707286358 700945079 696415246 692093909 687896848 684012473
1517.4 684012473 680848122 677695096 674632490 671910465 669233859 667163849 665090442 662482798
1533.7 662482798 660736620 659649253 657526851 655227065 654164791 653570533 653291583 653354108 653746903
1552.1 653746903 654228568 654610932 654204607 652993262 652221560 651021361 649000645 645561993 640645087
1570.5 640645087 636242509 631138682 622917652 614816010 607769251 599718511 590918601 581965446
1586.8 581965446 572785199 563296437 553801596 544340312 535041571 526064217 517269433 508572459
1603.1 508572459 500054061 491607457 483019948 474726677 467144281 458956122 449458808 442211628
1619.4 442211628 436405450 429838657 423773468 418657690 414313376 411340147 409070969 406879336
1635.7 406879336 406203777 407032460 408683032 411047846 414734870 419779003 424082518 429131329 437487513
1654.1 437487513 444418430 450215161 456947714 465115219 473848909 481684536 490317404 500737548
1670.4 500737548 510262609 520119786 531182706 541125834 550284326 560720623 574616730 586968541
1686.7 586968541 597060859 607544303 617072105 627258539 639085412 650976956 664246082
1701 664246082 675118864 684142530 693202078 700878799 707450688 713255763 718293309 722719371
1717.3 722719371 725570440 726982474 728476703 731234312 734863162 738776624 742679060 747072995
1733.6 747072995 751587212 755315542 759327829 763684273 767935395 772376120 777198851 782412171
1749.9 782412171 787692428 792309344 796419799 800116360 803248405 806200981 808735669 810809493
1766.3 810809493 812832475 814756870 816391289 817978799 819573045 821055472 822414935 823775828
1782.6 823775828 825135410 826372027 827522457 828627288 829694808 830677390 831728160 832799792
1798.9 832799792 833672166 834418714 835258603 836097538 836733043 837319434 838011980 838672698 839211881 839815915
1819.3 839815915 840454698 840941906 841407478 841974735 842418313 842770457 843290567 843838334 844218493 844548762
1839.7 844548762 844989657 845344186 845570445 845913827 846371174 846748769 846989393 847289562 847627759 847833395
1860.1 847833395 848034561 848416567 848721027 848761022 848882139 849178016 849350691 849435687 849670529 849894941
1880.5 849894941 849947512 850087047 850374401 850459039 850414455 850591302 850782871 850767791 850798786 850989342
1900.9 850989342 851050794 850971282 851034045 851163983 851125717 851090372 851197958 851186991 851048887 851078093 851168871
1923.3 851168871 851095676 851016402 851096094 851101577 850893378 850762367 850795031 850695729 850438237 850302160 850220323
1945.7 850220323 849985361 849811912 849794209 849624217 849314034 849155724 849031031 848721385 848460853 848354220
1966.1 848354220 848132014 847826540 847699463 847623765 847344398 847073376 846983433 846795857 846483111 846352398
1986.5 846352398 846305132 846029878 845678389 845522523 845363677 845046699 844827890 844702840 844406843 844058931
2006.9 844058931 843900025 843750477 843438625 843158126 842959583 842664361 842341781 842174888 841997862 841672778
2027.3 841672778 841408730 841267824 841031253 840708733 840530217 840423226 840168357 839887142 839746118 839573324
2047.7 839573324 839303434 839113057 838983893 838766277 838560104 838469207 838339746 838130057 837989986 837929249
2068.1 837929249 837818503 837691069 837618709 837528229 837396979 837332845 837336600 837277353 837175906 837120056 837052822
2090.5 837052822 836939752 836880326 836883605 836846054 836765707 836753249 836789012 836750984 836693585 836714447 836744845
2113 836744845 836714864 836713850 836803794 836906552 836963892 837028623 837125003 837211013 837303281 837427318 837537587
2135.4 837537587 837613583 837723553 837876856 837995708 838072181 838187814 838334322 838444054 838568747 838742673
2155.8 838742673 838874936 838934243 839038849 839221716 839355290 839433968 839595795 839813352 839956880 840063810
2176.2 840063810 840201497 840312362 840393305 840537429 840695918 840771794 840826809 840921581 840998650 841040194 841111898
2198.6 841111898 841188729 841205299 841246486 841380775 841456771 841429591 841480255 841604114 841646850 841641009 841688752
2221.1 841688752 841730416 841682971 841652811 841719925 841745138 841686547 841700077 841765821 841695726 841566563 841586232
2243.5 841586232 841635168 841568053 841509640 841508627 841457903 841394246 841408312 841390193 841277063 841230869 841297209
2265.9 841297209 841308594 841268063 841331542 841463923 841544449 841623187 841769516 841873765 841900468 841970921 842032313
2288.4 842032313 841930509 841792881 841818571 841866136 841763794 841644883 841611564 841504335 841271400 841082752
2308.8 841082752 840957046 840797782 840687513 840583980 840219200 839677393 839368105 839340270 839225292 838956594
2329.2 838956594 838842809 838883281 838826656 838716030 838664234 838607788 838795543 839710116 840856016 841225028
2349.6 841225028 840648770 839648962 838669360 837892592 837619722 837813497 838195324 838847876 839879751
2367.9 839879751 841072202 842245400 843452394 844619513 845613718 846567690 847541988 848311365 848740101
2386.3 848740101 849021673 849289894 849431992 849500895 849685967 849857509 849852085 849880993 850045681 850108385
2406.7 850108385 850041747 850064576 850142956 850126266 850125015 850252867 850307226 850174367 850122571 850202441 850159407
2429.1 850159407 850091338 850209057 850288749 850154817 850053489 850082815 850009799 849848628 849824429 849845827 849743545
2451.5 849743545 849657357 849675655 849592745 849397540 849342346 849361718 849230170 849089861 849082589 849009573 848815143
2474 848815143 848708332 848672867 848522484 848360717 848335505 848263562 848043442 847894728 847856879 847715735 847521544
2496.4 847521544 847459316 847398639 847211242 847081125 847063839 846948922 846749246 846667707 846614242 846395612
2516.8 846395612 846194208 846167266 846078098 845860958 845754385 845712602 845535338 845364869 845325708 845214784
2537.2 845214784 844983757 844851553 844803691 844639719 844455183 844432533 844383299 844140172 843929231 843853533
2557.6 843853533 843697965 843444467 843297064 843186200 842922986 842651844 842508554 842296302 841945410 841694713
2578 841694713 841549695 841293812 840979576 840732515 840414882 839979470 839663088 839445412 839066625 838602722
2598.4 838602722 838258445 837900043 837394178 836937010 836596012 836177468 835693002 835306287 834917426 834383547
2618.8 834383547 833879530 833539128 833153009 832631350 832165122 831754565 831263781 830788016 830438614 830080569
2639.2 830080569 829622746 829202175 828840971 828363061 827817678 827418208 827073693 826602101 826116920 825718284
2659.6 825718284 825266480 824772060 824417949 824082732 823577404 823089480 822738349 822324932 821817517 821383059
2680 821383059 820949495 820364416 819787502 819369435 818929613 818362474 817841291 817400575 816881716 816320002
2700.4 816320002 815831721 815292478 814631641 814052939 813594639 813025415 812342346 811757922 811213672 810573995
2720.8 810573995 809983075 809505224 808942080 808260739 807653606 807105780 806492209 805915594 805418491 804844677
2741.2 804844677 804212987 803678870 803169727 802533388 801865280 801297069 800707281 799989164 799290001 798647583
2761.6 798647583 797889650 797071874 796385586 795745909 794999897 794226170 793445349 792526007 791553378 790712297
2782 790712297 789930403 789067864 788174748 787247360 786173761 785052121 784038424 783031285 781886160
2800.3 781886160 780707896 779605687 778433681 777136385 775893569 774696410 773366928 771983981
2816.6 771983981 770675898 769295931 767793477 766309381 764797390 763139606 761408210 759647310
2832.9 759647310 757685304 755405366 752801657 749734998 746034563 741711915 737075865 732728124
2849.3 732728124 729299903 727053463 725706637 724741518 723759711 722499907 720796466 718629122 716115654
2867.6 716115654 713459671 710866153 708477676 706408024 704638600 702981532 701390743 699874163
2883.9 699874163 698210418 696289897 694268346 692227066 690115690 687908471 685616851 683251202
2900.2 683251202 680825770 678358912 675782144 672908783 669610977 665898740 661858439 657741487
2916.6 657741487 653953671 650754988 648189247 646259129 645019948 644423246 644210577 644348860 645056963
2934.9 645056963 646334171 648074210 650245965 652641356 654837728 656494737 657542586 658076942
2951.2 658076942 658143938 657877147 657582879 657411873 657342076 657336831 657343566 657353640 657410145 657577813 657859921
2973.7 657859921 658181787 658650398 659371078 660114765 660748124 661422074 662150979 662834883 663335741 663413405
2994.1 663413405 663083553 662540138 661821187 660947442 659958780 658888221 657800972 656735599 655623078
3012.4 655623078 654332340 652832985 651186407 649447739 647697330 645911753 644005477 642121494
3028.7 642121494 640340269 638505757 636511147 634388387 632249415 630110025 627902567 625606656
3045.1 625606656 623222709 620824873 618453503 616030276 613539875 611018598 608515680 606104612
3061.4 606104612 603801548 601558566 599259615 596833944 594379246 592030823 589838922 587687731
3077.7 587687731 585375309 582899868 580385566 577886045 575441957 573018789 570477605 567814648
3094 567814648 565208077 562710345 560163796 557489336 554787993 552156568 549525380 546721280 543826818
3112.4 543826818 541075826 538384736 535518229 532403588 529155433 525948226 522818327 519711673
3128.7 519711673 516550660 513282120 510009825 506837726 503654242 500275850 496745288 493250728
3145 493250728 489817172 486414433 483056813 479579389 475847393 472066730 468394637 464756846 461089641
3163.4 461089641 457378864 453642458 449905366 446176797 442487568 438815564 435093790 431376547
3179.7 431376547 427693009 423979491 420248240 416555017 412900418 409242183 405573994 401898891
3196 401898891 398219198 394582361 391042858 387591630 384172797 380730629 377286404 373884082 370516688
3214.3 370516688 367218345 363999546 360807121 357641846 354539365 351456255 348390818 345450550
3230.7 345450550 342639148 339820176 336940169 334100991 331380695 328757316 326210499 323749900
3247 323749900 321315706 318870157 316481441 314175665 311855704 309474289 307136744 304892659 302678347
3265.3 302678347 300494939 298381716 296251297 294021070 291742265 289489537 287261575 285009086
3281.6 285009086 282773137 280615509 278496712 276363462 274194330 272003382 269787759 267495841
3298 267495841 265183300 262989640 260934711 258852392 256575584 254148513 251734853 249401703 247109875
3316.3 247109875 244854391 242659345 240501165 238323867 236091062 233845949 231653601 229512274
3332.6 229512274 227446556 225482032 223514363 221446201 219317347 217174917 215121567 213283390
3348.9 213283390 211486146 209498495 207434803 205564976 203937769 202335387 200676501 199192211
3365.3 199192211 197897553 196453139 194751784 193100512 191717848 190511942 189416811 188391566
3381.6 188391566 187420696 186610743 186097294 185839236 185513780 184917361 184324786 184145987 184231073 184002802
3402 184002802 183411419 183025867 183064356 183265239 183421612 183489099 183557928 183801189 184219345 184708223
3422.4 184708223 185351878 186241269 187304378 188338801 189405337 190628588 191724077 192517549 193344906
3440.7 193344906 194513798 195956364 197525829 199097350 200723559 202505305 204448134 206565008
3457 206565008 208778083 210858434 212933823 215433896 218211383 220645964 222561747 224497482 226829439
3475.4 226829439 229522645 232297480 234862551 237406656 240192324 243039757 245817795 248694927
3491.7 248694927 251733184 254940629 258166254 261321902 264517277 267634273 270539045 273545027
3508 273545027 276995480 280786872 284481853 287891537 291348040 295095146 299171150 303238750 307019711
3526.4 307019711 310864270 315012127 319342613 323859423 328459650 332915485 337502986 342404425
3542.7 342404425 347392946 352197975 356844157 361640811 366792083 372087538 377404302 382965922
3559 382965922 388660163 394035965 399272025 405526757 412494928 418870479 424916506 431263655 437942535
3577.4 437942535 444911242 452113509 459140450 465943784 473238766 481010705 488333166 495584518
3593.7 495584518 503338516 511338532 519351780 527391791 535177112 542608321 550458312 558754563
3610 558754563 566971421 575193822 583017170 590908170 599670410 607913256 614957809 621505260 629296303
3628.4 629296303 638418198 646205187 653228760 660213768 667022347 673796415 680320621 686185956
3644.7 686185956 691728771 698204994 705282450 710911751 715638816 720986784 726355612 730858207
3661 730858207 734887600 738661706 741980493 745286644 749026597 752165973 755013764 758336604 761377275
3679.4 761377275 764034271 766586363 769018531 771386206 773759246 775983274 778034091 779878974
3695.7 779878974 781424344 782759130 784197867 785807431 787253201 788345397 789208651 790329993
3712 790329993 791830540 793158293 794131339 794898093 795601428 796299696 797120273 798102558 798950970 799598575
3732.4 799598575 800204039 801023126 802025795 802615166 802511573 802578330 803500235 804088593 804236412 804925442
3752.8 804925442 805901885 806563199 807003379 807565331 808127701 808491707 808675051 808836818 809248388 809814274
3773.2 809814274 810271442 810660303 811039686 811339974 811523914 811689377 811947286 812305689 812671304 812860906
3793.6 812860906 812933028 813044488 812992871 812968791 813285649 813478708 813692451 814218044 814660192 814727247
3814 814727247 814667821 814744711 814641356 814701855 815109909 815399408 815574467 815704167 815843880 816021621
3834.4 816021621 815970004 815699220 815681219 815956414 816342354 816694260 816819608 816377640 815324843 815173209
3854.8 815173209 816053450 816666663 816788912 816628218 816570103 816588402 816437423 816431880 816597164 816812456
3875.2 816812456 817025006 816988289 816961586 817092597 817171514 817254663 817227662 817149758 817265809 817358613 817215741
3897.6 817215741 816930354 816682577 816662788 816949964 817280054 817438304 817497671 817473948 817299366 817182541
3918 817182541 817311049 817383766 817257583 817259014 817396045 817408144 817440152 817629158 817735910 817690253 817590535
3940.4 817590535 817493320 817487657 817552209 817619085 817705989 817816436 817910552 817964792 818029225 818133235 818219304
3962.9 818219304 818223655 818202257 818268001 818383634 818441749 818511248 818699658 818875372 818945825 819070280 819231987
3985.3 819231987 819254398 819213927 819279373 819450736 819570005 819581032
3997.5 819581032
##END=$$ End of the data block
