##TITLE=$$ Begin of the data block
##JCAMP-DX=5.00 $$ ACD/SpecManager v 10.08
##SPECTROMETER/DATA SYSTEM=Alpha
##DATE=10 Apr 2014 09:27:12
##DATA TYPE=INFRARED SPECTRUM
##DATA CLASS=XYDATA
##ORIGIN=
##OWNER=
##NPOINTS=1765
##FIRSTX=399.75695801
##LASTX=3997.56933594
##MAXX=3997.56933594
##MINX=399.75695801
##MAXY=0.85161203
##MINY=0.18376824
##XFACTOR=1.0000000000
##YFACTOR=1.000000000000000e-9
##FIRSTY=0.58007789
##DELTAX=2.03957629
##XUNITS=1/CM
##YUNITS=ARBITRARY UNITS
##XYDATA=(X++(Y..Y))
399.8E80077887j637221j075446k631188k545595p08342j277864k188205k86877M10795
418.1E68137944k237559j804649J74462l37541j144767m27246n46097j595617j143396
436.5E59075534l84390j066566q55982N90682m470j215696l74854L41654o30021j109302
456.9E54366589n20051j029432j720309q28981k23220j024842j206458q05199j350283
475.2E45657814j497925m50015k22087j178920r63748j05261q64268j660227q08001
493.6E37907362m43578j341760j238644n50568j309753j769125p80881o05464j448631
511.9E28418958j217007n44131j273632j863480j175165j214683k072871j769364j188874
530.3E16099751j844823k059162j140356r93848j482427j011372n24997j197696j535595
$$ plain form
399.8 580077887 578440666 577365220 574734032 572188437 571480095 570202231 568014026 567727149 568137944
418.1 568137944 565900385 564095736 564270198 563932657 562787890 562360644 561814547 560218930 559075534
436.5 559075534 558691144 557624578 556768596 557359278 557354808 556139112 555764258 556105912 555475891 554366589
456.9 554366589 553846538 552817106 551096797 550267816 550044596 549019754 547813296 547008097 545657814
475.2 545657814 544159889 543709874 543487787 542308867 541345119 541239858 540375590 538715363 537907362
493.6 537907362 537463784 536122024 534883380 534332812 533023059 531253934 530473053 529867589 528418958
511.9 528418958 527201951 526657820 525384188 523520708 522345543 521130860 519057989 517288625 516099751
530.3 516099751 514254928 512195766 511055410 510061562 508579135 507567763 507042766 505845070 504309475
548.6E04309475p99357p84934j714587j665265j130849j673132k072930j522035j715660
567D91230726k708494k623588k042532k514482k935201k278238k126217k744198k548575
585.4D68709201k100081k716660l215075k501338k031684k436132k502769k454281
601.7D48751181k980172k639443j056135k63571p60526p28518L74586J617223K869934
620D45184559M167109M577816L965825L914088M377335L949791L288001L477007L204495
638.4D80106026J752645P66188J243859K307266K932280K666265Q80361j023442P04557
656.7D92336005N261660P076352N542040L889382L307402L400386L427863L806829
673.1E28047919L672660K859592K954543L218174K457738K050519K559363K294899
$$ plain form
548.6 504309475 503510118 502725184 501010597 499345332 498214483 496541351 494468421 492946386 491230726
567 491230726 488522232 485898644 483856112 481341630 478406429 476128191 474001974 471257776 468709201
585.4 468709201 466609120 463892460 460677385 458176047 456144363 453708231 451205462 448751181
601.7 448751181 445771009 443131566 442075431 441811860 441051334 440322816 440697402 442314625 445184559
620 445184559 449351668 453929484 457895309 461809397 466186732 470136523 473424524 476901531 480106026
638.4 480106026 481858671 482624859 483868718 486175984 489108264 491774529 492654890 491631448 492336005
656.7 492336005 497597665 504674017 510216057 514105439 517412841 520813227 524241090 528047919
673.1 528047919 531720579 534580171 537534714 540752888 543210626 545261145 547820508 550115407
689.4E50115407J363754J464605J800954J101077Q80838J744866J919746J448810K020419
707.7E63860476K839565K427280K087891K732277K753258K064466K472163L124237
724E84361613K460003J900077K559006K643883J698375J718759K386868J947522J416862
742.4F03092968K151549K522707J856089J991868K766311K389193J852333K605200
758.7F21228218K926469J979649J755536K365946J806081Q03709J066804J156091j41680
777.1F34946823r29296n77032r64046j610994p18057N81383R79722J950204L973305
795.4F37632012N109311N308747O237685O930590N920947M918515M970730M258096
811.7F81286633K708972K263367K048433M32789j057327j398385k313613l952265m334748
$$ plain form
689.4 550115407 551479161 552943766 554744720 555845797 556726635 558471501 560391247 561840057 563860476
707.7 563860476 566700041 569127321 571215212 573947489 576700747 578765213 581237376 584361613
724 584361613 586821616 588721693 591280699 593924582 595622957 597341716 599728584 601676106 603092968
742.4 603092968 605244517 607767224 609623313 611615181 614381492 616770685 618623018 621228218
758.7 621228218 624154687 626134336 627889872 630255818 632061899 632865608 633932412 635088503 634946823
777.1 634946823 634017527 633440495 632476449 630865455 630147398 630728781 631708503 633658707 637632012
795.4 637632012 642741323 648050070 654287755 661218345 667139292 672057807 677028537 681286633
811.7 681286633 683995605 686258972 688307405 688740194 687682867 686284482 683970869 680018604 675683856
830.1F75683856l904343m387855m829943m091382l691078m242479l957689k634227
846.4F43944860j535059J02878L144205N973041P559359R097993J0588885J0521948
862.7F89398110R528935R182513Q529603O529093M888952M378795L197968J551152
879.1G37185121J154065R30905n16474j575768j332104j519919k082586j120269N05268
897.4G31628239R53198J316368K444923K561510J401663Q71479O24180r04262k517760
915.8G38379538k919435l486455m415989l776073j925707q33035m7564J339197J912475
934.1G24226952J114606P68006J110018N08844m85479m85659p45952k210617l274977
952.5G20525742l619016m847645o666899p736147q950471j1319161j3504147j4731706
$$ plain form
830.1 675683856 671779513 667391658 662561715 658470333 654779255 650536776 646579087 643944860
846.4 643944860 642409801 642512679 645656884 651629925 659189284 668287277 678876162 689398110
862.7 689398110 698927045 708109558 716639161 723168254 728057206 732436001 735633969 737185121
879.1 737185121 738339186 739270091 738753617 737177849 735845745 734325826 732243240 731122971 731628239
897.4 731628239 732581437 733897805 736342728 738904238 740305901 741177380 741801560 740897298 738379538
915.8 738379538 735460103 731973648 727557659 723781586 721855879 721022844 720975280 722314477 724226952
934.1 724226952 725341558 726109564 727219582 727728426 727242947 726757288 726011336 723800719 720525742
952.5 720525742 716906726 712059081 705392182 697656035 688705564 677386403 663882256 649150550
968.8F49150550j5926420j6611994j5470922j3292908j1416495r491623p385611o247044
985.1E53307533o007433n316555m274905l784835l346265k405047j747549j738846
1001.4E24686098j707852j830458k928198m426181n320609n990803o786942p018865
1017.7D88676190o710291o715357o905109o656706o298303o217480n855680n009174
1034.1D38308090m353881m007786l490717l046542l136754l354490l317654l304571
1050.4D10295695l154904k159237m79073R15051J668632J890599J215965l20464j863033
1068.7D08009231k997637l954798m611790m701584m683644m972577n261332n476445
1085C71349424o039232o622851o373167n190402l485590j495958M07309J548200J849145
$$ plain form
968.8 649150550 633224130 616612136 601141214 587848306 576431811 566940188 559554577 553307533
985.1 553307533 547300100 541983545 537708640 533923805 530577540 528172493 526424944 524686098
1001.4 524686098 522978246 521147788 518219590 513793409 508472800 502481997 495695055 488676190
1017.7 488676190 481965899 475250542 468345433 461688727 455390424 449172944 443317264 438308090
1034.1 438308090 433954209 429946423 426455706 423409164 420272410 416917920 413600266 410295695
1050.4 410295695 407140791 404981554 404502481 405417532 407086164 408976763 410192728 409872264 408009231
1068.7 408009231 405011594 401056796 396445006 391743422 387059778 382087201 376825869 371349424
1085 371349424 365310192 358687341 352314174 347123772 343638182 342142224 342549533 344097733 345946878
1103.4C45946878J823545J615792J015097J80394o75112j929552l960430o205500p154226
1121.8C30656886n425244j828373R57280J792461J135111J54108O16848K484203M159957
1140.1C34703237M918784M800945M030973L268808K910107K706558K607137K917021
1156.4C62863570L584892M363775N450219O977260Q446634R383857R917975J0127246
1172.7D21115428R816587R212226Q743733Q149624P064819N771548M330665K434164
1189.1D76638794M22597r13054j383126j167476j16646J658469L285349M105419M256457
1207.4D86786783L873318K942652J937270J412213J205504J007527J008779J253187
1223.7E01427233J451314J683652K201498K712905K884746K995670L189027L087818
$$ plain form
1103.4 345946878 347770423 349386215 350401312 350581706 349906594 347977042 344016612 337811112 330656886
1121.8 330656886 325231642 323403269 324360549 326153010 327288121 327442229 328059077 330543280 334703237
1140.1 334703237 339622021 344422966 348453939 351722747 354632854 357339412 359946549 362863570
1156.4 362863570 366448462 370812237 376262456 383239716 391686350 401070207 410988182 421115428
1172.7 421115428 430932015 440144241 448887974 457037598 464102417 469873965 474204630 476638794
1189.1 476638794 477061391 476148337 474765211 473597735 473481089 475139558 478424907 482530326 486786783
1207.4 486786783 490660101 493602753 495540023 496952236 498157740 499165267 500174046 501427233
1223.7 501427233 502878547 504562199 506763697 509476602 512361348 515357018 518546045 521633863
1240.1E21633863K715648K440154K091408J422346Q08298N56052L66330K20239N93722
1258.4E32848060J461685K432406L486335M593611N320310N593479N863130O204367
1274.7E67803383O279528O238699O530285O910086O937623O850779O871998O701708
1291F21124089O308377O053745N797148N134404M378915L910601L400624K756297K419531
1309.4F61283731K302468J980305J671076J753092J882076J744568J750708J944899
1325.7F76312923J761616J272082R66787O31273O0141k74122j15275L3558L8802L31640
1346.1F81019425O76096N70893L31879K92182Q3625k97785n42164q80122j358866j598716
1366.5F78296447j582623j462877j679956k110899k271950k769351l708363l893137
$$ plain form
1240.1 521633863 524349511 526789665 528881073 530303419 531111717 531667769 532034099 532254338 532848060
1258.4 532848060 534309745 536742151 540228486 544822097 550142407 555735886 561599016 567803383
1274.7 567803383 574082911 580321610 586851895 593761981 600699604 607550383 614422381 621124089
1291 621124089 627432466 633486211 639283359 644417763 648796678 652707279 656107903 658864200 661283731
1309.4 661283731 663586199 665566504 667237580 668990672 670872748 672617316 674368024 676312923
1325.7 676312923 678074539 679346621 680313408 680944681 681004822 680730700 680615425 680648983 680687785 681019425
1346.1 681019425 681695521 682266414 682598293 682890475 682974100 682676315 682134151 681254029 679895163 678296447
1366.5 678296447 676713824 675250947 673570991 671460092 669188142 666418791 662710428 658817291
1382.8F58817291k749443j435399r64105r74417j385331k057493k305209k648950l035009
1401.2F41261935l176093l376186l230572k951204k637148k106309j708865j734317
1417.5F20341241j659572j013219o74605m68433j69099j67727L0219N56231Q82804
1435.9F17657840J204372J582265J939416K076983K215862K822340L500819L791511
1452.2F36791408M266679O392002Q849919P318139O338418P252157P506132O603002
1468.5F91317856O901265Q590281Q238077O206929M805863L610730K668679J898587
1484.8G34238267J060009j54436j027941j086295j748145l169000l553390l023088
1501.1G21535981k789975m024744p243454o318867m454076m281343m209220l894746
$$ plain form
1382.8 658817291 656067848 654632449 653668344 652693927 651308596 649251103 646945894 644296944 641261935
1401.2 641261935 638085842 634709656 631479084 628527880 625890732 623784423 622075558 620341241
1417.5 620341241 618681669 617668450 616993845 616525412 616356313 616188586 616218805 616775036 617657840
1435.9 617657840 618862212 620444477 622383893 624460876 626676738 629499078 632999897 636791408
1452.2 636791408 641058087 647450089 656300008 663618147 669956565 677208722 684714854 691317856
1468.5 691317856 698219121 706809402 715047479 721254408 726060271 729671001 732339680 734238267
1484.8 734238267 735298276 735143840 734115899 733029604 731281459 728112459 724559069 721535981
1501.1 721535981 718746006 714721262 707477808 701158941 696704865 692423522 688214302 684319556
1517.4F84319556l181279l169715l034652k666652k640068k073110k089619k609372
1533.7F62855089j721859j029849k047599k330243j144707o18399k51889J11878M17590
1552.1F54240012M71234L79026l89993j196742p68125j212597k045512l432870m871011
1570.5F41173422m379511n104422q198142q055210p008791q020699q802891r016097
1586.8E82587659r263754r551942r528875r471774r303630q988261q825004q746147
1603.1E08908272q545101q423358q564442q319796p639259q248657r548366p246315
1619.4D42372978n758256o545097o091088n140245m367798l009618k294957k193898
1635.7D06972021o82593Q42691J679480K374142L681273N051046M345596N132437Q415848
$$ plain form
1517.4 684319556 681138277 677968562 674933910 672267258 669627190 667554080 665464461 662855089
1533.7 662855089 661133230 660103381 658055782 655725539 654580832 653962433 653710544 653822422 654240012
1552.1 654240012 654711246 655090272 654700279 653503537 652735412 651522815 649477303 646044433 641173422
1570.5 641173422 636793911 631689489 623491347 615436137 608427346 600406647 591603756 582587659
1586.8 582587659 573323905 563771963 554243088 544771314 535467684 526479423 517654419 508908272
1603.1 508908272 500363171 491939813 483375371 475055575 467416316 459167659 449619293 442372978
1619.4 442372978 436614722 430069625 423978537 418838292 414470494 411460876 409165919 406972021
1635.7 406972021 406289428 407132119 408811599 411185741 414867014 419918060 424263656 429396093 437811941
1654.1D37811941O899387N757272O737739Q236408Q791387P829368Q622646J0443837
1670.4E01129985R535611R829580J1020363R925008R156942J0434091J3903916J2345731
1686.7E87281227J0093272J0520041R566367J0186254J1781931J1866689J3301492
1701F64597273J0900199R011805R040594P683158O585241N798220N022645M423619
1717.3G23062754K869963J461745J533329K740800L586174L893196L899932M395545
1733.6G47443438M490971L693640M021347M370511M212319M400671M814625N210817
1749.9G82658339N309760M671276M131794L682852L127992K971232K528905K039671
1766.3H11121821K001942J917064J617968J590311J618267J492559J354814J362860
$$ plain form
1654.1 437811941 444711328 450468600 457206339 465442747 474234134 482063502 490686148 501129985
1670.4 501129985 510665596 520495176 531515539 541440547 550597489 561031580 574935496 587281227
1686.7 587281227 597374499 607894540 617460907 627647161 639429092 651295781 664597273
1701 664597273 675497472 684509277 693549871 701233029 707818270 713616490 718639135 723062754
1717.3 723062754 725932717 727394462 728927791 731668591 735254765 739147961 743047893 747443438
1733.6 747443438 751934409 755628049 759649396 764019907 768232226 772632897 777447522 782658339
1749.9 782658339 787968099 792639375 796771169 800454021 803582013 806553245 809082150 811121821
1766.3 811121821 813123763 815040827 816658795 818249106 819867373 821359932 822714746 824077606
1782.6H24077606J381934J260638J137316J075566J096308J022458J010478R97663
1798.9H33059967Q69512Q00789Q75353Q55387O51955O13153P05660O31630M96328N82993
1819.3H40142727O29723M71294M51624N80013M83692L74734N14090N39303L82602L26813
1839.7H44896615L97980L13699K67744M18246M90785L70144K31088L07917L34859J90616
1860.1H48219693J94490L66211K79128K1637J25765L25263K02954R8944K30431K12550
1880.5H50277066M6432J15872K37524O9618J729K08497J81675r298M5240J69634L9459
1902.9H51383448n6565R3043J09255p2062j0967J60098N781j50919K385N2511r4115
1925.3H51421893q6666N8651m112j75059q5771M9710j20282k79486j24038p6413k50876
$$ plain form
1782.6 824077606 825459540 826720178 827857494 828933060 830029368 831051826 832062304 833059967
1798.9 833059967 833929479 834730268 835605621 836461008 837112963 837726116 838431776 839063406 839559734 840142727
1819.3 840142727 840772450 841243744 841695368 842275381 842759073 843133807 843647897 844187200 844569802 844896615
1839.7 844896615 845294595 845608294 845876038 846294284 846785069 847155213 847386301 847694218 848029077 848219693
1860.1 848219693 848414183 848780394 849059522 849081159 849206924 849532187 849735141 849834085 850064516 850277066
1880.5 850277066 850323498 850439370 850676894 850746512 850748241 850956738 851138413 851129115 851174355 851343989 851383448
1902.9 851383448 851326883 851419926 851529181 851457119 851446152 851606250 851612031 851461112 851463497 851516008 851421893
1925.3 851421893 851335227 851393878 851389766 851214707 851128936 851178646 851058364 850778878 850654840 850578427 850327551
1947.8H50327551j73926o795j61648k90692j38938j37806l49998k79308q4221k00629
1968.2H48503590k97845j22309r1969k80262k46703r8407j92345k74956j07765o4552
1988.6H46726477k92718l26932j24037j74105l44396k32816j39832k97964l37362j48237
2009H44308078j42157l19242k95401j88887k66492l13163j91987k20477l62516k67327
2029.4H41740429r7692j91331l06367j93954j43647k57373k52604j42813j95325k73168
2049.8H39686155j76370j14262k10702k07126r5547j36196k05696j19030m8936j40488
2070.2H38231802j70350o4612m2557j11461q7976j7345n6446q7559m7803p6592j35243
2092.6H37333858p4506J7405j1623p0334j4007J9849n9128m6253N5372M7744l1114
$$ plain form
1947.8 850327551 850153625 850146830 849985182 849694490 849555552 849417746 849067748 848788440 848704219 848503590
1968.2 848503590 848205745 848083436 847991467 847711205 847464502 847366095 847173750 846898794 846791029 846726477
1988.6 846726477 846433759 846106827 845982790 845808685 845464289 845231473 845091641 844793677 844456315 844308078
2009 844308078 844165921 843846679 843551278 843362391 843095899 842782736 842590749 842370272 842007756 841740429
2029.4 841740429 841642737 841451406 841145039 840951085 840807438 840550065 840297461 840154648 839959323 839686155
2049.8 839686155 839509785 839395523 839184821 838977695 838882148 838745952 838540256 838421226 838372290 838231802
2070.2 838231802 838061452 837996840 837954283 837842822 837754846 837737501 837681055 837593496 837545693 837469101 837333858
2092.6 837333858 837259352 837276757 837265134 837194800 837180793 837200642 837141514 837095261 837150633 837198377 837167263
2115H37167263J311R8646J05858O5446R1553J13129O1274N2929J05321J08719P5221
2137.5H38046670J09971J61588J29401R0838J24454J35959Q8751J01149J72019J75595
2157.9H39336395J14918J10030J39475J05381R1076J79172K04801J20699J13488J55031
2178.2H40670466J11700Q1956J38581J33455N6386O3538J18792P3910J2934P7725J18255
2200.7H41657698M4346M9114J44065Q3625m0710K2590R4891K4915j0431N0664N8055
2223.1H42178822P331M8399Q8394k6346j11758j0372O3420n0366j13964J3411M7087
2245.6H42134058o0677p4446m2200n7459l1531K1338k8729r9003j6868R3221M3810
2268H41881514k3604M4644Q8394K3246L7372J55329J60396P8440P6294M2319j00851
$$ plain form
2115 837167263 837168574 837267220 837373078 837438524 837530077 837643206 837704480 837757409 837862730 837971449 838046670
2137.5 838046670 838156641 838318229 838447630 838538468 838662922 838798881 838887632 838988781 839160800 839336395
2157.9 839336395 839451313 839561343 839700818 839806199 839897275 840076447 840281248 840401947 840515435 840670466
2178.2 840670466 840782166 840864122 841002703 841136158 841192544 841256082 841374874 841448784 841461718 841539443 841657698
2200.7 841657698 841702044 841751158 841895223 841978848 841938138 841960728 842055619 842080534 842070103 842120767 842178822
2223.1 842178822 842186153 842234552 842322946 842296600 842184842 842174470 842237890 842187524 842073560 842086971 842134058
2245.6 842134058 842073381 841998935 841956735 841899276 841867745 841889083 841860354 841761351 841744483 841837704 841881514
2268 841881514 841857910 841902554 841990948 842014194 842051566 842206895 842367291 842445731 842522025 842564344 842463493
2290.4H42463493j25408Q881K5511q7976q5891j3411j29521k76923j91033r4473j24455
2312.9H41368794n7816n4777l55184n35428l01540n5969j08957j61171K0265R3997
2333.3H39852214p7307j49727o7294p8559J24037Q60394J101255L31402n45562q58306
2353.6H40492547q24571p19667k69591K24471M47869O86944R67383J053333J069725
2372H43128443J139700J083017R27329R27209R63748P38740L87847K79665K79487J09195
2392.4H49964380K8312J60933J42634p927N8531J86742P0393m0710O3657Q5354j9133
2414.8H50693166K4557J25647R358j37687l0041M2499q7083n5909J32859Q2195j03534
2437.3H50696027o8724K086j18851j53840p927m828j36137p5221O2227n9545j84000
$$ plain form
2290.4 842463493 842338085 842346966 842372477 842284501 842198610 842185199 842055678 841778755 841587722 841493249 841368794
2312.9 841368794 841310978 841256201 840901017 840365589 840064049 840008080 839899123 839737952 839758217 839852214
2333.3 839852214 839774907 839625180 839557886 839479327 839603364 840463758 841565013 841896415 841350853 840492547
2353.6 840492547 839667976 838948309 838678718 838903189 839351058 840038002 841005385 842058718 843128443
2372 843128443 844268143 845351160 846278489 847205698 848169446 848908186 849296033 849575698 849855185 849964380
2392.4 849964380 849992692 850153625 850296259 850288332 850346863 850533605 850603998 850563288 850626945 850712299 850693166
2414.8 850693166 850717723 850843370 850852728 850715041 850685000 850727499 850640416 850584507 850717366 850799561 850696027
2437.3 850696027 850627303 850629389 850510538 850356698 850348771 850343943 850207806 850132585 850194812 850135267 849951267
2459.7H49951267n0246j7047j66476j27077M351j03593k03669m9114J0431j67072j86980
2482.1H48894775k7001p1943k12610j26063j7763j33335j94788o7234o7055j95861
2502.5H47781122j51396l8505j21474j81913l7849k9087k25962k26974o4731r2327
2522.9H46610904j73688q5414o3300j95205j97768p6533j00076j88708j13666n0604
2543.3H45365942j72139j91569m0591o6936k15947j72794p4864j65343k57075j68681
2563.7H43840003j53422k81096k39968j23322k28942l32474k04802j46091l05712l60608
2584.1H41463566k57850k85745l85880l11971k46048l76343m39883l32653l41833m69744
2604.5H38015616m38809l58284m39227m81724l73721l81947n31971n12839l55422l72112
$$ plain form
2459.7 849951267 849901021 849883974 849717498 849590421 849594772 849491179 849287510 849238396 849248827 849081755 848894775
2482.1 848894775 848867774 848795831 848583221 848457158 848439395 848306060 848111272 848044038 847976983 847781122
2502.5 847781122 847629726 847591221 847469747 847287834 847249985 847220898 846994936 846767962 846703231 846610904
2522.9 846610904 846437216 846351802 846288502 846093297 845895529 845818996 845718920 845530212 845416546 845365942
2543.3 845365942 845193803 845002234 844961643 844894707 844678760 844505966 844431102 844265759 844008684 843840003
2563.7 843840003 843686581 843405485 843165517 843042195 842813253 842480779 842275977 842129886 841824174 841463566
2584.1 841463566 841205716 840919971 840534091 840222120 839976072 839599729 839159846 838827193 838485360 838015616
2604.5 838015616 837576807 837218523 836779296 836297572 835923851 835541904 835009933 834497094 834141672 833769560
2624.9H33769560m88818m57346m08113m88818m83394l55959l88264n00441m28736l70681
2645.3H29398990n14448n53548l80338l49283m82201m51208l53157m40478m89831l54767
2665.7H25029731l37541m83871m74632l81410m70161n25355l97742l96192n66960n81145
2686.1H20414722m50134m74811n59568m69804m19736n51939n73337m60863n36025o88970
2706.5H15229535o01351m66466n63920o66976n60999n16653o28650n90086m79698n91278
2726.9H09563458p14183o17802n51283o12080n74410n16117o05702o41466n09798m66407
2747.3H03754210o12080o95288o29067o13630o79076o51777o20245p39992p93338o81996
2767.7G97037721o56307p48396p54476p58707r00388r54628q27730p88867r08852r34899
$$ plain form
2624.9 833769560 833280742 832823396 832415283 831926465 831443071 831087112 830698848 830198407 829769671 829398990
2645.3 829398990 828884542 828330994 827950656 827601373 827119172 826667964 826314807 825874329 825384498 825029731
2665.7 825029731 824692190 824208319 823733687 823352277 822882116 822356761 821959019 821562827 820995867 820414722
2686.1 820414722 819964588 819489777 818930209 818460405 818040669 817488730 816915393 816454530 815918505 815229535
2706.5 815229535 814628184 814161718 813597798 812930822 812369823 811853170 811224520 810634434 810154736 809563458
2726.9 809563458 808849275 808231473 807680190 807068110 806493700 805977583 805371881 804730415 804220617 803754210
2747.3 803754210 803142130 802446842 801817775 801204145 800525069 799873292 799253047 798513055 797719717 797037721
2767.7 797037721 796381414 795633018 794878542 794119835 793219447 792264819 791437089 790648222 789739370 788804471
2788.1G88804471r03785j035273j136303j035034r96113j128316j165092j097083j177669
2806.4G79129803j301110j244008j201213j326561j381456j319588j380503j510978
2822.7G68464386j507580j482367j604379j747787j831591k011776k278745k562582
2839.1G53437579l002823l638446m292071m632354m339158l421962k276004j418769
2855.4G26415992j050592j037717j243710j631796k141118k554894k665639k532303
2871.7G11558223k329588k081692j821697j663327j575768j558781j686037j866519
2888F96974814j982629k050460k119839k201557k293468k369880k411366k459526k596676
2906.4F76489413k866686l240585l681004m044294m101992l772080l202379k582550
$$ plain form
2788.1 788804471 787900686 786865413 785729110 784694076 783697963 782569647 781404555 780307472 779129803
2806.4 779129803 777828693 776584685 775383472 774056911 772675455 771355867 769975364 768464386
2822.7 768464386 766956806 765474439 763870060 762122273 760290682 758278906 756000161 753437579
2839.1 753437579 750434756 746796310 742504239 737871885 733532727 730110765 727834761 726415992
2855.4 726415992 725365400 724327683 723083973 721452177 719311059 716756165 714090526 711558223
2871.7 711558223 709228635 707146943 705325246 703661919 702086151 700527370 698841333 696974814
2888 696974814 694992185 692941725 690821886 688620329 686326861 683956981 681545615 679086089 676489413
2906.4 676489413 673622727 670382142 666701138 662656844 658554852 654782772 651580393 648997843
2922.7F48997843j951098j256645o06596k07544J40429P00831J291096J776100K202808
2941F51087224K403260K169907J634657J082123N91754Q4579k84314l10659j73330
2959.4F58285201p4685k7895j1623p15N4657J86026K85685L11435M73320P25329P43747
2981.8F60950482O65307P35760P49230O28829M31776N6863l15547n41389p18534q46207
3002.2F61796570r60410j050174j064181j051367j114905j301050j522839j678765
3018.5F52052879j717746j700163j784026j913488j890004j829028j875699k004683
3034.9F37338042k128482k111017k065599k149463k303898k421797k399683k338528
3051.2F19419575k409518k504230k531468k499581k392053k291978k248406k292097
$$ plain form
2922.7 648997843 647046745 645790100 645183504 644975960 645116389 645817220 647108316 648884416 651087224
2941 651087224 653490484 655660391 657295048 658377171 658968925 659053504 658769190 658458531 658285201
2959.4 658285201 658210516 658182621 658170998 658170283 658224940 658410966 658696651 659008086 659481406 660206735 660950482
2981.8 660950482 661615789 662351549 663100779 663729608 664161384 664218247 663902700 663361311 662642777 661796570
3002.2 661796570 660836160 659785986 658721805 657670438 656555533 655254483 653731644 652052879
3018.5 652052879 650335133 648634970 646850944 644937456 643047452 641218424 639342725 637338042
3034.9 637338042 635209560 633098543 631032944 628883481 626579583 624157786 621758103 619419575
3051.2 619419575 617010057 614505827 611974359 609474778 607082725 604790747 602542341 600250244
3067.5F00250244k409935k422988k312720k213121k192616k298057k444625k499580
3083.8E81456602k470732k416611k449512k590955k660155k580047k473235k515852
3100.1E61299503k680361k738774k663613k625703k743602k841473k762914k733707
3116.4E39509356k890527l118992l269255l275275l189505l087818l078699l187657
3132.8E14411628l256142l204524l224135l430009l538549l444522l412605l408610
3149.1D87492532l350467l480107l757655l822059l684610l590673l627062l726333
3165.4D58453566l771633l742129l696203l684491l690481l718197l720969l688574
3181.7D28740889l713906l719389l643871l634006l709584l729910l694892l652960
$$ plain form
3067.5 600250244 597840309 595417321 593104601 590891480 588698864 586400807 583956182 581456602
3083.8 581456602 578985870 576569259 574119747 571528792 568868637 566288590 563815355 561299503
3100.1 561299503 558619142 555880368 553216755 550591052 547847450 545005977 542243063 539509356
3116.4 539509356 536618829 533499837 530230582 526955307 523765802 520677984 517599285 514411628
3132.8 514411628 511155486 507950962 504726827 501296818 497758269 494313747 490901142 487492532
3149.1 487492532 484142065 480661958 476904303 473082244 469397634 465806961 462179899 458453566
3165.4 458453566 454681933 450939804 447243601 443559110 439868629 436150432 432429463 428740889
3181.7 428740889 425026983 421307594 417663723 414029717 410320133 406590223 402895331 399242371
3198C99242371l609448l554911l490269l467143l477752l431618l359348l327816l283769
3216.4C68240297l230214l207475l203511l179849l119826l032297k917319k812982
3232.7C43536824k817482k890229k874583k763480k641231k544641k480746k481520
3249C22042912k459138k336860k255917k307564k368539k333731k257794k203882k164811
3267.4C01354676k139598k179473k223939k221882k235204k226740k194703k197653
3283.7B83735484k206296k181709k140194k140581k197385k252758k279579k255500
3300B66081482k159357k057344k101153k302676k449513k442568k376259k320692k276808
3318.4B45595112k221316k140432k100706k188906k277196k230555k155021k067834
$$ plain form
3198 399242371 395632923 392078012 388587743 385120600 381642848 378211230 374851882 371524066 368240297
3216.4 368240297 365010083 361802608 358599097 355419248 352299422 349267125 346349806 343536824
3232.7 343536824 340719342 337829113 334954530 332191050 329549819 327005178 324524432 322042912
3249 322042912 319583774 317246914 314990997 312683433 310314894 307981163 305723369 303519487 301354676
3267.4 301354676 299215078 297035605 294811666 292589784 290354580 288127840 285933137 283735484
3283.7 283735484 281529188 279347479 277207285 275066704 272869319 270616561 268336982 266081482
3300 266081482 263922125 261864781 259763628 257460952 255011439 252568871 250192612 247871920 245595112
3318.4 245595112 243373796 241233364 239132658 236943752 234666556 232436001 230280980 228213146
3334.7B28213146j988157k018974k065420k052456k085715k063915j858488j793266
3351B12286755j992374k087563j911656j689061j621708j590371j431913j335516j487985
3369.3A97138608j701788j667365j397461j172319j070320j068369j023412q06510
3385.7A87231064m79281k16767k86758o02260o25581j78009J07839k24292n96136l61576
3406.1A83768243N5268J70693J49891Q4236K9251J70618L84107M90308O40825Q92073
3426.5A86835513J088902J051813J054928J247138J175850Q42557Q07568J142919J463920
3444.8A96711108J602009J593277J632884J752257J919523K119199K224281K089203
3461.1B11643741K042144K451211K785549K488598J938015J917139K331823K729580
$$ plain form
3334.7 228213146 226224989 224206015 222140595 220088139 218002424 215938509 214080021 212286755
3351 212286755 210294381 208206818 206295162 204606101 202984393 201394022 199962109 198626593 197138608
3369.3 197138608 195436820 193769455 192371994 191199675 190129355 189060986 188037574 187231064
3385.7 187231064 186751783 186535016 186248258 185645998 185020417 184842408 184950247 184725955 184129819 183768243
3406.1 183768243 183823511 183994204 184144095 184228331 184257582 184428200 184812307 185302615 185943440 186835513
3426.5 186835513 187924415 188976228 190031156 191278294 192454144 193296701 194104269 195247188 196711108
3444.8 196711108 198313117 199906394 201539278 203291535 205211058 207330257 209554538 211643741
3461.1 211643741 213685885 216137096 218922645 221411243 223349258 225266397 227598220 230327800
3477.4B30327800K821714K544209K459899K753734K863661K768233K860606L065571
3493.8B52465427L230244L206074L142059L202885L120452K895684L023982L490388
3510.1B77777195L801912L710896L446847L470302L752470M089117M039108L720373
3526.4C07808220L847063M195958M346669M541814M635603M453539M578978M903913
3542.7C43311757M983693M804880M664659M816979N148679N284936N335062N569339
3559C83919984N642563N310625N264729O374866O968796O292314O046116O415814O734252
3577.4D38970059O955296P127583O971598O859243P416099P799715P287055P230401
3593.7D96617049P735461P999837Q069575Q103132P780791P393300P866860Q341372
$$ plain form
3477.4 230327800 233149514 235693723 238153622 240907356 243771017 246539250 249399856 252465427
3493.8 252465427 255695671 258901745 262043804 265246689 268367141 271262825 274286807 277777195
3510.1 277777195 281579107 285290003 288736850 292207152 295959622 300048739 304087847 307808220
3526.4 307808220 311655283 315851241 320197910 324739724 329375327 333828866 338407844 343311757
3542.7 343311757 348295450 353100330 357764989 362581968 367730647 373015583 378350645 383919984
3559 383919984 389562547 394873172 400137901 406512767 413481563 419773877 425819993 432235807 438970059
3577.4 438970059 445925355 453052938 460024536 466883779 474299878 482099593 489386648 496617049
3593.7 496617049 504352510 512352347 520421922 528525054 536305845 543699145 551566005 559907377
3610E59907377Q203685Q192956P848323P939279Q765697Q248449P105887O622672P804632
3628.4F30638957R045124P716656O989777O965935O826759O812930O513595N799473
3644.7F87309206N497336O555140P141054N545795M642009N329609N404175M558146
3661G31982470M050314L775060L367722L387571L743112L042817K756119L262102K980948
3679.4G62348235K647102K594471K469062K354861K358138K249777K040327J836538
3695.7G80898511J577318J351357J431882J618326J460433J085162Q57174J151502
3712G91431665J528919J307666R24469P38263O79612O59823P95484R81331R09030P72357
3732.4H00728619O98805Q22484R67801N88298k2948J39296Q32856M69327P3075O25312
$$ plain form
3610 559907377 568111062 576304018 584152341 592091620 600857317 609105766 616211653 622834325 630638957
3628.4 630638957 639684081 647400737 654390514 661356449 668183208 674996138 681509733 687309206
3644.7 687309206 692806542 699361682 706502736 712048531 716690540 722020149 727424324 731982470
3661 731982470 736032784 739807844 743175566 746563137 750306249 753349066 756105185 759367287 762348235
3679.4 762348235 764995337 767589808 770058870 772413731 774771869 777021646 779061973 780898511
3695.7 780898511 782475829 783827186 785259068 786877394 788337827 789422989 790280163 791431665
3712 791431665 792960584 794268250 795192719 795930982 796610594 797270417 798065901 799047232 799956262 800728619
3732.4 800728619 801427424 802249908 803217709 803806007 803783059 803922355 804755211 805224538 805297613 805922925
3752.8H05922925R58622O51896M05252N46396N75900L83794K24054K23279M05371N19574
3773.2H10817063M61578L75629L31938K84016J51575J36733L10659M02987L18051J46508
3793.6H13736737R9778J54138l696P2479L70860J49131J29938M34637L80338P4744
3814H15599084K5988J72793p9929k9207K96295K68877K15470J53184J50919K06650
3834.4H16980124k9088k77459p8142J82033L67820M11034J66475l68356r14634k19941
3854.8H16219866O92249N60999K00152o1750n7459p7844k40207m2855J82867K94089
3875.2H17670107K70843k9385k8252J06036J4723K4557j6213j3470J56104J01507j44243
3897.6H18112314k97606k50578j0908L03090L35455J20103k3246q0049j21772l8207
$$ plain form
3752.8 805922925 806881547 807533443 807938695 808485091 809060991 809444785 809668839 809892118 810297489 810817063
3773.2 810817063 811278641 811654270 811986208 812270224 812421799 812558532 812869191 813272178 813590229 813736737
3793.6 813736737 813836515 813990653 813986957 814059436 814430296 814579427 814709365 815144002 815524340 815599084
3814 815599084 815625072 815797865 815717936 815688729 815985024 816253901 816469371 816622555 816773474 816980124
3834.4 816980124 816951036 816673577 816595435 816777468 817145288 817556322 817722797 817354441 816439807 816219866
3854.8 816219866 816912115 817473114 817673266 817611516 817554057 817476213 817236006 817193151 817376018 817670107
3875.2 817670107 817940950 817911565 817883313 817989349 818004072 818028629 818012416 817998946 818155050 818256557 818112314
3897.6 818112314 817814708 817564130 817553222 817856312 818191767 818311870 818288624 818208575 818086803 818048596
3918H18048596J13488L5166j11937q345L1412q0288N0903K19404J00673j7643k3842
3940.4H18357587p570L7015K8848K7776R1791J05560O4969J8060J8418Q1718J31547
3962.9H18955719J25170J10567R3400O1930M2438M2021P8619O5088M4048J71184K12193
3985.3H20002377L7074o0022L4392J40906J34825O8963
3997.5H20358515
$$ plain form
3918 818048596 818162084 818197250 818085313 818076968 818108380 818028092 818078995 818298399 818399072 818381429 818357587
3940.4 818357587 818350017 818387032 818415880 818443656 818535447 818641007 818705976 818724036 818742454 818824172 818955719
3962.9 818955719 819080889 819191456 819284856 819346786 819389224 819431245 819509864 819574952 819619000 819790184 820002377
3985.3 820002377 820039451 819979429 820013821 820154727 820289552 820358515
3997.5 820358515
##END=$$ End of the data block
