##TITLE=$$ Begin of the data block
##JCAMP-DX=5.00 $$ ACD/SpecManager v 10.08
##SPECTROMETER/DATA SYSTEM=Alpha
##DATE=10 Apr 2014 09:27:12
##DATA TYPE=INFRARED SPECTRUM
##DATA CLASS=XYDATA
##ORIGIN=
##OWNER=
##NPOINTS=1765
##FIRSTX=399.75695801
##LASTX=3997.56933594
##MAXX=3997.56933594
##MINX=399.75695801
##MAXY=0.85177690
##MINY=0.18389918
##XFACTOR=1.0000000000
##YFACTOR=1.000000000000000e-9
##FIRSTY=0.57696104
##DELTAX=2.03957629
##XUNITS=1/CM
##YUNITS=ARBITRARY UNITS
##XYDATA=(X++(Y..Y))
399.8E76961040j268386n50866j971841j643420j07467j103937k148271p49350n19931
$$ 576961040 575692654 575141788 573169947 571526527 571419060 570315123 568166852 567417502 566897571
418.1E66897571k481759j414120L04938n93663j371085j45257j1623j405835j066506
$$ 566897571 564415812 563001692 563306630 562712967 561341882 561196625 561185002 559779167 558712661
436.5E58712661j27852q73506r59158K66671k39431j283229l44455J67072r06587j055300
$$ 558712661 558584809 557711303 556752145 557018816 556779385 555496156 555151701 555318773 554412186 553356886
456.9E53356886m05669r02415j368940o42299l82662j198292j195311o84262j391649
$$ 553356886 552951217 552048802 550679862 550037563 549654901 548456609 547261298 546577036 545185387
475.2E45185387j709998m61220j4544j044631j042127k03789p30395j517594q89599
$$ 545185387 543475389 543014169 542999625 541954994 540912867 540709078 539978683 538461089 537571490
493.6E37571490o16610j406968j202524n89728j313329j579284n75960o55830j611352
$$ 537571490 536954880 535547912 534345388 533755660 532442331 530863047 530287087 529631257 528019905
511.9E28019905j164436m42863j375973k065778j287520j182496j975835j727819j147628
$$ 528019905 526855469 526412606 525036633 522970855 521683335 520500839 518525004 516797185 515649557
530.3E15649557j740456j988768j002848q62956j606047j125753m41134j160980j590728
$$ 515649557 513909101 511920333 510917485 510054529 508448482 507322729 506881595 505720615 504129887
548.6E04129887q63791r04143j750827j579046j070171j586080j980603j543253j831145
$$ 504129887 503266096 502361953 500611126 499032080 497961909 496375829 494395226 492851973 491020828
567D91020828k827882k662301k039731k509206k843857k160222k105265k788276k665847
$$ 491020828 488192946 485530645 483490914 480981708 478137851 475977629 473872364 471084088 468418241
585.4D68418241k292484k815813l112972k347201j938403k423793k586544k431511
$$ 468418241 466125757 463309944 460196972 457849771 455911368 453487575 450901031 448469520
601.7D48469520k779603k473236j047521l56287p84040o39021M09275J547724K872438
$$ 448469520 445689917 443216681 442169160 441812873 441028833 440389812 440799087 442346811 445219249
620D45219249M244923M548848L843337L849089M417986M079580L428012L491789L109277
$$ 445219249 449464172 454013020 457856357 461705446 466123432 470203012 473631024 477122813 480232090
638.4D80232090J720398Q82745J334697K237827K851784K678186R56058r03398P70390
$$ 480232090 481952488 482835233 484169930 486407757 489259541 491937727 492893785 491990387 492760777
656.7D92760777N176336O932288N442918L868282L431320L636777L540397L774226
$$ 492760777 497937113 504869401 510312319 514180601 517611921 521248698 524789095 528563321
673.1E28563321L552913K771974K974570L234327K397179K051175K662003K389908
$$ 528563321 532116234 534888208 537862778 541097105 543494284 545545459 548207462 550597370
689.4E50597370J423835J484693J761555J030684Q28623J744450J976609J576125K144874
$$ 550597370 552021205 553505898 555267453 556298137 557126760 558871210 560847819 562423944 564568818
707.7E64568818K807676K290070K053857K831340K829611K036393K393961L059447
$$ 564568818 567376494 569666564 571720421 574551761 577381372 579417765 581811726 584871173
724E84871173K478540J991749K556204K555788J722276J819670K371312J857578J436949
$$ 584871173 587349713 589341462 591897666 594453454 596175730 597995400 600366712 602224290 603661239
742.4F03661239K233505K539933J849771K021908K783835K348543J784265K524078
$$ 603661239 605894744 608434677 610284448 612306356 615090191 617438734 619222999 621747077
758.7F21747077K842128J962364J830160K396584J766026Q47161J110792J039862k19226
$$ 621747077 624589205 626551569 628381729 630778313 632544339 633391500 634502292 635542154 635322928
777.1F35322928q17358n00679j023948j668573p07268O08503R45867J917481M016161
$$ 635322928 634505570 634004891 632980943 631312370 630605102 631213605 632159472 634076953 638093114
795.4F38093114N157351N289317O123244O811738N916238M998446N053520M279315
$$ 638093114 643250465 648539782 654663026 661474764 667391002 672389448 677442968 681722283
811.7F81722283K658487K197385K040565M53114j044512j363933k326965l984273m316091
$$ 681722283 684380770 686578155 688618720 689071834 688027322 686663389 684336424 680352151 676036060
830.1F76036060l934086m465997m786312l920496l561914m237115m064143k718806
$$ 676036060 672101974 667635977 662849665 658929169 655367255 651130140 647065997 644347191
846.4F44347191j518130J48773L226757O029606P474005Q982301J0555863J0489404
$$ 644347191 642829061 642977834 646204591 652234197 659708202 668690503 679246366 689735770
862.7F89735770R473503R192526Q543134O431162M801274M400432L215492J581013
$$ 689735770 699209273 708401799 716944933 723376095 728177369 732577801 735793293 737374306
879.1G37374306J235902R22263n83172j559973j297951j536250k110243j146257M72546
$$ 737374306 738610208 739532471 738949299 737389326 736091375 734555125 732444882 731298625 731771171
897.4G31771171R45687J343012K424240K460838J347244R49501P06196r40978k596379
$$ 731771171 732716858 734059870 736484110 738944948 740292192 741241693 741947889 741006911 738410532
915.8G38410532k949655l464639m356265l724933j933455r00984j07467J346290J889706
$$ 738410532 735460877 731996238 727639973 723915040 721981585 721080601 720973134 722319424 724209130
934.1G24209130R95040P00652J164735N70655m64082m79818p69376k238691l251374
$$ 724209130 725204170 725904822 727069557 727640212 727176130 726696312 725926936 723688245 720436871
952.5G20436871l600240m903912o712377p725776q976399j1347533j3429939j4622808
$$ 720436871 716836631 711932719 705220342 697494566 688518167 677170634 663740695 649117887
968.8F49117887j5890539j6611218j5437186j3267398j1439085r495258p327438o184160
$$ 649117887 633227348 616616130 601178944 587911546 576472461 566977203 559649765 553465605
985.1E53465605n986929n322457m290223l858566l500223k558589j851380j791894
$$ 553465605 547478676 542156219 537865996 534007430 530507207 527948618 526097238 524305344
1001.4E24305344j733125j856267k926648m401624n293965n951047o756157p003635
$$ 524305344 522572219 520715952 517789304 513387680 508093715 502142668 495386511 488382876
1017.7D88382876o693959o710917o891459o579191o187647o144613n818606m974127
$$ 488382876 481688917 474978000 468086541 461507350 455319703 449175090 443356484 438382357
1034.1D38382357m293829l922134l429026l041983l147780l349096l307372l296435
$$ 438382357 434088528 430166394 426737368 423695385 420547605 417198509 413891137 410594702
1050.4D10594702l159762k181679n22256Q71152J651228J896739J219630l31998j857787
$$ 410594702 407434940 405253261 404731005 405602157 407253385 409150124 410369754 410037756 408179969
1068.7D08179969k976001l944009m599124m682214m681855m970759n245328n494505
$$ 408179969 405203968 401259959 396660835 391978621 387296766 382326007 377080679 371586174
1085C71586174o077588o622940o339818n139351l444910j493067M10676J571775J861095
$$ 371586174 365508586 358885646 352545828 347406477 343961567 342468500 342879176 344450951 346312046
1103.4C46312046J826376J638889J046002J90198o98089j978189l989845o224812p196128
$$ 346312046 348138422 349777311 350823313 351013511 350315422 348337233 344347388 338122576 330926448
1121.8C30926448n454570j857549Q98689J771808J174718J99646O57439K503037M137874
$$ 330926448 325471878 323614329 324513018 326284826 327459544 327659190 328316629 330819666 334957540
1140.1C34957540M864275M747093M020870L279209K898783K692222K611786K927184
$$ 334957540 339821815 344568908 348589778 351868987 354767770 357459992 360071778 362998962
1156.4C62998962L594131M355192N412131O935299Q420586R388954R941220J0113746
$$ 362998962 366593093 370948285 376360416 383295715 391716301 401105255 411046475 421160221
1172.7D21160221R766013R187340Q739591Q129448P044464N760670M332691K446234
$$ 421160221 430926234 440113574 448853165 456982613 464027077 469787747 474120438 476566672
1189.1D76566672M19081r30012j393228j182080j31756J665473L284931M090995M284352
$$ 476566672 476985753 476055741 474662513 473480433 473348677 475014150 478299081 482390076 486674428
1207.4D86674428L929466K957672J937121J436323J199037R60350R88632J284421J492738
$$ 486674428 490603894 493561566 495498687 496935010 498134047 499094397 500083029 501367450 502860188
1225.8E02860188J706064K204955K695143K869964L012716L227294L129125K750754
$$ 502860188 504566252 506771207 509466350 512336314 515349030 518576324 521705449 524456203
1242.1E24456203K457499K096773J445770Q52823N86331L76880K24531N73754J417756
$$ 524456203 526913702 529010475 530456245 531309068 531895399 532272279 532496810 533070564 534488320
1260.4E34488320K381623L432393M524291N226671N533517N863368O200076O263136
$$ 534488320 536869943 540302336 544826627 550053298 555586815 561450183 567650259 573913395
1276.8E73913395O245077O532013O892324O919563O850123O886542O694138O295800
$$ 573913395 580158472 586690485 593582809 600502372 607352495 614239037 620933175 627228975
1293.1F27228975O062448N813063N152285M391610L920734L409386K763152K444088
$$ 627228975 633291423 639104486 644256771 648648381 652569115 655978501 658741653 661185741
1309.4F61185741K356828K041638J708686J762390J881480J769007J786470J945436
$$ 661185741 663542569 665584207 667292893 669055283 670936763 672705770 674492240 676437676
1325.7F76437676J748741J269996R45449N86748K1994k82765j07824M7564Q0764L71874
$$ 676437676 678186417 679456413 680401862 680988610 681010604 680727839 680620015 680667579 680748343 681120217
1346.1F81120217O68108N53489L50177K98500N1856l12089n17965q53479j352608j606941
$$ 681120217 681788325 682341814 682691991 682990491 683042347 682730258 682212293 681358814 680006206 678399265
1366.5F78399265j592994j459420j672089k129018k302706k759099l661573l860355
$$ 678399265 676806271 675346851 673674762 671545744 669243038 666483939 662822366 658962011
1382.8F58962011k748727j456678r87709r93431j411080k071440k303541k671122l033340
$$ 658962011 656213284 654756606 653768897 652775466 651364386 649292946 646989405 644318283 641284943
1401.2F41284943l127695l340482l210902k931059k636731k124905j721799j741171
$$ 641284943 638157248 634816766 631605864 628674805 626038074 623913169 622191370 620450199
1417.5F20450199j677990j028896o58929m16577j20997j53661J9431N21302Q30651
$$ 620450199 618772209 617743313 617084384 616667807 616546810 616393149 616412580 616933882 617764533
1435.9F17764533J191198J602173J937151K043188K171397K792418L491521L786445
$$ 617764533 618955731 620557904 622495055 624538243 626709640 629502058 632993579 636780024
1452.2F36780024M248797O343961Q829534P358611O340802P219374P535994O665468
$$ 636780024 641028821 647372782 656202316 663560927 669901729 677121103 684657097 691322565
1468.5F91322565O909788Q552551Q220136O209135M824341L638088K672017J877487
$$ 691322565 698232353 706784904 715005040 721214175 726038516 729676604 732348621 734226108
1484.8G34226108J008451k06709r97842j029014j745582l201485l556490l008008k810061
$$ 734226108 735234559 735027850 734030008 733000994 731255412 728053927 724497437 721489429 718679368
1503.2G18679368m104495p275283o235003m401088m260063m227460l946542l196180
$$ 718679368 714574873 707299590 701064587 696663499 692403436 688175976 684229434 681033254
1519.5F81033254l135920k974152k606392k579868k033472k078295k572596j694560
$$ 681033254 677897334 674923182 672316790 669736922 667703450 665625155 663052559 661357999
1535.8F61357999j104117k152979k259672j008391n32687k27093Q5294L84867M78625
$$ 661357999 660253882 658100903 655841231 654832840 654300153 654073060 654158354 654543221 655021846
1554.1F55021846M05252m33206j239538p10726j140833k009034l454924m887879m357099
$$ 655021846 655427098 654993892 653754354 653043628 651902795 649893761 646438837 641550958 637193859
1572.5F37193859n094231q174419q007407p002592q047462q816719r020924r275437
$$ 637193859 632099628 623925209 615917802 608915210 600867748 592051029 583030105 573754668
1588.8E73754668r554863r543419r516894r336651q989334q816004q751034q592308
$$ 573754668 564199805 554656386 545139492 535802841 526813507 517997503 509246469 500654161
1605.1E00654161q509964q639961q342117p631183q261710r572000p260114n808353
$$ 500654161 492144197 483504236 475162119 467530936 459269226 449697226 442437112 436628759
1621.4D36628759o619185o130010n149633m373431l029734k358556k267390o61522
$$ 436628759 430009574 423879564 418729931 414356500 411326766 408968210 406700820 406039298
1637.8D06039298Q97049J710654K390027L726929N149752M390717N076378Q372069
$$ 406039298 406936347 408647001 411037028 414763957 419913709 424304426 429380804 437752873
1654.1D37752873O985366N861163O786347Q223414Q809567P879853Q638412J0451316
$$ 437752873 444738239 450599402 457385749 465609163 474418730 482298583 490936995 501388311
1670.4E01388311R572029R864629J1036753R923161R144365J0393262J3841391J2360692
$$ 501388311 510960340 520824969 531861722 541784883 550929248 561322510 575163901 587524593
1686.7E87524593J0127663J0500074R503245J0103584J1706590J1815310J3329983
$$ 587524593 597652256 608152330 617655575 627759159 639465749 651281059 664611042
1701F64611042J0967671R028316R057105P724046O593645N756497M964352M415095
$$ 664611042 675578713 684607029 693664134 701388180 707981825 713738322 718702674 723117769
1717.3G23117769K947688J546025J585066K752364L550410L837705L838539M321754
$$ 723117769 726065457 727611482 729196548 731948912 735499322 739337027 743175566 747497320
1733.6G47497320M491985L723025L990949M350602M242420M418612M804492N214870
$$ 747497320 751989305 755712330 759703279 764053881 768296301 772714913 777519405 782734275
1749.9G82734275N342424M693210M132986L682554L127753K985478K577007K067148
$$ 782734275 788076699 792769909 796902895 800585449 803713202 806698680 809275687 811342835
1766.3H11342835J950026J817167J607537J695871J689315J491130J333952J361012
$$ 811342835 813292861 815110028 816717565 818413436 820102751 821593881 822927833 824288845
1782.6H24288845J371324J234293J145184J086474J050233R98140J042902J026571
$$ 824288845 825660169 826894462 828039646 829126120 830176353 831174493 832217395 833243966
1798.9H33243966Q71480Q02040Q89718Q53539O17683N94258P17223O48260N30362O05643
$$ 833243966 834115446 834917486 835807204 836660743 837278426 837872684 838589907 839238167 839768529 840374172
1819.3H40374172O08206M58836M75884N66184M09246L35812N33462N66721M07397L49760
$$ 840374172 840982378 841441214 841917098 842483282 842892528 843228340 843761802 844328523 844735920 845085680
1839.7H45085680M02034K81989K32935M14789M95791L71933K42830L14832L17990J82748
$$ 845085680 845487714 845769703 846002638 846417427 846913218 847285151 847527981 847842813 848160803 848343551
1860.1H48343551K27094L98457K56181p272J60694L40819J70947J06871K70843K14160
$$ 848343551 848570645 848969102 849225283 849218011 849378705 849719524 849890471 849997342 850268185 850482345
1880.5H50482345L2961J27554K31564J6332k8789K34186K01404o318O0618J77980L8027
$$ 850482345 850515306 850642860 850874424 850890756 850861967 851096153 851297557 851291239 851351857 851529837 851567864
1902.9H51567864m0233J17660J15394q4340k9981J30534m1783j77383K8431P5936j02520
$$ 851567864 851527631 851645291 851760685 851676345 851646364 851776898 851735115 851557732 851586163 851662099 851559579
1925.3H51559579o3359J02341k2590k00034o5445M8577j37925k74777j23561q8930
$$ 851559579 851496220 851598561 851575971 851375937 851310492 851359069 851221144 850946367 850822806 850733876
1945.7H50733876k41041j56760k0325j90020k87950j11222j31548l38256k59578j13786
$$ 850733876 850492835 850336075 850315750 850125730 849837780 849726558 849595010 849256754 848997176 848883390
1966.1H48883390k46167k99573j00553q1360k84314k32041o3777j93000l05891j20878
$$ 848883390 848637223 848337650 848237097 848155737 847871423 847639382 847575605 847382605 847076714 846955836
1986.5H46955836p5758l29137l54409j14619j56761l35514k19047j31190k98858l15010
$$ 846955836 846880078 846550941 846196532 846081913 845925152 845589638 845370591 845239401 844940543 844625533
2006.9H44625533j31667j62125l22520k88070k22921l04341l16322j84953k07305l22819
$$ 844625533 844493866 844331741 844009221 843721151 843498230 843193889 842877567 842692614 842485309 842162490
2027.3H42162490k33412j29461k39790k70366j11461j29223l16739l05355j43706j62959
$$ 842162490 841929078 841799617 841559827 841289461 841178000 841048777 840732038 840426683 840282977 840120018
2047.7H40120018k55645j75297r9719j88350k10762j29402j68443k23756j26779m8697
$$ 840120018 839864373 839689076 839589357 839401007 839190245 839060843 838892400 838668644 838541865 838493168
2068.1H38493168j19328j28925m5598p3373j49965q6069l398n7101r7692n7101p4923
$$ 838493168 838373840 838244915 838199317 838125944 837975979 837889910 837886512 837829411 837731719 837674618 837599695
2090.5H37599695j28150o7830P748l1888o6161M232L0815m6611m8875L1352L0040k4914
$$ 837599695 837471545 837403715 837411463 837379575 837313414 837317646 837348461 837301850 837252975 837284327 837314367 837289453
2115H37289453K3126J03831R1315N3882Q3804J09613P6116Q3744J18673Q3983O0201
$$ 837289453 837312579 837416410 837507725 837561607 837645411 837755024 837831140 837914884 838033557 838117540 838177741
2137.5H38177741J20699J40607Q4877J00971J94072J68920N8532P9453J73270J67728
$$ 838177741 838298440 838439047 838523924 838624895 838818967 838987887 839046419 839125872 839299142 839466870
2157.9H39466870J03712J13368J40607R0123Q0823J98782K47896J59919J36256J63853
$$ 839466870 839570582 839683950 839824557 839914680 839995503 840194285 840442181 840602100 840738356 840902209
2178.2H40902209R1374L5644J24275J61231P7367O1333J12534Q5413K6882O2227Q7559
$$ 840902209 840993583 841029227 841153502 841314733 841392100 841453433 841565967 841651380 841678262 841740489 841828048
2200.7H41828048L1650N0485J38104Q8990j2040L7551Q6605J4127q94P2598M7207m0829
$$ 841828048 841859698 841910183 842048287 842137277 842125237 842162788 842249393 842263520 842262626 842335224 842382431 842341602
2225.2H42341602j609O8306J193p0215j847L9398o6817q1658M9830L0756q5116o5207
$$ 842341602 842339993 842408299 842409492 842339277 842337430 842376828 842310011 842228353 842278183 842308939 842223823 842158616
2249.6H42158616j1385m1604m8578Q762j0252q8274m4167N6207K9445q643P9930J36137
$$ 842158616 842147231 842105627 842057049 842065811 842055559 841967285 841923118 841979325 842008770 842000127 842080057 842216194
2274.1H42216194N7101N1737J72257J52290N6088Q0585L2723j36733j24573K4736j0133
$$ 842216194 842273295 842325032 842497289 842649579 842705667 842786252 842818975 842682242 842557669 842582405 842572272
2296.5H42572272j18733o2704J3769r3281k20776j88947j40428j34647o8784j04546
$$ 842572272 842453539 842390835 842404604 842311323 842090547 841901600 841761172 841626525 841557741 841453195
2316.9H41453195l63589m69207k47360q6605j62602j87278k5451N007j33634j15215
$$ 841453195 841089606 840620399 840373039 840286434 840123832 839936554 839911103 839916110 839782476 839667261
2337.3H39667261n4956r3758J67072Q97944J121223L64840n18978q73208q53538o84858
$$ 839667261 839612305 839518547 839685619 840583563 841704786 842069626 841550648 840677440 839823902 839139044
2357.7H39139044k39789J00016L07739P34806J084686J101613J076459J158953J123607
$$ 839139044 838899255 838999271 839307010 840041816 841126502 842228115 843304574 844463527 845587134
2376.1H45587134R57966R21726R29714P07984M05788L22700K74837Q5830M2141J79887
$$ 845587134 846545100 847466826 848396540 849104524 849510312 849833012 850107849 850193679 850235820 850415707
2396.5H50415707J45673N603P6652J87099O2585o2704L3974P2301l2485J8537J42574
$$ 850415707 850561380 850566983 850643635 850830734 850893319 850830615 850864589 850936890 850904405 850922942 851065516
2418.9H51065516J3113j49965k0206O9499q1420p2717J13487O7234r4473o0916k3008
$$ 851065516 851078629 850928664 850908458 850977957 850896537 850823820 850937307 851004541 850910068 850849152 850826144
2441.3H50826144j22010j10925J9849l9101j75059n8174P6711p3850j87099n6326m2677
$$ 850826144 850704134 850593209 850613058 850573957 850398898 850340724 850417435 850343585 850156486 850100160 850057483
2463.8H50057483j69158q7858M0293r3698k10822p6115l8743j95026j61469j1206j09971
$$ 850057483 849888325 849800467 849840760 849747062 849536240 849460125 849421382 849226356 849064887 849053681 848943710
2486.2H48943710k34961p8499J1920j63972j98364n5671j04189k12610r7036m947j42038
$$ 848943710 848708749 848630250 848642170 848478198 848279834 848224163 848119974 847907364 847810328 847805381 847663343
2508.7H47663343j99676n6386n5909k26021j85787j9074r0837k02596j10209r7573
$$ 847663343 847463667 847407281 847351372 847125351 846939564 846920490 846829653 846627057 846516848 846419275
2529H46419275k17378j47224j6689j06692j99557j07169o5029j91688k00808m0889
$$ 846419275 846201897 846054673 846037984 845931292 845731735 845624566 845559537 845367849 845167041 845126152
2549.4H45126152p5698k41160j78993p8857j92940k50340j22547j33991k76566k15709
$$ 845126152 845050454 844809294 844630301 844551444 844358504 844108164 843985617 843851626 843575060 843359351
2569.8H43359351r7692k13146l45528k55466j88708l02136l33369k41220k80022l81947
$$ 843359351 843261659 843048513 842702985 842447519 842258811 841956675 841623306 841382086 841102064 840720117
2590.2H40720117l14951k53856l74556m24504l23117l63707n13017m63844l60846m40240
$$ 840720117 840405166 840151310 839776754 839352250 839029133 838665426 838152409 837688565 837327719 836887479
2610.6H36887479m84407l82424l83853n01156m78089l71814m38869n39899m58836l98100
$$ 836887479 836403072 836020648 835636795 835135639 834657550 834285736 833846867 833306968 832848132 832450032
2631H32450032m96804m90606l42548l74496n01633m16398l28123m66526n28753l97265
$$ 832450032 831953228 831462622 831120074 830745578 830243945 829827547 829499424 829032898 828504145 828106880
2651.4H28106880l84986m90904m49181l53157m37617m91918l58641l58701m96804m59254
$$ 828106880 827721894 827230990 826781809 826428652 825991035 825499117 825140476 824781775 824284971 823825717
2671.8H23825717l70502m49241m97758l97861m16339n83231n82099m46677m66705n52833
$$ 823825717 823455215 823005974 822508216 822110355 821694016 821110785 820528686 820082009 819615304 819062471
2692.2H19062471m87744m44711n48482n46991m52400n49733o67751n58555m79698o05822
$$ 819062471 818574727 818130016 817581534 817034543 816582143 816032410 815364659 814806104 814326406 813720584
2712.6H13720584o64175n51283n47349o37353n75602n01513o15895p04229n84364n27501
$$ 813720584 813056409 812505126 811957777 811320424 810744822 810243309 809627414 808923185 808338821 807811320
2733H07811320o15657n66065m60386n43118o28650n32448n06044o51776o77109n81205
$$ 807811320 807195663 806629598 806169212 805626094 804997444 804464996 803958952 803307176 802630067 802048862
2753.4H02048862o23465p30335p02322o48618p28786p69615o69360o60717p56443p45594
$$ 802048862 801425397 800695062 799992740 799344122 798615336 797845721 797176361 796515644 795759201 795013607
2773.8G95013607p49171r02236r57191q36193q00252q87335r08136r23634j054525
$$ 795013607 794264436 793362200 792405009 791568816 790768564 789881229 788973093 788049459 786994934
2792.2G86994934j110434r88782r59694j121164j189112j135350j190245j293003j271546
$$ 786994934 785884500 784895718 783936024 782814860 781625748 780490398 779300153 778007150 776735604
2810.5G76735604j229882j297772j328647j302064j399994j503527j479507j525163
$$ 776735604 775505722 774207950 772879303 771577239 770177245 768673718 767194211 765669048
2826.8G65669048j668990j726389j772046j997053k303958k588094l016710l638625
$$ 765669048 764000058 762273669 760501623 758504570 756200612 753612518 750595808 746957183
2843.1G46957183m262984m593253m345000l472090k290308j366615j012803j052320
$$ 746957183 742694199 738100946 733755946 730283856 727993548 726626933 725614130 724561810
2859.5G24561810j269161j648545k119482k492309k639591k582848k385080k078176
$$ 724561810 723292649 721644104 719524622 717032313 714392722 711809874 709424794 707346618
2875.8G07346618j778960j630485j578152j566053j702368j899183j983881k040922
$$ 707346618 705567658 703937173 702359021 700792968 699090600 697191417 695207536 693166614
2892.1F93166614k129078k205313k267062k323032k392888k466976k582252k851963
$$ 693166614 691037536 688832223 686565161 684242129 681849241 679382265 676800013 673948050
2908.4F73948050l268958l707885m049957m122555l777862l171980k563894j961589
$$ 673948050 670679092 666971207 662921250 658798695 655020833 651848853 649284959 647323370
2924.7F47323370j261115n92291j91510J64628P52508J337111J764894K159238K370059
$$ 647323370 646062255 645469964 645278454 645443082 646195590 647532701 649297595 651456833 653826892
2943.1F53826892K157212J657962J105488N64277L6716k94923k88070j55448m8399
$$ 653826892 655984104 657642066 658747554 659311831 659348547 659053624 658765554 658610106 658561707
2961.4F58561707n782l4869j5378Q7083K19404K94328L18468N03659P37369P24494
$$ 658561707 658555925 658521056 658505678 658592761 658812165 659106493 659424961 659928620 660665989 661390483
2981.8F61390483O52790P00236P20203O86466N06223O4313l47614n67377p17163q34942
$$ 661390483 662043273 662743509 663463712 664150178 664656401 664720714 664373100 663805723 663088560 662253618
3002.2F62253618r68218j077115j073480j015186j061440j272320j516819j674593
$$ 662253618 661285400 660208285 659134805 658119619 657058179 655785859 654269040 652594447
3018.5F52594447j749694j755893j780332j849949j827896j793801j851261j998425
$$ 652594447 650844753 649088860 647308528 645458579 643630683 641836882 639985621 637987196
3034.9F37987196k161145k161801k083897k115667k265811k395749k388299k380490
$$ 637987196 635826051 633664250 631580353 629464686 627198875 624803126 622414827 620034337
3051.2F20034337k455294k466619k427280k434909k426148k358198k282798k288163
$$ 620034337 617579043 615112424 612685144 610250235 607824087 605465889 603183091 600894928
3067.5F00894928k394617k445519k339840k189517k162456k305210k445638k474666
$$ 600894928 598500311 596054792 593714952 591525435 589362979 587057769 584612131 582137465
3083.8E82137465k480864k458453k441466k553105k652109k600074k508819k535641
$$ 582137465 579656601 577198148 574756682 572203577 569551468 566951394 564442575 561906934
3100.1E61906934k692700k739429k620399k587140k740502k864182k776504k697587
$$ 561906934 559214234 556474805 553854406 551267266 548526764 545662582 542886078 540188491
3116.4E40188491k857089l142476l315925l278375l137946l042340l096402l270686
$$ 540188491 537331402 534188926 530873001 527594626 524456680 521414340 518317938 515047252
3132.8E15047252l297090l132880l141284l409147l570795l522277l476590l413975
$$ 515047252 511750162 508617282 505475998 502066851 498496056 494973779 491497189 488083214
3149.1D88083214l349513l495962l754615l787131l647744l602416l643035l685534
$$ 488083214 484733701 481237739 477483124 473695993 470048249 466445833 462802798 459117264
3165.4D59117264l732086l780216l778010l702760l657579l718317l756165l709496
$$ 459117264 455385178 451604962 447826952 444124192 440466613 436748296 432992131 429282635
3181.7D29282635l696620l715128l662765l612995l677100l739476l707647l653437
$$ 429282635 425586015 421870887 418208122 414595127 410918027 407178551 403470904 399817467
3198C99817467l631890l589749l503025l450155l458858l453880l410131l342658l251821
$$ 399817467 396185577 392595828 389092803 385642648 382183790 378729910 375319779 371977121 368725300
3216.4C68725300l214300l231257l194511l139257l137440l077745k906740k782911
$$ 368725300 365511000 362279743 359085232 355945975 352808535 349730790 346824050 344041139
3232.7C44041139k849341k946943k875804k730787k631873k570123k494454k440333
$$ 344041139 341191798 338244855 335369051 332638264 330006391 327436268 324941814 322501481
3249C22501481k413452k367765k319485k321541k364487k342551k268523k215237k175152
$$ 322501481 320088029 317720264 315400779 313079238 310714751 308372200 306103677 303888440 301713288
3267.4C01713288k130211k144783k236814k284497k247661k203077k195835k223343
$$ 301713288 299583077 297438294 295201480 292916983 290669322 288466245 286270410 284047067
3283.7B84047067k237022k179056k113640k128840k197266k267658k300442k264976
$$ 284047067 281810045 279630989 277517349 275388509 273191243 270923585 268623143 266358167
3300B66358167k183259k107262k125085k264648k426505k478928k381831k271205k248526
$$ 266358167 264174908 262067646 259942561 257677913 255251408 252772480 250390649 248119444 245870918
3318.4B45870918k236381k164930k106861k196103k323419k283767k153456k024710
$$ 245870918 243634537 241469607 239362746 237166643 234843224 232559457 230406001 228381291
3334.7B28381291j927987j961410k086326k144024k130300k021670j815856j814320
$$ 228381291 226453304 224491894 222405568 220261544 218131244 216109574 214293718 212479398
3351B12479398k020210k076731j903802j692474j624196j622379j476914j333520j431122
$$ 212479398 210459188 208382457 206478655 204786181 203161985 201539606 200062692 198729172 197298050
3369.3A97298050j642868j638472j424328j273557j153901j048357r39145p37310m83915
$$ 197298050 195655182 194016710 192592382 191318825 190164924 189116567 188177422 187440112 186956197
3387.7A86956197k84135l38748n94169n98371j79008J27211j69098n99981m20719L5361
$$ 186956197 186672062 186333314 185739145 185140774 184961766 185088977 184919879 184319898 183899179 183934540
3408.1A83934540K01419J67831P6920N7295K35573M08634M56363O24016R05842J073703
$$ 183934540 184135959 184303790 184380710 184438005 184673578 185082212 185538575 186162591 187068433 188142136
3428.5A88142136J018211J050249J248628J150578Q13320Q09476J176178J461626J557424
$$ 188142136 189160347 190210596 191459224 192609802 193423122 194232598 195408776 196870402 198427826
3446.8A98427826J583621J668379J799792J923755K080932K227545K149462K113998
$$ 198427826 200011447 201679826 203479618 205403373 207484305 209711850 211861312 213975310
3463.2B13975310K491340K759070K401739J870140J908169K340450K735585K811462
$$ 213975310 216466650 219225720 221627459 223497599 225405768 227746218 230481803 233293265
3479.5B33293265K543822K478749K756744K869353K796367K894103L072426L223598
$$ 233293265 235837087 238315836 241072580 243941933 246738300 249632403 252704829 255928427
3495.8B55928427L202736L137648L197015L094554K875119L031433L510892L832340
$$ 255928427 259131163 262268811 265465826 268560380 271435499 274466932 277977824 281810164
3512.1B81810164L710092L423154L477424L740281M057706M080295L807932L873289
$$ 281810164 285520256 288943410 292420834 296161115 300218821 304299116 308107048 311980337
3528.4C11980337M147768M283518M500836M650831M504919M603475M891217M984528
$$ 311980337 316128105 320411623 324912459 329563290 334068209 338671684 343562901 348547429
3544.7C48547429M830241M657626M794687N168349N314439N311936N553544N705982
$$ 348547429 353377670 358035296 362829983 367998332 373312771 378624707 384178251 389884233
3561.1C89884233N359233N186975O270885P013321O395191O096125O407291O711363
$$ 389884233 395243466 400430441 406701326 413714647 420109838 426205963 432613254 439324617
3577.4D39324617O972224P172882P005752O856680P412076P835567P293581P215769
$$ 439324617 446296841 453469723 460475475 467332155 474744231 482579798 489873379 497089148
3593.7D97089148P768750Q031904Q077503Q128643P806241P402301P842720Q311510
$$ 497089148 504857898 512889802 520967305 529095948 536902189 544304490 552147210 560458720
3610E60458720Q259833Q288860P881045P947147Q802593Q258819P043720O497502P691145
$$ 560458720 568718553 577007413 584888458 592835605 601638198 609897017 616940737 623438239 631129384
3628.4F31129384R063840P809877P100880P071317O834209O750166O487787N784750
$$ 631129384 640193224 648003101 655103981 662175298 669009507 675759673 682247460 688032210
3644.7F88032210N428851O442487P097244N627990M754245N377233N378366M505336
$$ 688032210 693461061 699903548 707000792 712628782 717383027 722760260 728138626 732643962
3661G32643962M010141L733039L262698L260672L711641L058791K699078L238380L096997
$$ 732643962 736654103 740387142 743649840 746910512 750622153 753680944 756380022 759618402 762715399
3679.4G62715399K764702K609253K424359K327979K323389K208233K045095J874864
$$ 762715399 765480101 768089354 770513713 772841692 775165081 777373314 779418409 781293273
3695.7G81293273J631260J373768J404583J578331J434922J055658P89106J102626
$$ 781293273 782924533 784298301 785702884 787281215 788716137 789771795 790560901 791663527
3712G91663527J565397J384139R79007P57634O74188O13571P57992R77456Q39055O03497
$$ 791663527 793228924 794613063 795592070 796349704 797023892 797637463 798395455 799372911 800211966 800815463
3732.4H00815463O12199R71735J113713N88774j05679k920P88629N89788K07722O81698
$$ 800815463 801427662 802399397 803513110 804101884 803996205 803993285 804781914 805371702 805579424 806261122
3752.8H06261122R78768O66320M05968N49793N69463L37004J84596K50578N17726O26504
$$ 806261122 807239890 807906210 808312178 808861971 809431434 809768438 809953034 810203612 810721338 811347842
3773.2H11347842M45962K52187K33949L19719K51055J88529L14534M07457L24548J28865
$$ 811347842 811793804 812045991 812279940 812599659 812850714 813039243 813353777 813761234 814085782 814214647
3793.6H14214647K1875N6088n7042J8299L55482K30551K51352N30362M18425M2617
$$ 814214647 814236522 814292610 814235568 814253867 814609349 814839900 815091252 815621614 816040039 816082656
3814H16082656m8518Q9109j98960j05620L37124L24846K46644J94847J86563K05278
$$ 816082656 816034138 816123247 815924287 815818667 816155791 816480637 816727281 816922128 817108691 817313969
3834.4H17313969p7128l41058k1637L32177M55380M00781O8724n63204j061499q2076
$$ 817313969 817236841 816895783 816874146 817206323 817661703 818062484 818131208 817568004 816506505 816424429
3854.8H16424429Q98660O32822J49489j46687r9123n3406j79350j79J75953K47598
$$ 816424429 817323089 817955911 818105400 817958713 817859590 817806184 817626834 817626655 817802608 818050206
3875.2H18050206K19524r7573k8372K31683Q7619R537m1366m6968J76072J33455j91033
$$ 818050206 818269730 818172157 818143785 818375468 818463087 818472624 818431258 818384290 818560362 818693817 818502784
3897.6H18502784l82662l12269n066L54528L75211J63973K8193m3213j19627l6478
$$ 818502784 818120122 817807853 817802787 818157315 818532526 818696499 818724692 818681479 818561852 818525374
3918H18525374J49369N5075j26839m291Q0883p1585l696K40982J83344l7909j32441
$$ 818525374 818674743 818729818 818602979 818598688 818679571 818607986 818604290 818845272 819028616 818990707 818858266
3940.4H18858266o7830N1617Q6070O2763N4598O4075M0591Q285Q6546J44958R6917
$$ 818858266 818790436 818842053 818928123 818990886 819045484 819109559 819150150 819158435 819244981 819389939 819486856
3962.9H19486856Q9765Q2612N3525M2677J7941P1466J51873J06036P1109J37806J54793
$$ 819486856 819576621 819659233 819712758 819755435 819773376 819844842 819996715 820102751 820173860 820311666 820466459
3985.3H20466459M5717k1160Q9824K00868J32203o616
$$ 820466459 820512176 820491016 820580840 820781708 820913911 820907295
3997.5H20907295
$$ 820907295
##END=$$ End of the data block
