##TITLE=$$ Begin of the data block
##JCAMP-DX=5.00 $$ ACD/SpecManager v 10.08
##SPECTROMETER/DATA SYSTEM=Alpha
##DATE=10 Apr 2014 09:27:12
##DATA TYPE=INFRARED SPECTRUM
##DATA CLASS=XYDATA
##ORIGIN=
##OWNER=
##NPOINTS=1765
##FIRSTX=399.75695801
##LASTX=3997.56933594
##MAXX=3997.56933594
##MINX=399.75695801
##MAXY=0.82919842
##MINY=0.17559215
##XFACTOR=1.0000000000
##YFACTOR=1.000000000000000e-9
##FIRSTY=0.53657079
##DELTAX=2.03957629
##XUNITS=1/CM
##YUNITS=ARBITRARY UNITS
##XYDATA=(X++(Y..Y))
399.8E36570787p50422j872420k523780j519978r58026j473009j210869k61545m08113
$$ 536570787 535820365 533947945 531424165 529904187 528946161 527473152 526262283 526000738 525592625
418.1E25592625j430809o87063N6624q91447j379847k94090K9862j156449j650512
$$ 525592625 524161816 523474753 523531377 522639930 521260083 520965993 520995855 519839406 518188894
436.5E18188894p17581j97410n67258q3386N51462m82261j334668m87804P3552r79304
$$ 518188894 517471313 517273903 516706645 516623259 517174721 516692460 515357792 514869988 514943540 513964236
456.9E13964236j439750m47929n69642j411199j152218n91278j193225j823604r88841
$$ 513964236 512524486 512076557 511506915 510095716 508943498 508352220 507158995 505335391 504346550
475.2E04346550p26104j726568j485646j42932k23219j229584j056046m48465j112074
$$ 504346550 503620446 501893878 500408232 500265300 500042081 498812497 497756451 497307986 496195912
493.6D96195912j871109j257091p77454j492828j617431o38605o12229j573503j625538
$$ 496195912 494324803 493067712 492290258 490797430 489179999 488541394 487929165 486355662 484730124
511.9D84730124r50485j163274j932889j707375j194716j800716k411306j700043j234651
$$ 484730124 483779639 482616365 480683476 478976101 477781385 475980669 473569363 471869320 470634669
530.3D70634669j820922j780778q90225q10474j428843j162171m68344q10265j401603
$$ 470634669 468813747 467032969 466142744 465332270 463903427 462741256 462272912 461462647 460061044
548.6D60061044j012058n50568j113951j903057j753747j422942j968116k453595k323389
$$ 460061044 459048986 458498418 457384467 455481410 453727663 452304721 450336605 447883010 445559621
567D45559621k540499l028363k861440k465099k747924l072619k653986k170354k420247
$$ 445559621 443019122 439990759 437129319 434664220 431916296 428843677 426189691 424019337 421599090
585.4D21599090k771407k656400k732277l047914k848684k356589k561540l335297
$$ 421599090 418827683 416171283 413439006 410391092 407542408 405185819 402624279 399288982
601.7C99288982l303021k027839q48145n16623m23670j54018M57406J868635L749669
$$ 399288982 395985961 393958122 393109977 392593354 392169684 392015666 392473072 394341707 398091376
620C98091376M758149M511267M084110M281372M422277M009665L627628L560602K924830
$$ 398091376 402849525 407360792 411444902 415726274 420148551 424158216 427785844 431346446 434271276
638.4D34271276J317084o6281L45171K166271L081918K126276K3932j747758o9350
$$ 434271276 435588360 435522079 435867250 438033521 441115439 443241715 443265647 441517889 441448539
656.7D41448539N209297Q481741P014782M237443L963142N227387L509432K669156
$$ 441448539 446657836 455139577 462154359 466391802 470354944 475582331 479091763 481760919
673.1D81760919L454387L541053K764254K530843K819807K397179J593084J651942
$$ 481760919 485215306 488756359 491520613 494051456 496871263 499268442 500861526 502513468
689.4E02513468J941264J276493O28352R49383J281857J015723J140654J980543K384186
$$ 502513468 504454732 505731225 506359577 507308960 508590817 509606540 510747194 512727737 515111923
707.7E15111923K064228K264262L036797L000497K380312K553761L120422K851069
$$ 515111923 517176151 519440413 522477210 525477707 527858019 530411780 533532202 536383271
724E36383271K410233K626062K795159K250493J762092J958907J961469J458049J459182
$$ 536383271 538793504 541419566 544214725 546465218 548227310 550186217 552147686 553605735 555064917
742.4E55064917K075731K154768J746476J908779K389848K231479J909971K252281
$$ 555064917 557140648 559295416 561041892 562950671 565340519 567571998 569481969 571734250
758.7E71734250K526104K114296J835227K170324K202034J469314P97928O14703K03132
$$ 571734250 574260354 576374650 578209877 580380201 582582235 584051549 584849477 585464180 585667312
777.1E85667312o52790j159012j062811r65178q57353Q5354J698494L049791M149377
$$ 585667312 585014522 583855510 582792699 581827521 580970168 581055522 582754016 585803807 589953184
795.4E89953184N603016O954312P289588O999076O763398O165862M912317L824294
$$ 589953184 595556200 602510512 609800100 616799176 623562574 629728436 634640753 638465047
811.7F38465047L270626K462745J073599j59562j131952k557754m183710n044162n205274
$$ 638465047 641735673 644198418 645272017 645112455 643980503 641422749 637239039 632194877 626989603
830.1F26989603n456626n661130n246461m651189m572212m563630l919244k764463
$$ 626989603 621532977 615871847 610625386 605974197 601401985 596838355 592919111 590154648
846.4E90154648j256526J092673M254639P092178R024501J0547995J1692882J1787176
$$ 590154648 588898122 589990795 594245434 601337612 610362113 620910108 632602990 644390166
862.7F44390166J0977089J0157347R238541P648408N960227M846751L769040K217114
$$ 644390166 655367255 665524602 674763143 682411551 688371778 693218529 696987569 699204683
879.1F99204683P72655j39832j125515k312600k919853k768636k381801j739264m45485
$$ 699204683 699977338 699837506 698711991 696399391 693479538 690710902 688329101 686589837 686144352
897.4F86144352J035690J897812K196968K306878J999319R90212l64900j684010l077626
$$ 686144352 687180042 689077854 691274822 693581700 695581019 696571231 696206331 694522321 691444695
915.8F91444695m470050n223334n014420m169345k884686j191675M54306J414597J577080
$$ 691444695 686974645 681751311 676736891 672567546 669682860 668491185 668945491 670360088 671937168
934.1F71937168J377821J135945Q21233M58896J19090l76344j236140k306819l408075
$$ 671937168 673314989 674450934 675272167 675731063 675850153 675473809 674237669 671930850 668522775
952.5F68522775m701376o233156p809460r387016j1129618j3114690j5139521j6796827
$$ 668522775 663821399 657588243 649778783 640391767 629262149 616147459 601007938 584211111
968.8E84211111j7693043j7552435j6264677j4121115j1827827r968042q585930p571727
$$ 584211111 566518068 548965633 532700956 518579841 506752014 496783972 488198042 480626315
985.1D80626315o881327o335943n687774m885673m110426l427803k787084k309948
$$ 480626315 473744988 467409045 461721271 456835598 452725172 449297369 446510285 444200337
1001.4D44200337k256841k774953l755600m953354o108254o895036p105976o869853
$$ 444200337 441943496 439168543 435412943 430459589 424351335 417456299 410350323 403480470
1017.7D03480470o460577n971164n409777m921853m563809m177332l738433l359407
$$ 403480470 397019893 391048729 385638952 380717099 376153290 371975958 368237525 364878118
1034.1C64878118k981663k563089k222895k081246k081424k140730k246797k267123
$$ 364878118 361896455 359333366 357110471 355029225 352947801 350807071 348560274 346293151
1050.4C46293151j936972j066863J83850J383573K087683K029329J069546o06567k445876
$$ 346293151 344356179 343289316 343473166 344856739 346944422 348973751 350043297 349436730 346990854
1068.7C46990854l952563m869283n166560n007625m701167m542440m697144n108237
$$ 346990854 343038291 338169008 333002448 327994823 323293656 318751216 314054072 308945835
1085C08945835n653918o114721o055773n125195l431022j488656K42234J453936K014547
$$ 308945835 303291917 297177196 291121423 285996228 282565206 281076550 281318784 282772720 284787267
1103.4B84787267K020300J701355J171976M11600o61492k151132m125833o289781p221996
$$ 284787267 286807567 288508922 289680898 290092498 289431006 287279874 283154041 276864260 269642264
1121.8B69642264n184979j019805J919895K068252O42120m95314j3143J823604L534466
$$ 269642264 264457285 263437480 265357375 267425627 268067747 267572433 267559290 269382894 272917360
1140.1B72917360M176617L918200L303916K733558K358437K199501K298414K757013
$$ 272917360 277093977 281012177 284316093 287049651 289408088 291607589 293906003 296663016
1156.4B96663016L573209M648894N992323P568032R106010J0190845J0695994J0788261
$$ 296663016 300236225 304885119 310877442 318445474 327551484 337742329 348438323 359226584
1172.7C59226584J0522038R891391R141326Q374721P257968N596012L626287J628339
$$ 359226584 369748622 379640013 388781339 397156060 404414028 410010040 413636327 415264666
1189.1D15264666k92420j773507k195000j436234M7892J874596L675163M828036M967689
$$ 415264666 414972246 413198739 411003739 409567505 409615397 411489993 415165156 419993192 424960881
1207.4D24960881M393459L582030K688378J850546J346677J246900J246869J159191
$$ 424960881 429354340 432936370 435624748 437475294 438821971 440068871 441315740 442474931
1223.7D42474931J271278J674384J986474K132147K427161K811045K921789K798826
$$ 442474931 443746209 445420593 447407067 449539214 451966375 454777420 457699209 460498035
1240.1D60498035K733707K567351K010912J362890R95189P44522M52756M52102R52571
$$ 460498035 463231742 465799093 467810005 469172895 470168084 470912606 471365362 471817464 472770035
1258.4D72770035J620621K223283L012687M009306M738063N145669N632341O144523
$$ 472770035 474390656 476613939 479626626 483635932 488373995 493519664 499152005 505296528
1274.7E05296528O292999O220222O394446O702184O771624O797195P010400P026196
$$ 505296528 511589527 517809749 524204195 530906379 537678003 544475198 551485598 558511794
1291E58511794O584406O100952N790711N255222M444897L825247L465236K941370K260983
$$ 558511794 565096200 571197152 576987863 582243085 586687982 590513229 593978465 596919835 599180818
1309.4E99180818J874923J707137J379788J118541J296639J631439J721144J731574
$$ 599180818 601055741 602762878 604142666 605261207 606557846 608189285 609910429 611642003
1325.7F11642003J839757J707077J108348M61460J80184N0664j15513J1801M61102
$$ 611642003 613481760 615188837 616297185 616758645 616938829 616989493 616873980 616885781 617346883
1344.1F17346883P82490P85410O96003N77748K80261j27673l81827o10531j166641
$$ 617346883 618129373 618914783 619610786 620188534 620468795 620341122 619959295 619348764 618182123
1362.4F18182123j724840j810669j772225j766026j878977k210915k587855l563821
$$ 618182123 616457283 614646614 612874389 611108363 609229386 607018471 604430616 600866795
1378.7F00866795n401910o105721l730595k30372Q26538j43111j127660k099693k821148
$$ 600866795 595464885 589359164 585628569 585398197 586224735 586081624 584953964 582854271 580033123
1397.1E80033123l474652l891528m100084m464805m126430l477931l096163k506614
$$ 580033123 576558471 572666943 568566859 564102054 559975624 556497693 553401530 550894916
1413.4E50894916j801193j564562j618445j079977m94837l49760k69950j22905J33932
$$ 550894916 549093723 547529161 545910716 544830739 544335902 543986142 543716192 543593287 543727219
1431.8E43727219M77254R64046J594067J800239J983523K286852K826392L509879L889859
$$ 543727219 544204473 545168519 546762586 548562825 550546348 552833200 555659592 559169471 563059330
1450.1E63059330M179656M923285P529974J0244965Q193553P102131Q365393Q744180
$$ 563059330 567238986 572162271 579692245 589937210 598130763 605232894 613598287 622342467
1466.4F22342467P688642Q326769J0869562J0543526P815003O050706M705548L524184
$$ 622342467 630031109 638357878 649227440 659770966 667585969 673636675 678342223 681866407
1482.8F81866407K387584J382231N7817j308262j762569k375961l874361m667938m244626
$$ 681866407 684253991 685636222 685694039 684385777 682623208 680247247 676372886 671704948 667460322
1501.1F67460322l885448n194187r006023q269131o281615o147682n800605n031943
$$ 667460322 663574874 658380687 649374664 641105533 634823918 628676236 622875631 617843688
1517.4F17843688m053593m130721m029036l537953l772080l314435k895355l253878
$$ 617843688 613790095 609659374 605630338 602092385 598320305 595005870 592110515 588856637
1533.7E88856637k719998j839697k136529k267182j316666n17726K24769P54893J102745
$$ 588856637 586136639 584296942 582160413 579893231 578576565 578058839 578283608 579038501 580141246
1552.1E80141246J388371J494348J306475M66167l35454r81570j788914l000379m434883
$$ 580141246 581529617 583023965 584330440 584796607 584461153 583479583 581690669 578690290 574255407
1570.5E74255407m483164n171954p823110p860064o981313p780552q370042q552552
$$ 574255407 569772243 564600289 556777179 548917115 541935802 534155250 525785208 517232656
1586.8E17232656q759379q890301q786082q727431q463532q044988p852435p716358
$$ 517232656 508473277 499582976 490796894 482069463 473605931 465560943 457708508 449992150
1603.1D49992150p410526p246345p374377p106691o431788o889463q212209o511747
$$ 449992150 442581624 435335279 427960902 420854211 414422423 407532960 399320751 392809004
1619.4C92809004n303562o200910n996078n167395m587829l385127k590358k712101
$$ 392809004 387505442 381304532 375308454 370141059 365553230 362168103 359577745 356865644
1635.7C56865644j763969l68297M42356J044929J867622K622038K477914L355980N466699
$$ 356865644 355101675 354733378 355175734 356220663 358088285 360710323 363188237 366544217 372010916
1654.1C72010916M673809M331410N382419O877988P583261O982237Q028954R820491
$$ 372010916 376684725 381016135 386398554 393276542 400859803 407842040 415870994 425691485
1670.4D25691485R011478R548068J0807722R820790R267032J1040300J5053153J3120055
$$ 425691485 434702963 444251031 455058753 464879543 474146575 485186875 500240028 513360083
1686.7E13360083J0769248J1483491J0711908J1872470J3776958J3980747J5847504
$$ 513360083 524129331 535612822 546324730 558197200 571974158 585954905 601802409
1701F01802409J2588322J0453403J0784387R008408P572353O978035O863594P266819
$$ 601802409 614390731 624844134 635628521 644636929 652209282 659187317 666050911 673317730
1717.3F73317730O004513M296839M121423M406810M314005M392266M375220N100131
$$ 673317730 679322243 683619082 687740505 692147315 696461320 700853586 705228806 710328937
1733.6G10328937N160749M077374M488409M961014M831314M858255M962206N216599
$$ 710328937 715489686 719567060 724055469 729016483 733847797 738706052 743668258 748884857
1749.9G48884857N105853M219234L787219L594518L228307L212154K703905K168476
$$ 748884857 753990710 758209944 761997163 765591681 768819988 772032142 774736047 776904523
1766.3G76904523K246797K324045K192736J966357J774430J768828J721859J685023
$$ 776904523 779151320 781475365 783668101 785634458 787408888 789177716 790899575 792584598
1782.6G92584598J782000J664221J346887J396000J759827J440346J023949J147985
$$ 792584598 794366598 796030819 797377706 798773706 800533533 801973879 802997828 804145813
1798.9H04145813J339734J098156Q91566J037776J060903Q09729O63758Q00431P86066
$$ 804145813 805485547 806583703 807475269 808513045 809573948 810383677 811047435 811847866 812633932
1817.2H12633932O03497O38902Q25703P49350N31971O62446P76589M98354L38018N74708
$$ 812633932 813237429 813876331 814702034 815451384 815983355 816645801 817422390 817920744 818258762 818833470
1837.6H18833470O91891M72546M18007O33538N15699K62857L23415N01215M30167K39849
$$ 818833470 819525361 819997907 820415914 821049452 821565151 821828008 822151423 822652638 823082805 823322654
1858H23322654L23117M81605L76523K00629K96950M28498K50936J28269K56717L29494
$$ 823322654 823645771 824127376 824503899 824704528 825001478 825429976 825680912 825809181 826065898 826395392
1878.4H26395392J58668J02758K83242L37004J69456J16170K17497J64449M0710J28329
$$ 826395392 826554060 826656818 826940060 827277064 827446520 827562690 827780187 827944636 827985346 828113675
1898.8H28113675K61545J29760j6809J13964K29359P4208m9413P2301J68741M2975
$$ 828113675 828375220 828504980 828488171 828602135 828831494 828905702 828856289 828928590 829097331 829140306
1919.2H29140306o8725L9757Q7082p0393r0122O8545M4525j59860j47819J6331m4048
$$ 829140306 829071581 829111338 829198420 829128027 829037905 829106450 829150975 828991115 828843296 828859627 828815579
1941.7H28815579k21312j62482n0485j62780k71321j56581q0228k21968k70724j28746
$$ 828815579 828594267 828431785 828381300 828218520 827947199 827790618 827710390 827488422 827217698 827088952
1962.1H27088952j07348k53320k64525j26243j39653k75791k40684r4831j60157k68758
$$ 827088952 826981604 826728284 826463759 826337516 826197863 825922072 825681388 825586557 825426400 825157642
1982.5H25157642j69336p7725j90914k91407j88648j18673k24471k85089k27452k32815
$$ 825157642 824988306 824910581 824719667 824428260 824239612 824120939 823896468 823611379 823383927 823151112
2002.8H23151112l04044l14772k35855k13445l02493l29793k55525k47061l40402l30806
$$ 823151112 822847068 822532296 822296441 822082996 821780503 821450710 821195185 820948124 820607722 820276916
2023.2H20276916k35677k58863l44872l10779k45809k72215l23474k84434j95145k28644
$$ 820276916 820041239 819782376 819437504 819126725 818880916 818608701 818285227 818000793 817805648 817577004
2043.6H17577004k92360k37525j74403k46108l22222k53976j67787k11060k42650j23024
$$ 817577004 817284644 817047119 816872716 816626608 816304386 816050410 815882623 815671563 815428913 815305889
2064H15305889r1672k06530k03550q0943r4951k04801j51277j3113q9824k45392j42098
$$ 815305889 815214217 815007687 814804137 814723194 814628243 814423442 814272165 814259052 814169228 813923836 813781738
2086.5H13781738j3590j38521k30729o7234M0054j08719j99318j4305R6798o7413j20282
$$ 813781738 813768148 813629627 813398898 813331664 813371718 813262999 813063681 813049376 813146174 813078761 812958479
2108.9H12958479L6001M8220q7380l5107J33812J15276j0491K5690J45316J01566J4782
$$ 812958479 812994480 813042700 812955320 812920213 813054025 813169301 813158810 813184500 813329816 813431382 813446164
2131.3H13446164R6202J82748P6592O378J41501K21670J07526M4525J53959K10404
$$ 813446164 813542366 813725114 813801706 813808084 813949585 814171255 814278781 814323306 814477265 814687669
2151.7H14687669R8646O4552K10047K34603R8169Q2732J86264J91987J38580J95146
$$ 814687669 814786315 814850867 815060914 815295517 815393686 815476418 815662682 815854669 815993249 816188395
2172.1H16188395K68102J86085P8619J55866K35319J12534J3172J35303K39670J22547
$$ 816188395 816456497 816642582 816721201 816877067 817112386 817224920 817238092 817373395 817613065 817735612
2192.5H17735612K7001J01507J20521N36p749J48178J59442n96J4782J63436Q0287
$$ 817735612 817762613 817864120 817984641 817985177 817977428 818125606 818285048 818284452 818299234 818462670 818542957
2215H18542957r5665j4961J39058O7293m0114M8519J06752l0518j06216m112L4332
$$ 818542957 818447292 818432331 818571389 818638682 818598568 818647087 818753839 818723321 818617105 818612993 818647325
2237.4H18647325o9380q3327L0577J311j53124j33037J5139r119j47701j01506J4901
$$ 818647325 818577945 818494618 818525195 818526506 818373382 818240345 818255484 818246365 818098664 817997158 818012059
2259.8H18012059n3406j17779L0101J29461Q225l3140J01745J10746j7882L2187J84893
$$ 818012059 817958653 817840874 817870975 818000436 818008661 817975521 818077266 818188012 818170130 818202317 818387210
2282.3H18387210J41979J5854N2929J49846Q7560p809P5996J68264O5267l4153L9220
$$ 818387210 818529189 818545043 818597972 818747818 818835378 818827569 818903565 819071829 819137096 819102943 819142163
2304.7H19142163J19507M9651K1457J67132J68979l0339n0664J40310K00450J00792
$$ 819142163 819261670 819311321 819332778 819499910 819668889 819638550 819587886 819728196 819928646 820029438
2325.1H20029438O6757J50740J61707L2664n126L4272M173k98J97231M92216M61101
$$ 820029438 820096195 820246935 820408642 820441306 820436180 820470452 820474625 820474327 820671558 821163774 821624875
2347.5H21624875J48416o0380p4565p5400q6069R8467L12864L59059L92020L57747
$$ 821624875 821773291 821712911 821638346 821562946 821476877 821575344 821888208 822247267 822639287 822997034
2367.9H22997034K96712L31997L85702L74615L58522L94225M01378L04461J65581J05381
$$ 822997034 823293746 823625743 824011445 824386060 824744582 825138807 825540185 825844646 826010227 826115608
2388.3H26115608J10746J21176J14381R9898Q5830P6533Q3029Q1897M4465j908R537
$$ 826115608 826226354 826347530 826461911 826561809 826647639 826724172 826807201 826889098 826933563 826931655 826941192
2410.8H26941192K1696Q35m888k6047q3745j29759j18017p9811o1035m7088k3543l8922
$$ 826941192 826962888 826963723 826958835 826932788 826849043 826719284 826601267 826521456 826460421 826413333 826389790 826350868
2435.2H26350868q2374q7619p8201j07646j27554q1181n0009r3460j24276p1704m8756
$$ 826350868 826268494 826180875 826102674 825995028 825867474 825786293 825736284 825642824 825518548 825446844 825398088
2457.7H25398088j41562j90258j13487r6857j79291j86324j14799r8407j37150j38998
$$ 825398088 825256526 825066268 824952781 824855924 824676633 824490309 824375510 824277103 824139953 824000955
2478.1H24000955j46807k00152j91808j18077j12056j84417k00570j24514r9897j72794
$$ 824000955 823854148 823653996 823462188 823344111 823232055 823047638 822847068 822722554 822622657 822449863
2498.5H22449863j99556j67728j72913j87993j55926j14202j52231k09331j66118j31846
$$ 822449863 822250307 822082579 821909666 821721673 821565747 821451545 821299314 821089983 820923865 820792019
2518.9H20792019j91748j99020j28448j20043j90258k17259j68860j56463j85549j58191
$$ 820792019 820600271 820401251 820272803 820152760 819962502 819745243 819576383 819419920 819234371 819076180
2539.2H19076180j23143j77681k21253j54852j04428j72734k43723k01583j64211k37227
$$ 819076180 818953037 818775356 818554103 818399251 818294823 818122089 817878366 817676783 817512572 817275345
2559.6H17275345k80261j81377j31666k41936k93493k37882k63929l76940l80457k81930
$$ 817275345 816995084 816813707 816682041 816440105 816146612 815908730 815644801 815267861 814887404 814605474
2580H14605474k99036l97384l99053l75569m37975m74215l98576l66628m84347n57363
$$ 814605474 814306438 813909054 813510001 813134432 812696457 812222242 811823666 811457038 810972691 810415328
2600.4H10415328m80831m73857n89192n80966m72784n02289o07252n96464n46515o05940
$$ 810415328 809934497 809460640 808871448 808290482 807817698 807315409 806708157 806111693 805565178 804959238
2620.8H04959238o33479n32269n00143o13749o72936n87583n21540n41866n58019n44429
$$ 804959238 804325759 803793490 803293347 802679598 802006662 801419079 800897539 800355673 799797654 799253225
2641.2G99253225n52475n92053n88059n46098n59628n69523n12778m90368n42521n67496
$$ 799253225 798700750 798108697 797520638 796974540 796414912 795845389 795332611 794842243 794299722 793732226
2661.6G93732226n17368m90010n40078n81443n42641n17070n82576o19769n79298n79774
$$ 793732226 793214858 792724848 792184770 791603327 791060686 790543616 789961040 789341271 788761973 788182199
2682G88182199o42180o47307n83053n66601o20008o50286o52254o76513p04348p06673
$$ 788182199 787540019 786892712 786309659 785743058 785123050 784472764 783820510 783143997 782439649 781732976
2702.4G81732976o77108o76453p13826p34687p63535p97510p70807p09176p01786p36236
$$ 781732976 781055868 780379415 779665589 778930902 778167367 777369857 776599050 775889874 775188088 774451852
2722.8G74451852p56145p57336p43509p44164p36355o88911o82652p27236p53045p36714
$$ 774451852 773695707 772938371 772194862 771450698 770714343 770025432 769342780 768615544 767862499 767125785
2743.2G67125785p12752p04169o60658o57797p82967q76784q36551p82192q07762q56876
$$ 767125785 766413033 765708864 765048206 764390409 763607442 762730658 761894107 761111915 760304153 759447277
2763.6G59447277q51214q42750r05157r50932r09925r25064j033604j076102j044750
$$ 759447277 758596063 757753313 756848156 755897224 754987299 754062235 753028631 751952529 750907779
2782G50907779j054764j114488j125753j112342j193046j304925j310110j266360j320124
$$ 750907779 749853015 748738527 747612774 746500432 745307386 744002461 742692351 741425991 740105867
2800.3G40105867j417398j450360j454174j483381j540780j572013j601219j680255
$$ 740105867 738688469 737238109 735783935 734300554 732759774 731187761 729586542 727906287
2816.6G27906287j710892j666427j692414j824319j911104j941919k088428k343058
$$ 727906287 726195395 724528968 722836554 721012235 719101131 717159212 715070784 712727726
2832.9G12727726k567590k809942l248453l894031m616856n350054n758702n240441
$$ 712727726 710160136 707350194 704101741 700207710 695590854 690240800 684482098 679241657
2849.3F79241657l858626k468764j636506j245498j157522j436949k008259k609432
$$ 679241657 675383031 672914267 671277761 670032263 668874741 667437792 665429533 662820101
2865.6F62820101l034234l211439l095865k738893k352059k052546j846790j768827
$$ 662820101 659785867 656574428 653478563 650739670 648387611 646335065 644488275 642719448
2881.9F42719448j822830j971602k141118k265930k384126k501011k566040k622843
$$ 642719448 640896618 638925016 636783898 634517968 632133842 629632831 627066791 624443948
2898.2F24443948k701163k794981k961099l224313l615916m215002m865170n138397
$$ 624443948 621742785 618947804 615986705 612762392 609146476 604931474 600066304 594927907
2914.5E94927907m837692m198551l473163k706408j954019j243472n60165j609N13911
$$ 594927907 590090215 585891664 582418501 579712093 577758074 576514602 575954437 575952828 576466739
2932.9E76466739J144767J800001K382874K809167K908826K653837K122462J423001
$$ 576466739 577611506 579411507 581794381 584603548 587512374 590166211 592288673 593711674
2949.2E93711674Q01981L43442K7120j0789K12610N05626P20740Q59320R72926J024187
$$ 593711674 594513655 594857097 594884217 594873428 595086038 595591664 596312404 597171724 598144650 599168837
2969.6E99168837J032353J022517R86099J008928J043260R38475Q08538P88092P43389
$$ 599168837 600201190 601223707 602209806 603218734 604261994 605200469 606009007 606797099 607540488
2987.9F07540488O13809L99887J5736l64542o21259q68201j037658j126051j207888
$$ 607540488 608154297 608554184 608569920 608205378 607584119 606715918 605678260 604552209 603344321
3006.3F03344321j197517j141548j220167j404583j561761j665890j746655j792192
$$ 603344321 602146804 601005256 599785089 598380506 596818745 595152855 593406200 591614008
3022.6E91614008j852095j970232k004504j931488j892448k013504k216697k240539
$$ 591614008 589761913 587791681 585787177 583855689 581963241 579949737 577733040 575492501
3038.9E75492501k190053k305687k451837k506256k518177k521992k543032k569377
$$ 575492501 573302448 570996761 568544924 566038668 563520491 560998499 558455467 555886090
3055.3E55886090k590180k575636k491712k376497k309203k350986k447307k487779
$$ 555886090 553295910 550720274 548228562 545852065 543542862 541191876 538744569 536256790
3071.6E36256790k425670k280951k191246k274096k404749k468288k503157k461969
$$ 536256790 533831120 531550169 529358923 527084827 524680078 522211790 519708633 517246664
3087.9E17246664k386034k481043k630771k596616k503991k543450k664298k727180
$$ 517246664 514860630 512379587 509748816 507152200 504648209 502104759 499440461 496713281
3104.2D96713281k723515k735079k810478k820343k732128k763897k911836l064900
$$ 496713281 493989766 491254687 488444209 485623866 482891738 480127841 477216005 474151105
3120.5D74151105l207892l250361l189921l139645l139138l198088l254354l225207
$$ 474151105 470943213 467692852 464502931 461363286 458224148 455026060 451771706 448546499
3136.8D48546499l222346l367812l494352l454089l377974l346145l338903l419608
$$ 448546499 445324153 441956341 438461989 435007900 431629926 428283781 424944878 421525270
3153.2D21525270l561437l604383l569066l550083l555297l564895l536880l500133
$$ 421525270 417963833 414359450 410790384 407240301 403685004 400120109 396583229 393083096
3169.5C93083096l507317l527015l514230l504813l489315l447176l410041l404170
$$ 393083096 389575779 386048764 382534534 379029721 375540406 372093230 368683189 365279019
3185.8C65279019l418565l416061l380210l313034l277481l264397l214836l154815
$$ 365279019 361860454 358444393 355064183 351751149 348473668 345209271 341994435 338839620
3202.1C38839620l123432l087789l044247l009409k960861k924621k896547k864629
$$ 338839620 335716188 332628399 329584152 326574743 323613882 320689261 317792714 314928085
3218.4C14928085k836615k774924k686590k654612k642542k543271k442867k483785
$$ 314928085 312091470 309316546 306629956 303975344 301332802 298789531 296346664 293862879
3234.7B93862879k539754k460628k363533k320260k254963k185017k186447k176583
$$ 293862879 291323125 288862497 286498964 284178704 281923741 279738724 277552277 275375694
3251.1B75375694k116382k093285k092898k052635k007753k012193k016813j971364
$$ 275375694 273259312 271166027 269073129 267020494 265012741 263000548 260983735 259012371
3267.4B59012371j891017j864075j914621j959175j953154j890734j843140j867026
$$ 259012371 257121354 255257279 253342658 251383483 249430329 247539595 245696455 243829429
3283.7B43829429j876771j815826j722887j675144j722246j780451j792341j770661
$$ 243829429 241952658 240136832 238413945 236738801 235016555 233236104 231443763 229673102
3300B29673102j701384j614139j611709j730308j855895j865581j769856j679539j634091
$$ 229673102 227971718 226357579 224745870 223015562 221159667 219294086 217524230 215844691 214210600
3318.4B14210600j588807j534909j514464j577676j626387j556054j480266j430601
$$ 214210600 212621793 211086884 209572420 207994744 206368357 204812303 203332037 201901436
3334.7B01901436j365483j357257j394376j392171j389414j343310j230359j244605
$$ 201901436 200535953 199178696 197784320 196392149 195002735 193659425 192429066 191184461
3351A91184461j349494j349121j204878j031891j004368j045793r26286p90849q76576
$$ 191184461 189834967 188485846 187280968 186249077 185244709 184198916 183272630 182481781 181605205
3369.3A81605205j051605j042187q21650o44997n77941n57602n18143l62992r1255
$$ 181605205 180553600 179511413 178689763 178044766 177466825 176909223 176391080 176028088 175936833
3387.7A75936833J10328J5721k31937k38791R9585L47331J28031j60367K861L09766
$$ 175936833 176047161 176062882 175830945 175592154 175691739 176039070 176167101 176006734 176009595 176319361
3408.1A76319361M08426M06742L41922K81066M18633O21721O66603P50617R89913J180336
$$ 176319361 176727787 177134529 177476451 177757517 178176150 178797871 179464474 180215091 181205004 182385340
3428.5A82385340J122818J096755J268312J197458Q54447Q10579J145988J469717J617029
$$ 182385340 183508158 184604913 185873225 187070683 187925130 188735709 189881697 191351414 192968443
3446.8A92968443J566276J535863J619637J750141J941443K096891K031609J990512
$$ 192968443 194534719 196070582 197690219 199440360 201381803 203478694 205510303 207500815
3463.2B07500815K271593K481192K230361J821280J824439K123862K431944K544865
$$ 207500815 209772408 212253600 214483961 216305241 218129680 220253542 222685486 225230351
3479.5B25230351K351493K303034K558842K644673K537087K594381K792761K948105
$$ 225230351 227581844 229884878 232443720 235088393 237625480 240219861 243012622 245960727
3495.8B45960727K854526K777741K941072K927303K714008K821237L179640L433436
$$ 245960727 248815253 251592994 254534066 257461369 260175377 262996614 266176254 269609690
3512.1B69609690L384083L149122L184200L477990L797323L721475L386021L433853
$$ 269609690 272993773 276142895 279327095 282805085 286602408 290323883 293709904 297143757
3528.4B97143757L728718L909051M106313M220277M052103M132211M485428M635007
$$ 297143757 300872475 304781526 308887839 313108116 317160219 321292430 325777858 330412865
3544.7C30412865M367888M120439M305243M596919M672408M746706M960268M995466
$$ 330412865 334780753 338901192 343206435 347803354 352475762 357222468 362182736 367178202
3561.1C67178202M745632M862905N842864O131232N447626N242378N577981N949944
$$ 367178202 371923834 376786739 382629603 388760835 394208461 399450839 405028820 410978764
3577.4D10978764O209910O277174O107450O195127O720871O746561O278812O489426
$$ 410978764 417188674 423465848 429573298 435768425 442489296 449235857 455514669 462004095
3593.7D62004095O967545P087529P167816P164120O823302O673962P291674P620752
$$ 462004095 468971640 476059169 483226985 490391105 497214407 503888369 511180043 518800795
3610E18800795P415593P375836P141590P562697Q339226P462502O273270O200492P913113
$$ 518800795 526216388 533592224 540733814 548296511 556635737 564098239 570371509 576572001 584485114
3628.4E84485114Q858919P172167O676138O824195O647587O583214O240963N546093
$$ 584485114 593344033 600516200 607192338 614016533 620664120 627247334 633488297 639034390
3644.7F39034390N666078P378161P634282N350887M638017N639195N512238M588663
$$ 639034390 644700468 652078629 659712911 665063798 669701815 675341010 680853248 685441911
3661F85441911M226685L948748L587842L955483M284084L401339L653288M006565K997517
$$ 685441911 689668596 693617344 697205186 701160669 705444753 708846092 712499380 716505945 719503462
3679.4G19503462K585888K537608K443672K812147L251731K734542K092123J830220
$$ 719503462 722089350 724626958 727070630 729882777 733134508 735869050 737961173 739791393
3695.7G39791393J644612J626372J893043J859248J436293J226723J395286J744508
$$ 739791393 741436005 743062377 744955420 746814668 748250961 749477684 750872970 752617478
3712G52617478J566828J094699R93847J063347R90987Q87036R24409Q64625O68883
$$ 752617478 754184306 755279005 756272852 757336199 758327186 759214222 760138631 761003256 761672139
3730.3G61672139P73132J137853J370310J081944M23372R4414O48260R67502N22375
$$ 761672139 762445271 763583124 764953434 766035378 766458750 766553164 767201424 768168926 768691301
3748.7G68691301P84219J115381P53642N31435O53803P16150M92692M05311M22836
$$ 768691301 769475520 770590901 771344543 771875978 772529781 773245931 773738623 774143934 774566770
3767.1G74566770N19752P41482N96285L24547L89934N89490M73856K03372K62498M29094
$$ 774566770 775086522 775828004 776424289 776748836 777138770 777728260 778202116 778405488 778667986 779097080
3787.5G79097080M13478L12090K16364L02017L10123P9751L23892N46276L23832M36306
$$ 779097080 779510558 779822648 780039012 780341029 780651152 780730903 781054795 781601071 781924903 782361209
3807.8G82361209L94404J11223N5790L01897L12030R9302L74198L38554R9123R0718
$$ 782361209 782755613 782866836 782922626 783224523 783536553 783635855 784010053 784348607 784447730 784538448
3828.2G84538448O9678J60157K57254K29478J83284J24633J67192K73525J84834r2566
$$ 784538448 784608126 784768283 785025537 785255015 785438299 785562932 785730124 786003649 786188483 786095917
3848.6G86095917m60684l73066N86570O62982J37389p6056O1572K90692Q3148j54853
$$ 786095917 785635233 785262167 785848737 786511719 786649108 786573052 786634624 786925316 787008464 786853611
3869G86853611R3580K79367K67803M3393j05679J23798J26064J02580J18792j10865
$$ 786853611 786947191 787226558 787494361 787537754 787432075 787555873 787681937 787784517 787903309 787792444
3889.4G87792444l7372K01225P9632j36375j86444o1392J40190K23279J10924L1173
$$ 787792444 787755072 787956297 788035929 787899554 787713110 787651718 787791908 788015187 788126111 788157284
3909.8G88157284K7001o5923j24752k1041N0784j5259j4067P0095L7372K1041J78158
$$ 788157284 788184285 788118362 787993610 787972569 788023353 788008094 787994027 788064122 788101494 788122535 788300693
3932.3G88300693K41399M4763j38700j33813K6405J31250M0710P272R3221J01626Q1122
$$ 788300693 788542092 788586855 788448155 788314342 788340747 788471997 788512707 788519979 788613200 788714826 788795948
3954.7G88795948P8142K6285L7551J08242R8348J20342J72019J35898J17422J23679
$$ 788795948 788874090 788900375 788937926 789046168 789144516 789264858 789436877 789572775 789690197 789813876
3975.1G89813876N9486K3245J40608K44379J31726l3021m7982N6565J55866J67072
$$ 789813876 789873362 789896607 790037215 790281594 790413320 790380299 790332317 790388882 790544748 790711820
3995.5G90711820J16706
$$ 790711820 790828526
3997.5G90828526
$$ 790828526
##END=$$ End of the data block
