##TITLE=$$ Begin of the data block
##JCAMP-DX=5.00 $$ ACD/SpecManager v 10.08
##SPECTROMETER/DATA SYSTEM=Alpha
##DATE=10 Apr 2014 09:27:12
##DATA TYPE=INFRARED SPECTRUM
##DATA CLASS=XYDATA
##ORIGIN=
##OWNER=
##NPOINTS=1765
##FIRSTX=399.75695801
##LASTX=3997.56933594
##MAXX=3997.56933594
##MINX=399.75695801
##MAXY=0.82930207
##MINY=0.17573877
##XFACTOR=1.0000000000
##YFACTOR=1.000000000000000e-9
##FIRSTY=0.53605652
##DELTAX=2.03957629
##XUNITS=1/CM
##YUNITS=ARBITRARY UNITS
##XYDATA=(X++(Y..Y))
399.8 536056519 535115361 533656776 531705797 530407846 529203057 527177095 525585771 525586009 525593817 524430513
420.2 524430513 524071336 524143934 522991836 521504402 521152377 521047115 519680560 517826855 517108917
438.5 517108917 516764939 515935481 515848398 516353548 515829980 514900565 514978409 515267432 514451504 513155937
458.9 513155937 512402952 511284888 509432018 508278728 508022904 506965101 504946291 503668368 502961636
477.3 502961636 501626551 500428438 500248432 499897033 498636961 497633964 497182518 495916396 493885577
495.6 493885577 492522061 491742164 490412474 488907963 488259405 487622052 486048311 484451205 483544558
514 483544558 482405692 480431974 478655696 477429986 475677758 473322928 471577555 470317215 468561888
532.3 468561888 466796994 465832174 464981973 463590711 462483764 462152660 461556345 460253567 459109455
550.7 459109455 458207548 456822664 455103278 453726739 452376485 450295299 447755843 445351154 442762762
569 442762762 439642817 436718225 434441358 432021737 429083437 426262230 423818141 421271473 418502808
587.4 418502808 415819854 413168103 410322636 407483548 404959083 402362436 399178445 396009445
603.7 396009445 394048870 393331796 392915905 392368406 392006755 392336935 394173890 397947520 402712226
622.1 402712226 407263190 411429137 415839016 420419931 424413741 427822292 431192964 434044182
638.4 434044182 435406685 435510427 435956985 438060790 441133857 443393677 443439305 441555202 441454411
656.7 441454411 446724623 455196679 462235540 466560721 470473498 475594491 479188502 481973708
673.1 481973708 485506445 489005983 491599023 494015485 496856213 499325752 501001656 502680719
689.4 502680719 504564583 505787611 506400645 507373214 508719563 509765565 510882437 512860358 515259802
707.7 515259802 517356694 519669592 522685230 525598884 527940392 530533612 533679724 536498487
724 536498487 538885057 541536331 544369876 546634257 548395753 550369442 552325666 553743243 555173993
742.4 555173993 557232916 559373260 561099350 562986255 565391779 567678332 569590628 571725309
758.7 571725309 574169397 576376855 578330755 580474913 582584441 584081829 585012555 585696340 585862517
777.1 585862517 585143328 583982766 582940102 581934452 581068158 581209540 582926333 585921049 590024829
795.4 590024829 595643759 602615178 609863460 616740465 623366177 629528165 634568870 638505340
811.7 638505340 641808391 644245565 645266593 645041287 643874645 641350746 637192905 632150888 626981258
830.1 626981258 621536911 615843654 610591233 605983257 601474822 596941173 592995882 590170920
846.4 590170920 588891447 590035617 594298601 601305425 610278130 620871782 632618368 644397855
862.7 644397855 655343175 665494323 674775183 682453334 688357413 693141282 696890235 699103773
879.1 699103773 699882329 699740350 698628485 696339488 693473756 690784097 688387334 686584473 686128676
897.4 686128676 687168241 689043283 691199541 693488657 695486367 696440935 696069956 694449425 691416800
915.8 691416800 686949790 681725979 676723540 672557712 669674635 668525398 669012845 670361102 671818495
934.1 671818495 673150122 674314976 675136447 675524831 675585806 675214946 673992872 671710730 668353379
952.5 668353379 663680792 657473564 649700940 640304983 629144490 616022825 600893915 584125876
968.8 584125876 566467881 548929453 532667696 518546522 506677210 496665746 488101482 480558187
985.1 480558187 473652303 467289448 461616397 456741065 452620476 449181527 446364045 444014966
1001.4 444014966 441733748 438940823 435179800 430236071 424130291 417246759 410183609 403347045
1017.7 403347045 396883696 390919209 385541826 380648643 376091868 371876687 368108630 364794821
1034.1 364794821 361876428 359321564 357057571 354943663 352845699 350694507 348469675 346226156
1050.4 346226156 344294876 343244344 343426317 344764173 346817166 348850250 349930078 349338174 346920878
1068.7 346920878 342979670 338094831 332923830 327912539 323183656 318634778 313979089 308925062
1085 308925062 303303748 297171235 291073650 285952836 282560945 281093866 281320542 282718480 284678966
1103.4 284678966 286709756 288479537 289706260 290119112 289449334 287305146 283152580 276796073 269532204
1121.8 269532204 264343441 263300687 265209734 267334759 268023998 267522246 267502069 269313008 272804618
1140.1 272804618 276957929 280907691 284249097 286975950 289294004 291480094 293831587 296651125
1156.4 296651125 300241143 304882258 310875416 318438947 327512115 337689817 348415613 359231144
1172.7 359231144 369766414 379660368 388761371 397054851 404248208 409821689 413453609 415079236
1189.1 415079236 414754808 412983179 410850614 409462899 409518600 411385298 415046960 419876486 424875677
1207.4 424875677 429296672 432879001 435571343 437422723 438736886 439928800 441134065 442304730
1223.7 442304730 443612188 445291698 447266817 449384958 451809973 454661250 457622111 460425884
1240.1 460425884 463167846 465769976 467804730 469156861 470153153 470922947 471390933 471837699 472770035
1258.4 472770035 474368185 476595730 479621619 483606517 488311380 493457049 499087930 505199134
1274.7 505199134 511478305 517717779 524118304 530807674 537564158 544359565 551396072 558458030
1291 558458030 565046430 571125329 576913059 582194865 586663246 590479970 593918443 596846819 599109113
1309.4 599109113 601001501 602748752 604151726 605258405 606536984 608156860 609860122 611588776
1325.7 611588776 613450289 615151942 616220772 616646528 616819263 616898537 616833150 616880715 617329717 618080020
1346.1 618080020 618860245 619562268 620135844 620413482 620298803 619947612 619354963 618190348 616480708
1364.5 616480708 614665687 612869918 611105323 609234691 607019186 604434192 600887299 595484555
1380.8 595484555 589335620 585555613 585326552 586196959 586070836 584918499 582781971 579934359 576469839
1399.1 576469839 572620094 568547428 564090490 559966803 556486309 553377330 550850272 549034595
1415.5 549034595 547461212 545867860 544833779 544348240 543972194 543658614 543525398 543703735 544211686
1433.8 544211686 545156419 546725571 548543990 550558805 552837551 555600166 559069335 562995076
1450.1 562995076 567203403 572093725 579556942 589787185 598004878 605103374 613475084 622263610
1466.4 622263610 629960597 638242364 649066389 659618080 667481899 673564911 678274989 681803524
1482.8 681803524 684177160 685513258 685554028 684297919 682571888 680168927 676258922 671604514 667371690
1501.1 667371690 663444579 658143938 649087310 640916348 634722769 628622591 622820139 617740870
1517.4 617740870 613647461 609492779 605455399 601969600 598295808 595022976 592094183 588838518
1533.7 588838518 586152554 584262311 582013428 579771757 578574359 578152120 578422666 579177916 580275416
1552.1 580275416 581669927 583124697 584315717 584770739 584510267 583567441 581790805 578790128 574369490
1570.5 574369490 569890320 564679563 556843519 549015880 542048335 534281254 525921762 517355800
1586.8 517355800 508573294 499647439 490818948 482069135 473605484 465567946 457732409 450032264
1603.1 450032264 442611933 435346931 427957863 420816272 414344460 407445282 399247140 392740607
1619.4 392740607 387395054 381120861 375100255 369943053 365380287 362028956 359441251 356696516
1635.7 356696516 354945481 354634941 355105907 356128454 357970387 360615999 363094091 366391510 371852487
1654.1 371852487 376583695 380943298 386325032 393216491 400846928 407830149 415812403 425645590
1670.4 425645590 434715360 444295913 455113679 464918315 474133730 485086918 500101388 513287544
1686.7 513287544 524122834 535641730 546353221 558179379 571897864 585860372 601723969
1701 601723969 614336014 624812841 635626495 644661188 652243912 659195840 665964901 673155487
1717.3 673155487 679233909 683621824 687770486 692181766 696505785 700881422 705194175 710257888
1733.6 710257888 715456963 719556570 724035084 728969216 733769596 738633335 743629396 748877883
1749.9 748877883 754019797 758253753 762013316 765579283 768809199 772042871 774775326 776958287
1766.3 776958287 779181242 781445384 783614337 785622120 787435472 789218128 790934682 792608559
1782.6 792608559 794384241 796041727 797372222 798745453 800483644 801929474 802990019 804171503
1798.9 804171503 805535436 806646764 807536662 808569789 809603989 810384750 811076581 811929762 812730789
1817.2 812730789 813326836 813964665 814771831 815490305 816009045 816674352 817459106 817980289 818381786 819001138
1837.6 819001138 819646955 820024908 820374012 820993960 821520090 821809709 822168946 822691321 823127925 823382020
1858 823382020 823728204 824208975 824570656 824779868 825091898 825499535 825718164 825846970 826129258 826468170
1878.4 826468170 826616287 826720178 827019632 827360511 827511787 827614605 827845931 828044236 828104854 828213334
1898.8 828213334 828449786 828594565 828598499 828683615 828871548 828930616 828874350 828957498 829158425 829207242 829118788
1921.3 829118788 829176962 829302073 829220295 829091251 829144895 829199672 829068363 828959346 828991294 828914940 828638911
1943.7 828638911 828438044 828383565 828257859 828019917 827859879 827780485 827568352 827292144 827156007 827053130
1964.1 827053130 826818168 826571047 826444030 826293707 826017022 825783074 825688660 825537562 825273752 825073302
1984.5 825073302 824963450 824775100 824501991 824321449 824189484 823938489 823638499 823440850 823274016 823008180
2004.9 823008180 822680354 822419882 822191298 821874619 821528137 821266592 821034193 820704460 820360243 820117056
2025.3 820117056 819892168 819579661 819275618 819064975 818812370 818433285 818083584 817879379 817668438 817373157
2045.7 817373157 817132115 816958666 816699147 816388726 816184103 816034317 815774918 815467417 815314710 815233052
2066.1 815233052 815045059 814848363 814760625 814665020 814486146 814362466 814365089 814288020 814043880 813879907
2086.5 813879907 813842237 813706160 813475251 813390374 813433111 813367307 813222647 813214302 813274443 813190460 813077271
2108.9 813077271 813125730 813183844 813077807 812998176 813111305 813237727 813234806 813266993 813412428 813503027 813520074
2131.3 813520074 813621342 813803196 813882053 813897312 814042568 814243793 814337015 814403713 814578950 814775527
2151.7 814775527 814867139 814955533 815166712 815381289 815483451 815585613 815789878 815990508 816116929 816292465 816554308
2174.2 816554308 816751063 816841424 816991210 817221165 817346632 817383707 817543983 817783952 817872345 817865729
2194.6 817865729 817979634 818137527 818154693 818155169 818298042 818415284 818380415 818388760 818526983 818588972 818545222
2217 818545222 818609297 818757176 818771720 818703532 818772256 818906724 818869770 818728626 818715692 818772376 818718851
2239.4 818718851 818637848 818652511 818625271 818469167 818373322 818417132 818388760 818213701 818119943 818169057 818148196
2261.9 818148196 818040371 818054378 818145752 818112910 818066120 818186343 818348289 818387985 818421185 818576455 818723142
2284.3 818723142 818747938 818789840 818925023 818997025 818988383 819069922 819228709 819291949 819290817 819365382 819462478
2306.7 819462478 819466889 819476068 819651127 819841802 819845676 819802940 819889963 820033193 820127606 820192754 820338786
2329.2 820338786 820522964 820587814 820624053 820736170 820837200 820927441 821165800 821599126 821942151 821948409
2349.6 821948409 821763456 821692467 821787179 821887672 822016418 822265029 822577178 822953045 823326349 823636711
2370 823636711 823941946 824266315 824617624 824972570 825330555 825708330 826034427 826226413 826320648 826395035
2390.4 826395035 826484144 826600015 826732635 826826572 826879084 826946497 827025533 827074409 827094615 827118695 827139437
2412.8 827139437 827152431 827155352 827120662 827040613 826935351 826828361 826731563 826646864 826580703 826549828 826509774
2435.2 826509774 826427102 826348424 826276958 826176524 826056242 825958192 825886786 825792730 825678170 825606763 825545788
2457.7 825545788 825407684 825232744 825119078 825020730 824848533 824655056 824517310 824402690 824249268 824087024
2478.1 824087024 823950708 823796093 823626697 823505044 823397458 823221147 823025525 822908461 822799265 822592735
2498.5 822592735 822376668 822232842 822079062 821891665 821740746 821601450 821402609 821173489 821005344 820903659
2518.9 820903659 820778012 820604742 820447743 820310235 820127130 819934130 819803357 819664538 819463134 819274127
2539.2 819274127 819130003 818939924 818699837 818536937 818433702 818260133 818020344 817821741 817664206 817441702
2559.6 817441702 817180872 817017674 816902101 816665232 816332042 816045165 815787673 815442264 815065384 814771116
2580 814771116 814479649 814098239 813698649 813316703 812873900 812392175 811975241 811594367 811131656 810602427
2600.4 810602427 810116649 809626520 809050918 808487177 807994962 807479084 806881130 806287885 805751204 805174112
2620.8 805174112 804557621 804001093 803461671 802835166 802166343 801578939 801056862 800504744 799944401 799423516
2641.2 799423516 798893809 798316002 797724843 797157645 796604872 796066880 795564592 795071006 794515610 793906569
2661.6 793906569 793346286 792834878 792287886 791726291 791217208 790718138 790150464 789544463 788977861 788407087
2682 788407087 787749588 787082076 786501825 785959780 785362661 784702539 784016728 783318043 782623053 781931937
2702.4 781931937 781238616 780544877 779832602 779095471 778348148 777585566 776818156 776091754 775382459 774623871
2722.8 774623871 773840666 773080409 772327423 771574080 770857036 770205379 769546568 768784404 767992496 767283976
2743.2 767283976 766593218 765854061 765165806 764537156 763805389 762962341 762145162 761344671 760483146 759603202
2763.6 759603202 758760750 757908285 756980181 756009698 755072415 754113495 753071487 752024531 751000583
2782 751000583 749937773 748824298 747718334 746611893 745411277 744106889 742797017 741527557 740194976
2800.3 740194976 738756657 737321436 735906959 734426439 732879639 731322587 729725122 728057921
2816.6 728057921 726379156 724698186 722952008 721106589 719177008 717184603 715086997 712804854
2832.9 712804854 710295856 707496941 704257309 700393081 695775986 690397680 684634268 679403126
2849.3 679403126 675539017 673059046 671413183 670153797 668991983 667560339 665539622 662900925
2865.6 662900925 659841537 656626344 653555691 650831759 648482084 646448374 644616008 642851949
2881.9 642851949 641045809 639104724 636982441 634713948 632333994 629827201 627229929 624600589
2898.2 624600589 621918321 619124353 616155326 612927139 609304905 605096877 600256622 595142841
2914.5 595142841 590314031 586108267 582631409 579907477 577909589 576643646 576091945 576102495 576630652
2932.9 576630652 577798784 579625070 582002282 584785163 587714076 590401053 592503905 593910456
2949.2 593910456 594733179 595081568 595089078 595066726 595277369 595784247 596519530 597406745 598398387 599410772
2969.6 599410772 600414932 601428926 602411330 603380620 604377747 605327427 606196046 606993318 607681215
2987.9 607681215 608273208 608689427 608720124 608368456 607756019 606910348 605887949 604728699 603485703
3006.3 603485703 602288246 601163507 599977612 598617136 597079635 595401585 593619168 591791809
3022.6 591791809 589921415 587968707 586015582 584101617 582167447 580132902 577942014 575706661
3038.9 575706661 573481321 571157217 568715692 566227674 563746214 561262965 558718145 556117952
3055.3 556117952 553523362 550964475 548470557 546076477 543758333 541409075 538970530 536515653
3071.6 536515653 534140170 531881690 529662430 527335048 524875164 522378922 519909084 517488062
3087.9 517488062 515073657 512564600 509982824 507432222 504924893 502380371 499730676 497016102
3104.2 497016102 494309992 491595268 488790542 485964954 483221173 480439782 477510452 474408984
3120.5 474408984 471156210 467904031 464752793 461662263 458543539 455317944 452038616 448811501
3136.8 448811501 445588857 442232579 438761562 435308278 431916654 428585947 425271958 421847790
3153.2 421847790 418267667 414651781 411069125 407494843 403934211 400389254 396863729 393366724
3169.5 393366724 389863640 386329859 382809311 379315615 375838727 372384816 368938088 365502596
3185.8 365502596 362099349 358732879 355398566 352060109 348713934 345426321 342208952 339032412
3202.1 339032412 335894763 332821965 329794556 326786846 323813915 320849359 317908257 315031618
3218.4 315031618 312223077 309477478 306772649 304113179 301520139 298994690 296515673 294006556
3234.7 294006556 291465312 289002329 286643058 284352601 282133162 279960871 277776361 275583088
3251.1 275583088 273430735 271323979 269219190 267137289 265124321 263130039 261123538 259168386
3267.4 259168386 257295638 255431771 253521055 251588047 249668926 247781307 245917335 244051084
3283.7 244051084 242187127 240356550 238601029 236894384 235142708 233354226 231567800 229800701
3300 229800701 228088766 226414219 224709839 222954944 221184582 219418839 217669621 215967610 214331925
3318.4 214331925 212748989 211211085 209684119 208089158 206451789 204887956 203393400 201947004
3334.7 201947004 200609133 199315131 197932795 196476325 195028871 193692252 192517579 191313073
3351 191313073 189936072 188551992 187341243 186275184 185232639 184211150 183315068 182514951 181648135
3369.3 181648135 180634618 179622620 178810030 178159565 177564994 176973552 176437691 176101387 176040813
3387.7 176040813 176168516 176206753 175984487 175738767 175824761 176168472 176327109 176169664 176114485 176408067
3408.1 176408067 176868483 177321553 177696124 178005472 178433448 179028332 179619208 180286884 181234971 182402238
3428.5 182402238 183543488 184718430 186048433 187236354 188112095 188994378 190157369 191590279 193177268
3446.8 193177268 194699362 196204513 197856247 199613661 201496452 203568444 205630735 207635432
3463.2 207635432 209911272 212405473 214599997 216351777 218160197 220343962 222842813 225403711
3479.5 225403711 227733761 230001926 232542992 235178649 237701386 240325019 243172616 246153787
3495.8 246153787 249029726 251819730 254754245 257643402 260309041 263107449 266279489 269699454
3512.1 269699454 273087859 276278824 279506236 282981783 286727875 290425539 293862283 297398567
3528.4 297398567 301228464 305164218 309221178 313380569 317423761 321578354 326063097 330674797
3544.7 330674797 335008413 339090705 343388438 348010957 352685213 357432693 362420887 367425293
3561.1 367425293 372174710 377061695 382907063 388985485 394386679 399673492 405330092 411246687
3577.4 411246687 417354763 423632205 429839343 436124504 442891598 449635059 455871701 462338120
3593.7 462338120 469364226 476519883 483635992 490708023 497518033 504193664 511441946 519003332
3610 519003332 526389301 533809125 541024506 548615873 556961536 564451754 570750058 576944649 584834993
3628.4 584834993 593674064 600848734 607545078 614384711 621047497 627619267 633856356 639451981
3644.7 639451981 645105004 652365804 659949124 665344000 670024931 675645113 681134522 685755968
3661 685755968 690014601 693952322 697505951 701425910 705682576 708992779 712498724 716528296 719684899
3679.4 719684899 722407103 725036442 727512479 730278194 733439684 736086488 738140464 740067065
3695.7 740067065 741856575 743508518 745366514 747227311 748638451 749830306 751244605 753007531
3712 753007531 754552007 755603969 756540358 757542670 758498788 759438872 760491729 761439443 762082577
3730.3 762082577 762744367 763775408 765193403 766397595 766818404 766813993 767444193 768484414 769017637
3748.7 769017637 769767344 770926356 771733642 772231996 772813261 773480535 773971260 774445653 774956286
3767.1 774956286 775467038 776128948 776701331 777049839 777433217 777968884 778413117 778664827 778985262 779413521
3787.5 779413521 779829144 780181825 780388772 780597866 780842721 780980885 781423211 781983614 782205701 782574534
3807.8 782574534 783032238 783217847 783235371 783420622 783639371 783674777 784059942 784498930 784715712 784900546
3828.2 784900546 784957349 785002351 785176694 785347283 785483778 785667539 785922706 786259234 786516607 786489844
3848.6 786489844 786046565 785628200 786172926 786825418 786957026 786843419 786828578 787085235 787184775 787075222
3869 787075222 787205875 787459970 787717223 787764430 787600696 787683487 787853718 788003385 788140297 788044214
3889.4 788044214 788069725 788329720 788352549 788089097 787832379 787791252 787952065 788213015 788370907 788376033
3909.8 788376033 788364708 788348198 788290322 788294852 788392186 788421750 788423836 788505554 788537204 788504362 788581014 788744867
3934.3 788744867 788781941 788711786 788697839 788771212 788843989 788876653 788968623 789112568 789156079 789151549 789216459
3956.7 789216459 789261043 789250910 789294600 789412737 789543748 789671600 789828897 789990008 790108681 790209115
3977.1 790209115 790315926 790450215 790582180 790617466 790581107 790601134 790754557 790983081 791169167 791290522
3997.5 791290522
##END=$$ End of the data block
