##TITLE=$$ Begin of the data block
##JCAMP-DX=5.00 $$ ACD/SpecManager v 10.08
##SPECTROMETER/DATA SYSTEM=Alpha
##DATE=10 Apr 2014 09:27:12
##DATA TYPE=INFRARED SPECTRUM
##DATA CLASS=XYDATA
##ORIGIN=
##OWNER=
##NPOINTS=1765
##FIRSTX=399.75695801
##LASTX=3997.56933594
##MAXX=3997.56933594
##MINX=399.75695801
##MAXY=0.82948452
##MINY=0.17596030
##XFACTOR=1.0000000000
##YFACTOR=1.000000000000000e-9
##FIRSTY=0.53585041
##DELTAX=2.03957629
##XUNITS=1/CM
##YUNITS=ARBITRARY UNITS
##XYDATA=(X++(Y..Y))
399.8 535850406 534923315 533211231 531078637 529575586 528251767 526396930 525102973 525078177 524726212
418.1 524726212 522879839 521893561 522319436 522075117 520768046 520264864 520301878 519112408 517499208
436.5 517499208 517086864 517003298 516152561 515688598 516064525 515693903 514667332 514411509 514398336 513330460
456.9 513330460 512152374 511933386 511149287 509320855 508077323 507610679 506445646 504666984 503709853
475.2 503709853 503017187 501428008 500001371 499736965 499323636 498004079 497056156 496656358 495343059
493.6 495343059 493339509 492182940 491547763 490111381 488511741 487906724 487370223 485882163 484304607
511.9 484304607 483443379 482375622 480455071 478708386 477499247 475808024 473497868 471652180 470226556
530.3 470226556 468427747 466708124 465701461 464750946 463444024 462531716 462187678 461452156 460081279
548.6 460081279 459000707 458269924 456943691 455096871 453548133 452117264 450044066 447473586 445020467
567 445020467 442462027 439448595 436501950 433972955 431465894 428766876 426181734 423812807 421184510
585.4 421184510 418293476 415739805 413370848 410493076 407395601 404850215 402410120 399236292
601.7 399236292 396005452 394042164 393250555 392731041 392249227 392023236 392414391 394304901 398150891
620 398150891 402960092 407462895 411476791 415710270 420189261 424181372 427623898 431077152 434031725
638.4 434031725 435392559 435484469 436085492 438375324 441436231 443539500 443516850 441710889 441616952
656.7 441616952 446768552 455224574 462332726 466698676 470708042 475855827 479308128 481982559
673.1 481982559 485425234 488893598 491621733 494206280 497043997 499398172 501006067 502724230
689.4 502724230 504707634 506008387 506636500 507558942 508795857 509742379 510876477 512954473 515456557
707.7 515456557 517612100 519917905 522954941 525932670 528270185 530805528 533939183 536774516
724 536774516 539153337 541783512 544584811 546812356 548537195 550482213 552466631 553961575 555452764
742.4 555452764 557514012 559625804 561355114 563262165 565633118 567822516 569681764 571878493
758.7 571878493 574431896 576710463 578661859 580783367 582904875 584378541 585257292 585937738 586093485 585351229
779.1 585351229 584194601 583133399 582113385 581291437 581456959 583129466 586111248 590278745 595978975
797.5 595978975 602988124 610237777 617148817 623816788 629949510 634885669 638708353 641965926
813.8 641965926 644439936 645497024 645263553 644116580 641633332 637462318 632383645 627221107 621801853
832.1 621801853 616092145 610784471 606123805 601588488 597071648 593227863 590510309 589216948
848.5 589216948 590302050 594574809 601641297 610640585 621182561 632846594 644570053 655516744
864.8 655516744 665691257 674937665 682557762 688451886 693223536 696935356 699148297 699944139
881.1 699944139 699802458 698684394 696395159 693501830 690763652 688423455 686746836 686334968 687331915
899.4 687331915 689153194 691308856 693636835 695653141 696589589 696174860 694521248 691483200 686994016
917.8 686994016 681736887 676726460 672559559 669654012 668478131 668976367 670361221 671841145 673159897
936.2 673159897 674281716 675061107 675450504 675540864 675168812 673952043 671686590 668285012 663569033
954.5 663569033 657368302 649604023 640237153 629101634 615979791 600882530 584147811 566491187
970.8 566491187 548955977 532707155 518572450 506677747 496676356 488112867 480547756 473669678
987.1 473669678 467369407 461711317 456792772 452596337 449079722 446225524 443870217 441595376
1003.5 441595376 438817978 435047626 430070937 423953503 417094350 410073161 403258264 396801442
1019.8 396801442 390886098 385559857 380639344 376045763 371867746 368156880 364850193 361898273
1036.1 361898273 359332025 357097298 354990304 352878839 350759476 348578244 346339107 344419688
1052.4 344419688 343404800 343584150 344874233 346888721 348915219 350013077 349434882 347009748 343084067
1070.8 343084067 338246644 333093047 328079313 323364913 318807274 314125270 309054434 303423136
1087.1 303423136 297331095 291288555 286146224 282712728 281244516 281457990 282836109 284812748
1103.4 284812748 286847740 288577825 289783835 290237635 289612114 287441671 283240348 276895672 269678414
1121.8 269678414 264524221 263488173 265350103 267398924 268060356 267591864 267614365 269439459 272922277
1140.1 272922277 277076751 281039476 284384102 287099719 289415628 291615069 293964416 296761543
1156.4 296761543 300329685 304951042 310907662 318453163 327556491 337748826 348451883 359239608
1172.7 359239608 369758844 379654825 388767689 397082508 404293209 409873158 413510412 415136248
1189.1 415136248 414832294 413067877 410873234 409435570 409510851 411412269 415091783 419935793 424934179
1207.4 424934179 429321796 432881564 435565948 437394738 438706517 439917713 441132575 442292303
1223.7 442292303 443578005 445276737 447315693 449481666 451915175 454750955 457693249 460493654
1240.1 460493654 463233471 465810359 467837125 469222128 470233470 470993072 471477687 471965730 472925425
1258.4 472925425 474512935 476696461 479690135 483669847 488354087 493465453 499085844 505196273
1274.7 505196273 511453748 517665029 524055302 530752897 537524164 544324756 551344633 558376729
1291 558376729 564956188 571056128 576868713 582160711 586620152 590430677 593886673 596829593 599088609
1309.4 599088609 600983202 602740645 604153872 605282724 606588304 608223677 609945357 611691236
1325.7 611691236 613543987 615229368 616308749 616753936 616911113 616945446 616863370 616941333 617433488 618220270
1346.1 618220270 619012773 619703472 620273352 620550990 620407879 620015860 619417787 618279636 616589725
1364.5 616589725 614776373 612976491 611203253 609315932 607100427 604520142 600962341 595571160
1380.8 595571160 589470744 585721493 585448384 586257041 586124241 584992290 582874060 580030799 576551080
1399.1 576551080 572673738 568573833 564112127 560027957 556593359 553492725 550964952 549154341
1415.5 549154341 547552228 545903087 544851243 544385672 544046044 543767393 543631434 543778062 544253290
1433.8 544253290 545174360 546768963 548617661 550631404 552904904 555664718 559130251 563043833
1450.1 563043833 567221761 572080195 579538107 589782059 598005533 605086029 613409996 622188568
1466.4 622188568 629920304 638196468 648991346 659598112 667524338 673607886 678320169 681882858
1482.8 681882858 684283137 685594738 685556471 684255302 682549298 680147707 676202893 671550453 667353153
1501.1 667353153 663441658 658126473 649058461 640915751 634746075 628635645 622806191 617720187
1517.4 617720187 613642573 609524846 605533242 602061629 598400176 595173717 592282236 589008808
1533.7 589008808 586280286 584363103 582102716 579877377 578713655 578278005 578508914 579283953 580424666
1552.1 580424666 581800699 583226144 584447980 584974706 584746301 583786428 581978321 578969896 574558496
1570.5 574558496 570083201 564867973 557040513 549244761 542293906 534509718 526136577 517576993
1586.8 517576993 508788168 499838859 490986705 482236087 473790258 465751380 457886577 450148225
1603.1 450148225 442709297 435445249 428061098 420943260 414482743 407528132 399264157 392754376
1619.4 392754376 387421310 381163299 375174731 370046616 365491539 362135082 359508455 356673330
1635.7 356673330 354886919 354610533 355136365 356199265 358028024 360651433 363143563 366438866 371889353
1654.1 371889353 376661479 381072909 386497140 393396288 401010573 408010989 416014135 425815493
1670.4 425815493 434836984 444392651 455227673 465064943 474282593 485204250 500197887 513392508
1686.7 513392508 524218321 535732329 546452999 558263958 571965575 585948348 601824999
1701 601824999 614422321 624876976 635681689 644739449 652342200 659281015 666045427 673275113
1717.3 673275113 679393411 683802724 687964737 692376673 696683288 701027930 705299377 710326374
1733.6 710326374 715524316 719610214 724060416 729018688 733876944 738772929 743755519 748959422
1749.9 748959422 754081130 758346200 762152255 765734434 768940806 772140861 774865448 777059019
1766.3 777059019 779287696 781541526 783697188 785726547 787569940 789336503 791022122 792716265
1782.6 792716265 794533014 796195507 797494233 798826516 800548851 802002668 803067923 804234743
1798.9 804234743 805566430 806685984 807631552 808698356 809731483 810513556 811222494 812084436 812877774
1817.2 812877774 813470364 814107120 814919531 815651894 816168070 816816747 817611039 818136454 818497062 819088101
1837.6 819088101 819747329 820147812 820520163 821162522 821711302 822005630 822339177 822852314 823302686 823535681
1858 823535681 823849916 824336410 824701250 824879467 825182378 825650275 825920582 826053798 826333761 826673448
1878.4 826673448 826822519 826921940 827188909 827481687 827620029 827758908 828011096 828192592 828251064 828381538
1898.8 828381538 828622222 828747392 828753769 828871727 829084456 829151511 829096735 829159677 829322875 829380572 829331458
1921.3 829331458 829381764 829484522 829410493 829291999 829351783 829410255 829267204 829157054 829197526 829103768 828820646
1943.7 828820646 828643680 828593314 828447163 828203559 828057289 827982962 827752948 827445924 827297390 827208042
1964.1 827208042 826985359 826742589 826627672 826492727 826214910 825956404 825840473 825697064 825453937 825265050
1984.5 825265050 825143695 824931622 824656546 824491799 824374437 824128926 823809803 823586345 823415697 823162377
2004.9 823162377 822854042 822605193 822378576 822074473 821740568 821464300 821200132 820861578 820529580 820289671
2025.3 820289671 820039153 819699883 819398522 819170058 818894625 818561375 818290949 818116605 817886472 817558587
2045.7 817558587 817272425 817074895 816830337 816540539 816350400 816204667 815948188 815649390 815484941 815374076
2066.1 815374076 815172017 814978898 814922869 814869821 814676523 814502835 814485073 814421713 814199209 814039648
2086.5 814039648 814009249 813898444 813676834 813577652 813607037 813522816 813368738 813392043 813465059 813334227 813181221
2108.9 813181221 813222528 813278735 813187301 813137710 813262343 813399255 813423753 813473463 813621402 813706696 813728631
2131.3 813728631 813850164 814029992 814090252 814098179 814245641 814459145 814556718 814623296 814806700 814985275
2151.7 814985275 815038979 815113425 815323353 815528929 815626264 815730572 815940380 816147745 816277325 816462219
2172.1 816462219 816745222 816960037 817055643 817188740 817385495 817489922 817511320 817647636 817867756 817957461
2192.5 817957461 817978680 818116546 818269372 818277955 818295598 818468928 818602979 818555236 818548739 818714380 818811595
2215 818811595 818769097 818810701 818939269 818954587 818882942 818929493 819039583 818999410 818888962 818899214 818944693
2237.4 818944693 818879604 818809211 818847239 818833232 818673849 818569243 818602085 818569779 818389654 818260193 818262756
2259.8 818262756 818237841 818175375 818228841 818315566 818286359 818287373 818430126 818552017 818564296 818632841 818831623
2282.3 818831623 818971097 818967760 818999648 819123268 819180012 819174945 819279790 819457591 819527984 819549739 819654167
2304.7 819654167 819765389 819794953 819826066 819983304 820165873 820180297 820142508 820270240 820441663 820476472
2325.1 820476472 820491135 820664763 820887625 820997059 821063817 821111619 821133018 821219206 821497977 821974695
2345.5 821974695 822340071 822387934 822256207 822148144 822103441 822134137 822339654 822616935 822866857 823244095
2365.9 823244095 823671341 823991835 824255645 824555695 824900210 825234771 825567245 825934768 826262295 826454759
2386.3 826454759 826566875 826660752 826737821 826824367 826932549 827027440 827095807 827159286 827217579 827270448 827319860
2408.7 827319860 827350855 827363014 827379882 827374756 827309132 827211320 827115893 827017426 826917410 826843619 826808453
2431.2 826808453 826799870 826758265 826665998 826589584 826521456 826402664 826273620 826197445 826143324 826050878 825941384
2453.6 825941384 825881779 825818360 825647175 825437546 825320661 825234532 825076699 824901998 824771345 824654758
2474 824654758 824511588 824358821 824213624 824052811 823888659 823763549 823640823 823453069 823238790 823082089
2494.4 823082089 822963476 822799802 822623909 822492242 822351456 822172225 821990013 821847200 821712852 821521461
2514.8 821521461 821330607 821169138 820959866 820750535 820620775 820506752 820334017 820144951 820008874 819888949
2535.2 819888949 819720268 819527745 819353342 819168150 818977594 818851471 818766594 818604350 818353355 818128586
2555.6 818128586 817951500 817743838 817499340 817301571 817125022 816857934 816549361 816293120 816029429 815678835
2576 815678835 815321386 815033674 814727008 814345479 813947976 813562691 813142896 812698424 812306523 811914563
2596.4 811914563 811392367 810816348 810339153 809870839 809292376 808726728 808263004 807766318 807155490 806543767
2616.8 806543767 805991173 805392861 804749787 804188967 803679645 803073347 802407861 801832080 801323891 800796092
2637.1 800796092 800255954 799720883 799159586 798551500 797936261 797356963 796798944 796248257 795726061 795239925
2657.5 795239925 794735134 794174612 793613493 793077767 792549431 792044818 791560769 791043401 790456295 789827704
2677.9 789827704 789225936 788642347 787993968 787326634 786742389 786199093 785603285 784949362 784270346 783562779
2698.3 783562779 782836080 782135904 781464040 780781209 780080676 779362917 778617859 777836084 777048051 776310921
2718.7 776310921 775618732 774912417 774160624 773402512 772652566 771879792 771121919 770440698 769789696 769058764
2739.1 769058764 768275321 767560065 766891658 766194165 765511215 764838696 764065802 763204873 762372255 761573434
2759.5 761573434 760740638 759892166 759065449 758218169 757297456 756351888 755439460 754488349 753450692
2777.9 753450692 752398610 751366496 750298858 749171138 748051941 746949553 745752811 744431973
2794.2 744431973 743106782 741840422 740522504 739106715 737696886 736294627 734812737 733252048
2810.5 733252048 731670499 730069816 728413284 726725042 725023091 723248303 721378624 719470382
2826.8 719470382 717517674 715416789 713101089 710569918 707778811 704555213 700682104 696065366
2843.1 696065366 690712750 684942245 679688394 675824642 673347652 671704352 670445442 669272006
2859.5 669272006 667832732 665840864 663258135 660224378 656980932 653866589 651136160 648807406
2875.8 648807406 646781445 644938529 643173456 641383588 639437854 637286067 634987235 632597566
2892.1 632597566 630126059 627559423 624903917 622193873 619412959 616461456 613239527 609611750
2908.4 609611750 605391920 600568593 595467329 590591729 586344481 582893074 580217361 578244925
2924.7 578244925 576966763 576395571 576422632 576973557 578135133 579936802 582299113 585077226 587989509
2943.1 587989509 590661764 592768371 594174445 594988585 595346808 595376611 595374644 595614076 596138418 596848667
2963.5 596848667 597692907 598677635 599718690 600736916 601728261 602698088 603692889 604703844 605630875
2981.8 605630875 606481314 607314408 608054578 608660340 609087884 609115243 608720541 608075261 607226133 606211662
3002.2 606211662 605066717 603847623 602668941 601538658 600336730 598969817 597442508 595792055
3018.5 595792055 594032466 592198014 590315104 588371277 586413443 584478021 582536221 580486536
3034.9 580486536 578264177 576023698 573845088 571597219 569205344 566690683 564153671 561654389
3051.2 561654389 559125781 556553721 553964734 551385164 548886657 546503544 544185698 541842878
3067.5 541842878 539437830 537015259 534646869 532370985 530129731 527799249 525338888 522830367
3083.8 522830367 520336807 517867208 515437901 512997508 510479808 507930160 505405605 502844393
3100.1 502844393 500169992 497433335 494718552 492016405 489225864 486388862 483620077 480828851
3116.4 480828851 477911800 474833131 471598864 468353570 465206057 462113291 458983839 455750495
3132.8 455750495 452478528 449262321 446030945 442654580 439156145 435673952 432275653 428957403
3149.1 428957403 425664872 422271639 418685019 415003210 411371887 407811314 404300958 400791436
3165.4 400791436 397241741 393697292 390181690 386649966 383106291 379587173 376132280 372718543
3181.7 372718543 369286388 365863889 362488121 359138936 355780154 352415770 349079609 345795423
3198 345795423 342569917 339402050 336266041 333158106 330096841 327088773 324134767 321201712 318271965
3216.4 318271965 315392047 312619537 309906632 307184219 304457903 301768303 299194634 296749622
3232.7 296749622 294308215 291826159 289390892 287013263 284691662 282468885 280315310 278131336
3249 278131336 275905967 273747534 271685123 269618541 267516077 265437007 263394266 261384517 259447902
3267.4 259447902 257606506 255766243 253851652 251903325 249950394 248015627 246125057 244266540
3283.7 244266540 242428482 240639433 238927707 237233281 235474467 233649909 231794223 229974970
3300 229974970 228278846 226690561 225070417 223324373 221491218 219642624 217851877 216203168 214659914
3318.4 214659914 213077113 211459041 209896877 208331481 206732601 205180496 203660652 202203363
3334.7 202203363 200910658 199641198 198204145 196704492 195290238 194004342 192818403 191576079
3351 191576079 190213338 188848332 187620074 186527878 185470581 184465036 183631107 182896659 182022423
3369.3 182022423 180952132 179904461 179076657 178418100 177835897 177261055 176721901 176363960 176252931
3387.7 176252931 176334605 176388815 176198214 175960302 176072896 176442176 176568478 176357642 176299885 176625207
3408.1 176625207 177099183 177542537 177902296 178212106 178654656 179277554 179933578 180673108 181620404 182717487
3428.5 182717487 183797821 184939876 186257154 187458724 188319072 189167634 190370858 191855073 193411738
3446.8 193411738 194915056 196439251 198091209 199896291 201862291 203922182 205892727 207859293
3463.2 207859293 210151196 212665305 214925766 216758177 218593389 220757335 223225087 225763470
3479.5 225763470 228074804 230326161 232847348 235455111 237974286 240637928 243487597 246413022
3495.8 246413022 249285936 252114892 255046815 257901430 260545075 263379902 266640663 270129085
3512.1 270129085 273502737 276589453 279715747 283205450 287057310 290823460 294253379 297739029
3528.4 297739029 301510245 305443317 309541255 313710958 317726344 321882278 326372862 330936551
3544.7 330936551 335270196 339426816 343746901 348361462 353078097 357831568 362772852 367790878
3561.1 367790878 372574210 377432674 383234710 389320403 394764632 400064766 405688792 411591172
3577.4 411591172 417715639 423974037 430136651 436423570 443228304 449999213 456261575 462746620
3593.7 462746620 469754815 476878524 484046727 491247833 498112589 504764736 512032151 519673109
3610 519673109 527100563 534441292 541546047 549104333 557441473 564928174 571253836 577425718 585243881
3628.4 585243881 594158590 601473987 608203590 614972711 621553600 628100753 634311080 639845014
3644.7 639845014 645461619 652731597 660360992 665790319 670476437 676132262 681677580 686304510
3661 686304510 690540791 694475532 697985709 701804399 706050456 709452331 713029265 717037737 720154881
3679.4 720154881 722880304 725513697 727988660 730775833 733951032 736592114 738653362 740579724
3695.7 740579724 742334068 743934333 745772779 747681022 749133766 750256479 751561344 753322899
3712 753322899 754906595 755988359 756989956 758047283 758966863 759804666 760765851 761674166 762342751
3730.3 762342751 763079584 764218688 765698373 766842842 767167866 767083228 767655253 768730104 769325495
3748.7 769325495 770030022 771124482 771982968 772547185 773135424 773827612 774380505 774870217 775340199
3767.1 775340199 775849640 776599944 777253926 777593672 777944267 778500438 778944552 779128373 779407561 779860973
3787.5 779860973 780311048 780665576 780829370 780999303 781247437 781369627 781765580 782352746 782688677 783167958
3807.8 783167958 783611536 783661127 783547044 783750415 784084797 784151852 784523308 784961283 785153389 785333157
3828.2 785333157 785412908 785463095 785635173 785827398 785977602 786170363 786458611 786784232 786953092 786817610
3848.6 786817610 786302984 785901606 786563993 787300825 787440658 787323713 787335575 787603498 787683129 787525952
3869 787525952 787609339 787876368 788135946 788170159 788054109 788203716 788404226 788592637 788754165 788627505
3889.4 788627505 788587093 788770676 788767993 788565338 788365006 788254917 788324833 788584709 788778603 788834453
3909.8 788834453 788876712 788887143 788858891 788911700 788982153 788908899 788833976 788905561 788981378 789023399 789184451
3932.3 789184451 789390624 789388299 789225399 789157093 789268076 789379299 789378107 789410651 789520800 789576530 789613545
3954.7 789613545 789693475 789749801 789833307 789992094 790126681 790238678 790380716 790484607 790539086 790652215
3975.1 790652215 790794730 790861130 790945351 791108847 791197598 791193068 791238070 791364133 791505337 791617751 791699350
3997.5 791699350
##END=$$ End of the data block
