##TITLE=$$ Begin of the data block
##JCAMP-DX=5.00 $$ ACD/SpecManager v 10.08
##SPECTROMETER/DATA SYSTEM=Alpha
##DATE=10 Apr 2014 09:27:12
##DATA TYPE=INFRARED SPECTRUM
##DATA CLASS=XYDATA
##ORIGIN=
##OWNER=
##NPOINTS=1765
##FIRSTX=399.75695801
##LASTX=3997.56933594
##MAXX=3997.56933594
##MINX=399.75695801
##MAXY=0.82953507
##MINY=0.17596023
##XFACTOR=1.0000000000
##YFACTOR=1.000000000000000e-9
##FIRSTY=0.53380132
##DELTAX=2.03957629
##XUNITS=1/CM
##YUNITS=ARBITRARY UNITS
##XYDATA=(X++(Y..Y))
399.8E33801317m48704j252830j926243j211345j042068j879037j328289J62482k31206
418.1E24644077j720667n83112M31895n92887j429856o34492k25544j412034j641273
436.5E16836107l15964p5281o85215k32160L20613m97520j130223l36945J27733q21889
456.9E13189256j366913p52330r20176j653254j121760k70009j083791j943708r83178
475.2E03094137n11229j488626j349628p1317m39942j559645j019716l05295j155615
493.6D95193124j847923j136392p41542j520037j571298n31167m73231j470864j661598
511.9D84239072r66907j163721k070189j816064j186728j777440k354920j649022j250357
530.3D70003724j805305j712203q75026q62182j422256j130879m38004o26058j169741
$$ y = [533801317, 533352613, 532099783, 530173540, 528962195, 527920127, 526041090, 524712801, 524875283, 524644077, 522923410, 522340298, 522772193, 522179306, 520749450, 520114958, 519889414, 518477380, 516836107, 516520143, 516444862, 515759647, 515527487, 515848100, 515350580, 514220357, 513883412, 514011145, 513189256, 511822343, 511070013, 510149837, 508496583, 507374823, 507104814, 506021023, 504077315, 503094137, 502582908, 501094282, 499744654, 499673337, 499233395, 497673750, 496654034, 496348739, 495193124, 493345201, 492208809, 491467267, 489947230, 488375932, 487844765, 487371534, 485900670, 484239072, 483272165, 482108444, 480038255, 478222191, 477035463, 475258023, 472903103, 471254081, 470003724, 468198419, 466486216, 465611190, 464749008, 463326752, 462195873, 461757869, 461131811, 459962070]
548.6D59962070j040846q31336j213103j649231j585841j610160k216429k508312k189934
567D45116878k421886l221721l172069k496183k498865k800256k558291k217472k514839
585.4D21215296k888173k658695k545387k909004k908886k485156k605110l225506
601.7C98989379l148198j933694o93529l51668m66227l41148K88248J816988L815294
620C97975445M881948M600823M065007M288763M474371L966660L517478L497899K915204
638.4D34183598J352340P1644M86106K170682L101230K242297m620j913965p8409N357354
658.8D46968257Q520902O991773M308075M018009N289704L638684K740681L412337
675.1D85888422L333449K543837K504557K905846K494514J722514J741052J960993
$$ y = [459962070, 458921224, 458089888, 456876785, 455227554, 453641713, 452031553, 449815124, 447306812, 445116878, 442694992, 439473271, 436301202, 433805019, 431306154, 428505898, 425947607, 423730135, 421215296, 418327123, 415668428, 413123041, 410214037, 407305151, 404819995, 402214885, 398989379, 395841181, 393907487, 393213958, 392862290, 392396063, 392054915, 392343163, 394160151, 397975445, 402857393, 407458216, 411523223, 415811986, 420286357, 424253017, 427770495, 431268394, 434183598, 435535938, 435607582, 436093688, 438264370, 441365600, 443607897, 443603277, 441689312, 441610903, 446968257, 455489159, 462480932, 466789007, 470807016, 476096720, 479735404, 482476085, 485888422, 489221871, 491765708, 494270265, 497176111, 499670625, 501393139, 503134191, 505095184]
691.4E05095184J313090O34492R03189J271307R77934J085937K003967K441645K149642
709.8E17876387K369105L067136K948165K371788K609015L103673K748311K385556
726.1E39479136K730370K836525K165497J714587J973867J933277J411736J453519
742.4E55698514K083004K160072J750886J923144K406895K189637J788318K131819
758.7E72132289K525568K217293J886547K123713K133429J443148Q58486P22527K11358
777.1E86254358p70986j230418j025260r02414q02934J18017J682043L010392M172742
795.4E90505540N652964O915808P231117O967186O667078O077707M928946L873050
811.7F38819396L290236K463341J082719j62185j176059k608299m207373n032062n179286
$$ y = [505095184, 506408274, 507042766, 507945955, 509217262, 510195196, 511281133, 513285100, 515726745, 517876387, 520245492, 523312628, 526260793, 528632581, 531241596, 534345269, 537093580, 539479136, 542209506, 545046031, 547211528, 548926115, 550899982, 552833259, 554244995, 555698514, 557781518, 559941590, 561692476, 563615620, 566022515, 568212152, 570000470, 572132289, 574657857, 576875150, 578761697, 580885410, 583018839, 584461987, 585320473, 586043000, 586254358, 585483372, 584252954, 583227694, 582325280, 581522346, 581640363, 583322406, 586332798, 590505540, 596158504, 603074312, 610305429, 617272615, 623939693, 630017400, 634946346, 638819396, 642109632, 644572973, 645655692, 645493507, 644317448, 641709149, 637501776, 632469714, 627290428]
830.1F27290428n457044n680382n285681m668116m506230m477263l852725k719521
846.4E90643466j253307J084327M227996P034958Q984208J0555684J1687815J1698008
862.7F44663155J0887563J0115266R225965P678330N941748M783273L733516K196312
879.1F99225128P82847r8407j086772k287030k866745k708077k397180j802027m84884
897.4F86276853J017809J874208K176345K289355J950860R10878m01259j626730l006577
915.8F91461742m480302n282760n031824m154623k902806j218736M44234J352369J466573
934.1F71653867J334071J145959P83622M01199J34110l12626j185000k259910l384233
952.5F68311059m715502o242096p809818r428501j1203766j3136625j5090347j6730725
$$ y = [627290428, 621833384, 616153002, 610867321, 606199205, 601692975, 597215712, 593362987, 590643466, 589390159, 590474486, 594702482, 601737440, 610721648, 621277332, 632965147, 644663155, 655550718, 665665984, 674891949, 682570279, 688512027, 693295300, 697028816, 699225128, 700007975, 699909568, 698822796, 696535766, 693669021, 690960944, 688563764, 686761737, 686276853, 687294662, 689168870, 691345215, 693634570, 695585430, 696496308, 696095049, 694468319, 691461742, 686981440, 681698680, 676666856, 672512233, 669609427, 668390691, 668834925, 670187294, 671653867, 672987938, 674133897, 674917519, 675318718, 675452828, 675140202, 673955202, 671695292, 668311059, 663595557, 657353461, 649543643, 640115142, 628911376, 615774751, 600684404, 583953679]
968.8E83953679j7626942j7491102j6206085j4075161j1863768j0049730q591950p527381
985.1D80521560o868601o361723n724400m909575m140169l515333k921462k419352
1001.4D43660945k324343k811998l750384m924685o076127o837666p033289o820470
1017.7D03081983o423413n934447n397469m907161m501015m114300l705740l330738
1034.1C64767700k972036k549827k191425k067238k054602k092570k230674k268344
1050.4C46340984j902789j030117J46747J307845K053380K015441J045466o05673k408743
1068.7C46962541l930926m880935n177200n012154m704386m509896m619331n032002
1085C09095711n606771o101549o070912n137503l423422j466394K57224J438648J994073
$$ y = [583953679, 566326737, 548835635, 532629550, 518554389, 506690621, 496640891, 488048941, 480521560, 473652959, 467291236, 461566836, 456657261, 452517092, 449001759, 446080297, 443660945, 441336602, 438524604, 434774220, 429849535, 423773408, 416935742, 409902453, 403081983, 396658570, 390724123, 385326654, 380419493, 375918478, 371804178, 368098438, 364767700, 361795664, 359245837, 357054412, 354987174, 352932572, 350840002, 348609328, 346340984, 344438195, 343408078, 343554825, 344862670, 346916050, 348931491, 349976957, 349371284, 346962541, 343031615, 338150680, 332973480, 327961326, 323256940, 318747044, 314127713, 309095711, 303488940, 297387391, 291316479, 286178976, 282755554, 281289160, 281546384, 282985032, 284979105]
1103.4B84979105K024829J734853J222044M24564o90490k175539m150421o329507p256090
1121.8B69783348n200565j052320J866907K058029O79523m36932M6045J804232L458113
1140.1B73006380M156440L947824L310830K701461K322823K175927K298445K789616
1156.4B96709746L613740M670233N976587P536382R080410J0172903J0694683J0774255
1172.7C59228939J0499745R896547R114087Q296638P204295N580514L622741J617551
1189.1D15061057l12090j771987k177804j422376P0572J893640L690958M854857M987389
1207.4D24874216M387111L571719K682030J796722J286507J239240J244128J161784
1223.7D42243457J292437J702815K037108K158106K425521K846927K956599K800047
$$ y = [284979105, 287003934, 288738787, 289960831, 290385395, 289694905, 287519366, 283368945, 277039438, 269783348, 264582783, 263530463, 265397370, 267455399, 268134922, 267697990, 267744035, 269548267, 273006380, 277162820, 281110644, 284421474, 287122935, 289445758, 291621685, 293920130, 296709746, 300323486, 304993719, 310970306, 318506688, 327587098, 337760001, 348454684, 359228939, 369728684, 379625231, 388739318, 397035956, 404240251, 409820765, 413443506, 415061057, 414748967, 412976980, 410799176, 409376800, 409447372, 411341012, 415031970, 419886827, 424874216, 429261327, 432833046, 435515076, 437311798, 438598305, 439837545, 441081673, 442243457, 443535894, 445238709, 447275817, 449433923, 451859444, 454706371, 457662970, 460463017]
1240.1D60463017K732396K571732K026320J400590J043915P69735M55796M64827R63658
1258.4D72891986J600206K188742K977550L957361M676462N107104N610764O089658
1274.7E05099833O224453O186724O387413O701231O760359O780862P022381P069230
1291E58232486O612242O085753N786955N301833M504920L867745L473341K936483K265513
1309.4E99067271J886785J755774J439631J142144J307249J636386J693666J718342
1325.7F11647248J870215J708567J071930M39942J68681L9757q5712P8619N00202P85708
1346.1F18225157P80106O96719N96404K92182j45913m10139o33240j155078j667857
1364.5F16578341j779676j794636j797736j911282k238036k581954l533482n372584
$$ y = [460463017, 463195413, 465767145, 467793465, 469194055, 470237970, 471007705, 471463501, 471928328, 472891986, 474492192, 476680934, 479658484, 483615845, 488292307, 493399411, 499010175, 505099833, 511324286, 517511010, 523898423, 530599654, 537360013, 544140875, 551163256, 558232486, 564844728, 570930481, 576717436, 582019269, 586524189, 590391934, 593865275, 596801758, 599067271, 600954056, 602709830, 604149461, 605291605, 606598854, 608235240, 609928906, 611647248, 613517463, 615226030, 616297960, 616737902, 616906583, 616946340, 616860628, 616939247, 617439449, 618225157, 619005263, 619701982, 620298386, 620590568, 620444655, 620034516, 619401276, 618246198, 616578341, 614798665, 613004029, 611206293, 609295011, 607056975, 604475021, 600941539, 595568955]
1380.8E95568955o105900l764391k62081Q36014j35958j167655k151847k845347l450811
1399.1E76520979l852605m104078m452825m050672l413379l098190k544105j836121
1415.5E49169004j621246j643718j013398m30405l29733k88069j43528J51098M82797
1433.8E44332802R33588J584887J809597J975179K241254K743423L476620L937065
1450.1E63034415M176736M814744P392228J0246575Q272469P103324Q340299Q795142
1466.4F22175932P732093Q256316J0767222J0603607P945358O093562M707396L567457
1482.8F81848943K392233J262664p3552j275658j685202k408565l949821m664778m223764
1501.1F67222500l950477n399942r122789q055925o090284o083608n835354n090535
$$ y = [595568955, 589463055, 585698664, 585436583, 586272597, 586136639, 584968984, 582817137, 579971790, 576520979, 572668374, 568564296, 564111471, 560060799, 556647420, 553549230, 551005125, 549169004, 547547758, 545904040, 544890642, 544460237, 544130504, 543842435, 543698907, 543850005, 544332802, 545266390, 546851277, 548660874, 550636053, 552877307, 555620730, 559097350, 563034415, 567211151, 572025895, 579418123, 589664698, 597937167, 605040491, 613380790, 622175932, 629908025, 638164341, 648931563, 659535170, 667480528, 673574090, 678281486, 681848943, 684241176, 685503840, 685430288, 684154630, 682469428, 680060863, 676111042, 671446264, 667222500, 663272023, 657872081, 648749292, 640693367, 634603083, 628519475, 622684121, 617593586]
1517.4F17593586m078626m120350l951013l440261l663659l224492k887309l256678
1533.7E88971198k689243j901746k290546k227068j111687l58939K82824P64668J103819
1552.1E80543280J365840J400948J125395N45204j30654r16719j801372l015160m392147
1570.5E74724615m454255n248607p856905p771731o935298p779121q374989q561910
1586.8E17741799q791089q965552q865863q766323q470356q057088p894605p782430
1603.1D50148493p455379p263750p410019p151813o468236o949425q268445o516278
1619.4C92665148n326092o227851n981058n160064m568249l354370k642721k845675
1635.7C56559068j763254k55585N23358J054973J844108K644002K476812L275275N515814
$$ y = [617593586, 613514960, 609394610, 605443597, 602003336, 598339677, 595115185, 592227876, 588971198, 586281955, 584380209, 582089663, 579862595, 578750908, 578391969, 578674793, 579439461, 580543280, 581909120, 583310068, 584435463, 584980667, 584850013, 583933294, 582131922, 579116762, 574724615, 570270360, 565021753, 557164848, 549393117, 542457819, 534678698, 526303709, 517741799, 508950710, 499985158, 491119295, 482352972, 473882616, 465825528, 457930923, 450148493, 442693114, 435429364, 428019345, 420867532, 414399296, 407449871, 399181426, 392665148, 387339056, 381111205, 375130147, 369970083, 365401834, 362047464, 359404743, 356559068, 354795814, 354540229, 355063587, 356118560, 357962668, 360606670, 363083482, 366358757, 371874571]
1654.1C71874571M835486M419804N425185O907612P617980O997824Q012503R830982
1670.4D25921947R036958R535283J0801881R811372R190768J0885745J4970362J3209939
1686.7E13364255J0839940J1515378J0700405J1761904J3649940J3945938J5892148
1701F01669908J2653172J0503053J0851205R083986P609725O918311O687164P190466
1717.3F73166990O197453M466057M169106M422248M308044M324556M265666N031884
1733.6G10352004N200803M110753M482866M953384M812300M829884M921615N216718
1749.9G48880327N207181M303455L789127L575325L204346L205120K760291K208412
1766.3G77133584K188325K184689K109051K053320J913369J834750J713157J667917
$$ y = [371874571, 376710057, 381129861, 386555046, 393462658, 401080638, 408078462, 416090965, 425921947, 434958905, 444494188, 455296069, 465107441, 474298209, 485183954, 500154316, 513364255, 524204195, 535719573, 546419978, 558181882, 571831822, 585777760, 601669908, 614323080, 624826133, 635677338, 644761324, 652371049, 659289360, 665976524, 673166990, 679364443, 683830500, 687999606, 692421854, 696729898, 701054454, 705320120, 710352004, 715552807, 719663560, 724146426, 729099810, 733912110, 738741994, 743663609, 748880327, 754087508, 758390963, 762180090, 765755415, 768959761, 772164881, 774925172, 777133584, 779321909, 781506598, 783615649, 785668969, 787582338, 789417088, 791130245, 792798162]
1782.6G92798162J769840J639605J307189J348079J748323J476288J063347J170337
1798.9H04321170J338720J105547R27985J053393J021981P98821P43032Q69393P83861
1817.2H12963903N89013O27697P75158O85871M98294O58632Q33571N80847L96848N82039
1837.6H19191873O31988L92795L69370O29365N28634K91943L68595N36740M56572K61605
1858H23659480L22401M53711L37481J53959K75254M71413K97368J53542K84314L29494
1878.4H26738417J27375Q5950K90156L32653J40786J13011K52485J92881M7147J11282
1898.8H28432143K34902J31964J0431J13726K06351O8009n2631M8041J32919L9100
1919.2H29364955l6180Q2910J23382p8976j25349P4983R3281j25825j48893j8239j03116
$$ y = [792798162, 794568002, 796207607, 797514796, 798862875, 800611198, 802087486, 803150833, 804321170, 805659890, 806765437, 807693422, 808746815, 809768796, 810567617, 811310649, 812180042, 812963903, 813552916, 814180613, 814955771, 815641642, 816139936, 816798568, 817632139, 818212986, 818609834, 819191873, 819823861, 820216656, 820586026, 821215391, 821744025, 822035968, 822404563, 822941303, 823397875, 823659480, 823981881, 824435592, 824773073, 824927032, 825202286, 825673699, 825971067, 826124609, 826408923, 826738417, 826865792, 826951742, 827241898, 827574551, 827715337, 827828348, 828080833, 828273714, 828320861, 828432143, 828667045, 828799009, 828809440, 828923166, 829129517, 829197526, 829144895, 829192936, 829325855, 829364955, 829328775, 829411685, 829535067, 829456091, 829330742, 829405725, 829499006, 829373181, 829224288, 829206049, 829102933]
1941.7H29102933k44796j45614l6657j35064k45690j83940j21355k23458k58923j33753
1962.1H27373683j15215k40445k27631r1195j41203l07322k59161q7797j47462k58267
1982.5H25497985j60635q7022k15412l05295j92284j15812k29299l13401k19822j61231
2002.8H23497772k47478l20912k66909k18094k91168l40999k68757k35855l30329l35515
2023.2H20641756k37167k51233l61383l29972k14457k50519l43263k98619j94371k28047
2043.6H17932725l06308k54929j85967k58624l17336k05814j08838k03908k86818j76370
2064H15627813j13725j96696j94430q1301q6546j80006j38819l2067j08004k51770
2084.4H14244449j56462j1385j24812k43187p0929N4061r2685j51694K0743O4313j19150
$$ y = [829102933, 828858137, 828712523, 828675866, 828540802, 828295112, 828111172, 827989817, 827766359, 827507436, 827373683, 827258468, 827018023, 826790392, 826699197, 826557994, 826250672, 825991511, 825903714, 825756252, 825497985, 825337350, 825250328, 825034916, 824729621, 824537337, 824421525, 824192226, 823878825, 823659003, 823497772, 823250294, 822929382, 822662473, 822444379, 822153211, 821812212, 821543455, 821307600, 820977271, 820641756, 820404589, 820153356, 819791973, 819462001, 819247544, 818997025, 818653762, 818355143, 818160772, 817932725, 817626417, 817371488, 817185521, 816926897, 816609561, 816403747, 816294909, 816091001, 815804183, 815627813, 815514088, 815317392, 815122962, 815041661, 814955115, 814775109, 814636290, 814604223, 814496219, 814244449, 814087987, 814076602, 813951790, 813708603, 813637674, 813691735, 813599050, 813447356, 813468099, 813532412, 813413262]
2106.9H13413262j40309M4227N7041q0347j2517J40190O7354m0710P4029J82747P3791
2129.3H13778758j2398R6560J96159J02341L3855J56641K12908R2924O8724J83046
2149.7H14909518J78456O2406Q4937K25126K06769P1228R4533K26438K01642R2745
2170.1H16353798J60694K84910K19167J03712J57773K20656J09673K8253J50561K32875
2190.5H18022072R6321J7405J41323J59859J0848K8611J70648J02281p6473j0132J71423
2212.9H18834186R2089n9426K6226J34945M5776l5643O5505J04010n1677j01745L9220
2235.4H19093466N2750j00970j09256L2068R060j35661q6844L8267n0188j72317q9228
2257.8H18481147J788p4148j17779L3498J28746q106m3571J34170J67370K9147M3034
$$ y = [813413262, 813272953, 813317180, 813374221, 813293874, 813281357, 813421547, 813488901, 813448191, 813522220, 813704967, 813778758, 813766360, 813862920, 814059079, 814161420, 814195275, 814351916, 814564824, 814657748, 814726472, 814909518, 815087974, 815150380, 815235317, 815460443, 815667212, 815738440, 815832973, 816059411, 816261053, 816353798, 816514492, 816799402, 817018569, 817122281, 817280054, 817500710, 817610383, 817638636, 817789197, 818022072, 818118393, 818135798, 818277121, 818436980, 818447828, 818476439, 818647087, 818749368, 818672895, 818662763, 818834186, 818926275, 818866849, 818893075, 819028020, 819073796, 819038153, 819103658, 819207668, 819155991, 819054246, 819093466, 819146216, 819045246, 818935990, 818968058, 818977118, 818841457, 818754613, 818792880, 818742692, 818570375, 818481147, 818482935, 818408787, 818291008, 818324506, 818453252, 818445146, 818401575, 818535745, 818703115, 818732262, 818775296]
2280.2H18775296J81258J54853O318J907R8765R7156N3823J05202J52826O4790N603
2302.7H19697797Q3626J22249K8014N066J60098J85967J4126o55J32501J09076L5644
2325.1H20573509P5936J73688K20537J30713N4360O2644O1750Q4103K37047M25101
2345.5H22099388L46541O7353p6890l3855p510K6583J59741K35855K38717L37064L98398
2367.9H23791385L39865K87772L01838L50594L58045L44277L47971L13163K09093J13428
2388.3H26757431Q3208Q6308P7486P7128R1136R8943J01090Q0764L0518j4425k861
2410.8H27466726L3379L1352n841l6776o8844j01328j04963r9361q5295n2988l1054
2433.2H26945007n0783o3420m1842o5982j36555j47402q7500m6312p0274j11521r4771
$$ y = [818775296, 818956554, 819111407, 819117725, 819119632, 819218397, 819315553, 819369376, 819474578, 819627404, 819692194, 819697797, 819781423, 819903672, 819931686, 819936752, 820096850, 820282817, 820296943, 820296288, 820428789, 820537865, 820573509, 820649445, 820823133, 821043670, 821174383, 821228743, 821291387, 821353137, 821437240, 821674287, 822099388, 822445929, 822513282, 822436392, 822402537, 822395027, 822421610, 822581351, 822817206, 823055923, 823392987, 823791385, 824131250, 824419022, 824720860, 825071454, 825429499, 825773776, 826121747, 826434910, 826644003, 826757431, 826840639, 826926947, 827004433, 827081561, 827172697, 827271640, 827372730, 827453494, 827484012, 827469587, 827466726, 827500105, 827531457, 827525616, 827488840, 827419996, 827318668, 827213705, 827114344, 827029049, 826976061, 826945007, 826894224, 826830804, 826788962, 826722980, 826586425, 826439023, 826351523, 826305211, 826234937, 826123416, 826028645]
2455.6H26028645r1076j71959j82510q1062p9155j67549j69992j18494j05202j42634
2476H24719012j68741j61886j79053j72913j05977q1539j55866k13742j53721j17600
2496.4H23207974j99198k10822j26004j27256j87218j81079j36078j62720k25961j93835
2516.8H21457803j42455j64568j71066j39892j49548k03073j98841j22726j25468k00629
2537.2H19839537j88768j37448j65284k02358j62482j23143j56462j98543j89543j95920
2557.6H18119586k66314k74599j68264j34766k50280l17692k48015k42234l56256l50059
2578H15511107k56538l05712l98934l97086l92437m47393m69625m09364l91901m76539
2598.4H11565578n20289m92692n36978o13928n55873m52399m84646n73039n85973n82695
$$ y = [826028645, 825937569, 825765610, 825583100, 825502038, 825422883, 825255334, 825085342, 824966848, 824861646, 824719012, 824550271, 824388385, 824209332, 824036419, 823930442, 823848903, 823693037, 823479295, 823325574, 823207974, 823008776, 822797954, 822671950, 822544694, 822357476, 822176397, 822040319, 821877599, 821651638, 821457803, 821315348, 821150780, 820979714, 820839822, 820690274, 820487201, 820288360, 820165634, 820040166, 819839537, 819650769, 819513321, 819348037, 819145679, 818983197, 818860054, 818703592, 818505049, 818315506, 818119586, 817853272, 817578673, 817410409, 817275643, 817025363, 816707671, 816459656, 816217422, 815861166, 815511107, 815254569, 814948857, 814549923, 814152837, 813760400, 813313007, 812843382, 812434018, 812042117, 811565578, 811045289, 810552597, 810015619, 809401691, 808845818, 808393419, 807908773, 807335734, 806749761, 806167066]
2618.8H06167066o24418o11782n27621n37991o59943o68168n38409m92811n52296n67615
2639.2H00386012n19395n28753o16491o34253n65529n51820n53846m96805m91261n58973
2659.6G94868886n78522n32270n13851n42879n42403n01990n07116n73933o17683n78940
2680G89379299n59986o43432o63936n98729n98013o32167o25551o18040o69182p24137
2700.4G83046126p16745o86646o93202p17700p30514p43270p67410p80761p50780p16269
2720.8G75742829p22885p39038p37667p44164p48515p16508o75738o83903p40886p60853
2741.2G68472672p12991o96421p25746o92725o51777p40409q50379q42452q17001q47459
2761.6G60895312q56757q38101q50737r16183r60231r29892r62198j055896j042903
$$ y = [806167066, 805542648, 804930866, 804403245, 803865254, 803205311, 802537143, 801998734, 801505923, 800953627, 800386012, 799866617, 799337864, 798721373, 798087120, 797521591, 796969771, 796415925, 795919120, 795427859, 794868886, 794290364, 793758094, 793244243, 792701364, 792158961, 791656971, 791149855, 790575922, 789958239, 789379299, 788819313, 788175881, 787511945, 786913216, 786315203, 785683036, 785057485, 784439445, 783770263, 783046126, 782329381, 781642735, 780949533, 780231833, 779501319, 778758049, 777990639, 777209878, 776459098, 775742829, 775019944, 774280906, 773543239, 772799075, 772050560, 771334052, 770658314, 769974411, 769233525, 768472672, 767759681, 767063260, 766337514, 765644789, 764993012, 764252603, 763402224, 762559772, 761742771, 760895312, 760038555, 759200454, 758349717, 757433534, 756473303, 755543411, 754581213, 753525317, 752482414]
2779.9G52482414r91821j044750j133859j143992j142621j229048j297116j244605
2796.2G43254602j207709j322627j435996j423835j427234j502335j554966j564085
2812.5G31815815j607657j677274j676023j676381j772880j871646j899302j936257
2828.9G17698395k081632k308905k537430k815127l246904l836393m579246n406618
2845.2F90886140n855322n287349l824890k420902j632750j260758j170396j472354
2861.5F67961419k052963k604544k998650l186524l066838k725840k368807k083540
2877.8F46873713j872480j743317j752377j913726k122283k290249k421021k521515
2894.1F30236745k595365k654612k701879k775371k937138l228486l668308m244447
$$ y = [752482414, 751490593, 750445843, 749311984, 748167992, 747025371, 745796323, 744499207, 743254602, 742046893, 740724266, 739288270, 737864435, 736437201, 734934866, 733379900, 731815815, 730208158, 728530884, 726854861, 725178480, 723405600, 721533954, 719634652, 717698395, 715616763, 713307858, 710770428, 707955301, 704708397, 700872004, 696292758, 690886140, 685030818, 679743469, 675918579, 673497677, 671864927, 670604169, 669433773, 667961419, 665908456, 663303912, 660305262, 657118738, 654051900, 651326060, 648957253, 646873713, 645001233, 643257916, 641505539, 639591813, 637469530, 635179281, 632758260, 630236745, 627641380, 624986768, 622284889, 619509518, 616572380, 613343894, 609675586, 605431139]
2910.4F05431139m812181n066394m835964m236221l473341k698899j982450j270890
2926.8E77054799n46515L8862N35548J157820J836836K407551K782702K886236K675653
2945.1E90829492K117991J388550Q02696L62217L9935J8239K55823N14448O74069Q18610
2965.5E97822070R85623J057684J040757J003384R62079R78887J026094R76086Q53002
2983.9F06705666P68780P08998O36577M37498L2544l30686n90563q60870j033664j131534
3004.3F05342746j204133j184166j142561j206696j378060j567602j692593j754463
3020.6E94212472j787841j834094j917065j971960j955509j916289k006650k194524
3036.9E78628540k242744k217591k302289k433955k508879k516985k517819k540231
$$ y = [605431139, 600618958, 595552564, 590716600, 586480379, 583007038, 580308139, 578325689, 577054799, 576508284, 576547146, 577082694, 578240514, 580077350, 582484901, 585267603, 588153839, 590829492, 592947483, 594336033, 595138729, 595500946, 595540881, 595559120, 595814943, 596329391, 597003460, 597822070, 598807693, 599865377, 600906134, 601909518, 602871597, 603850484, 604876578, 605852664, 606705666, 607474446, 608183444, 608820021, 609257519, 609290063, 608959377, 608368814, 607507944, 606474280, 605342746, 604138613, 602954447, 601811886, 600605190, 599227130, 597659528, 595966935, 594212472, 592424631, 590590537, 588673472, 586701512, 584746003, 582829714, 580823064, 578628540, 576385796, 574168205, 571865916, 569431961, 566923082, 564406097, 561888278, 559348047]
3053.2E59348047k554715k582908k603292k524734k370953k281249k324402k432704
3069.5E39673090k463520k380728k261103k198278k296687k443254k492785k500594
3085.8E20636141k453565k393008k481401k600610k572655k505899k551973k687156
3102.2E00389874k731591k649099k637088k770335k843767k802104k819479k921789
3118.5D78214622l096432l251135l221542l128618l141463l204673l253490l246933
3134.8D52670336l189206l201276l356457l488630l450155l374160l338903l335327
3151.1D25936222l436446l592134l633767l589123l550083l513187l524572l554791
3167.4C97542119l520757l491402l526479l555715l555923l515989l458291l438235
$$ y = [559348047, 556793332, 554210424, 551607132, 549082398, 546711445, 544430196, 542105794, 539673090, 537209570, 534828842, 532567739, 530369461, 528072774, 525629520, 523136735, 520636141, 518182576, 515789568, 513308167, 510707557, 508134902, 505629003, 503077030, 500389874, 497658283, 495009184, 492372096, 489601761, 486757994, 483955890, 481136411, 478214622, 475118190, 471867055, 468645513, 465516895, 462375432, 459170759, 455917269, 452670336, 449481130, 446279854, 442923397, 439434767, 435984612, 432610452, 429271549, 425936222, 422499776, 418907642, 415273875, 411684752, 408134669, 404621482, 401096910, 397542119, 394021362, 390529960, 387003481, 383447766, 379891843, 376375854, 372917563, 369479328]
3183.7C69479328l420978l387511l380299l372460l320396l280223l273368l240972
3200.1C42803121l155977l092676l089607l095329l055334k996236k963424k899140
3216.4C18455398k816766k780199k784163k766937k699077k626360k548873k464146
3232.7B96968877k479851k538413k460181k342403k308399k287179k231300k195865
3249B78125286k166897k102405k058238k090454k119600k051533j972466j969308j965791
3267.4B59628594j900673j867652j900285j950205j971155j908869j844689j841560
3283.7B44443506j844198j852363j823678j734972j713351j767099j803219j788080
3300B30116546j707449j611412j624778j748294j834362j831040j746640j645699j630306
$$ y = [369479328, 366058350, 362670839, 359290540, 355918080, 352597684, 349317461, 346044093, 342803121, 339647144, 336554468, 333464861, 330369532, 327314198, 324317962, 321354538, 318455398, 315638632, 312858433, 310074270, 307307333, 304608256, 301981896, 299433023, 296968877, 294489026, 291950613, 289490432, 287148029, 284839630, 282552451, 280321151, 278125286, 275958389, 273855984, 271797746, 269707292, 267587692, 265536159, 263563693, 261594385, 259628594, 257727921, 255860269, 253959984, 252009779, 250038624, 248129755, 246285066, 244443506, 242599308, 240746945, 238923267, 237188295, 235474944, 233707845, 231904626, 230116546, 228409097, 226797685, 225172907, 223424613, 221590251, 219759211, 218012571, 216366872, 214736566]
3318.4B14736566j622737j566782j567885j627893j618504j534119j472995j418337
3334.7B02307314j353205j347065j409173j445218j428977j347259j196593j173943
3351A91605881j316637j382083j234367j040355j023590j062334r14886p48962q42229
3369.3A82040438j065046j039892p66516o18353o16566o07475n27024l53918j25751
3387.7A76319897P4923L6165k25871k44886J40741M09648J77488j65463k5093L26291
3408.1A76823840M16934L91170L60176L22506M42907O00577O31451P43166R69961J135171
3428.5A82837859J095235J115516J299918J207530Q96454R09835J206800J424864J547575
3446.8A93541586J541332J519427J594960J744092J960605K111897K013966J950846
$$ y = [214736566, 213113829, 211547047, 209979162, 208351269, 206732765, 205198646, 203725651, 202307314, 200954109, 199607044, 198197871, 196752653, 195323676, 193976417, 192779824, 191605881, 190289244, 188907161, 187672794, 186632439, 185608849, 184546515, 183631629, 182882667, 182040438, 180975392, 179935500, 179168984, 178550631, 177934065, 177326590, 176799566, 176445648, 176319897, 176394820, 176430985, 176205114, 175960228, 176100969, 176510617, 176688105, 176522642, 176497549, 176823840, 177240774, 177631944, 177992120, 178314626, 178757533, 179358110, 179989561, 180732727, 181702688, 182837859, 183933094, 185048610, 186348528, 187556058, 188452512, 189362347, 190569147, 191994011, 193541586, 195082918, 196602345, 198197305, 199941397, 201902002, 204013899, 206027865, 207978711]
3463.2B07978711K248108K481282K226114J822233J856133K163068K457321K567351
3479.5B25800321K369478K273708K483339K579927K521932K630383K818763K960682
3495.8B46438533K906457K815619K921760K921611K743900K826482L149628L391207
3512.1B70115197L364324L174633L209859L463388L788829L781348L492326L503739
3528.4B97893643L723771L904074M142583M246443M064798M142970M455299M560589
3544.7C31134170M323393M123778M302978M598528M701853M775792M973919N031853
3561.1C67966264M815341M883825N769641O080091N484014N306363N611807N905182
3577.4D11822528O141364O291121O138802O201148O783485O825686O290168O458818
$$ y = [207978711, 210226819, 212708101, 214934215, 216756448, 218612581, 220775649, 223232970, 225800321, 228169799, 230443507, 232926846, 235506773, 238028705, 240659088, 243477851, 246438533, 249344990, 252160609, 255082369, 258003980, 260747880, 263574362, 266723990, 270115197, 273479521, 276654154, 279864013, 283327401, 287116230, 290897578, 294389904, 297893643, 301617414, 305521488, 309664071, 313910514, 317975312, 322118282, 326573581, 331134170, 335457563, 339581341, 343884319, 348482847, 353184700, 357960492, 362934411, 367966264, 372781605, 377665430, 383435071, 389515162, 394999176, 400305539, 405917346, 411822528, 417963892, 424255013, 430393815, 436594963, 443378448, 450204134, 456494302, 462953120]
3593.7D62953120O988824P152855P186681P178575O845087O641984P244885P650435
3610E19842446P523179P454634P096111P453263Q330047P564843O356776O219089P915020
3628.4E85755408Q924186P237136O638349O712377O578743O567121O212890N511164
3644.7F40137374N603135P255077P611990N473137M714370N622447N536973M658520
3661F86613023M271150L955781L511310L770471M134774L314793L538430M025876L183961
3679.4G20319569K799392K647161K380431K646148L152728K800703K195180J917898
3695.7G40859210J730025J654446J866281J855851J417160J112997J246035J728952
3712G53470957J689732J183033R90987R84967R04322R24646J040876R09984O31452
$$ y = [462953120, 469941944, 477094799, 484281480, 491460055, 498305142, 504947126, 512192011, 519842446, 527365625, 534820259, 541916370, 549369633, 557699680, 565264523, 571621299, 577840388, 585755408, 594679594, 601916730, 608555079, 615267456, 621846199, 628413320, 634626210, 640137374, 645740509, 652995586, 660607576, 666080713, 670795083, 676417530, 681954503, 686613023, 690884173, 694839954, 698351264, 702121735, 706256509, 709571302, 713109732, 717135608, 720319569, 723118961, 725766122, 728146553, 730792701, 733945429, 736746132, 738941312, 740859210, 742589235, 744243681, 746109962, 747965813, 749382973, 750495970, 751742005, 753470957, 755160689, 756343722, 757334709, 758319676, 759223998, 760148644, 761189520, 762099504, 762730956]
3730.3G62730956O77764J049459J420677J192987L97921r5725M96924J048028N74768
3748.7G69493759O46770J114845R52303O26982O09696P24971N77926M44174L78251
3767.1G75569677M55797P32780O67929L93689L83556N62370M96745K64227L04580L95119
3787.5G80226469L60429L14236J85967J98483K67863R6560L00526N29111L11494M44710
3807.8G83235848M75287J60933j0967J62482K32696R0182M14670M43458K24114J91092
3828.2G85619795M0412M2916K02119J30296N9008K04981L46183L88563K02418j28866
3848.6G87107825n34475n30600N50508P77305J69396j19567K3246K62618M8757j72496
3869G87582517J28567L56972L39747L8266k20061P7963K96355L04102J41204j66118
$$ y = [762730956, 763408720, 764458179, 765878856, 767071843, 767469764, 767374039, 767870963, 768918991, 769493759, 770140529, 771255374, 772207677, 772834659, 773444355, 774169326, 774747252, 775191426, 775569677, 776025474, 776758254, 777426183, 777819872, 778203428, 778765798, 779262543, 779526770, 779831350, 780226469, 780586898, 780901134, 781087101, 781285584, 781553447, 781650007, 781950533, 782479644, 782791138, 783235848, 783711135, 783872068, 783861101, 784023583, 784256279, 784346461, 784761131, 785204589, 785428703, 785619795, 785660207, 785703123, 785905242, 786035538, 786094546, 786299527, 786645710, 787034273, 787236691, 787107825, 786573350, 786042750, 786593258, 787370563, 787539959, 787420392, 787443638, 787706256, 787755013, 787582517, 787711084, 788068056, 788407803, 788446069, 788226008, 788303971, 788600326, 788904428, 789045632, 788879514]
3889.4G88879514L9339K67327n9069l22938k47299l2425J87516L18945J86741J1980
3909.8G89229631k9504q3744j04845M2260J33156K1637L815P0750l9935q5890J21176
3932.3G89278507K13504P0512j2278l9101n3942q643L3856J32560J89543N2273j4424
3954.7G89842367J03355J53541R9063L6001J7286J17898J92165J51753J40369J85013
3975.1G91038811J90795N4538k4378J01745J01566j0550K384P8440J57833J61529Q0287
3997.5G91933000
$$ y = [788879514, 788918853, 789186180, 789127111, 788804173, 788556874, 788524449, 788711965, 789030910, 789217651, 789229631, 789200127, 789116383, 789011538, 789053798, 789186954, 789208591, 789212406, 789283156, 789243221, 789157331, 789278507, 789492011, 789562523, 789550245, 789511144, 789457202, 789448559, 789482415, 789614975, 789804518, 789856791, 789842367, 789945722, 790099263, 790198326, 790234327, 790251613, 790369511, 790561676, 790713429, 790853798, 791038811, 791229606, 791284144, 791259766, 791361511, 791463077, 791452527, 791454911, 791533351, 791691184, 791852713, 791933000]
##END=$$ End of the data block
