##TITLE=$$ Begin of the data block
##JCAMP-DX=5.00 $$ ACD/SpecManager v 10.08
##SPECTROMETER/DATA SYSTEM=Alpha
##DATE=10 Apr 2014 09:27:12
##DATA TYPE=INFRARED SPECTRUM
##DATA CLASS=XYDATA
##ORIGIN=
##OWNER=
##NPOINTS=1765
##FIRSTX=399.75695801
##LASTX=3997.56933594
##MAXX=3997.56933594
##MINX=399.75695801
##MAXY=0.82973087
##MINY=0.17631727
##XFACTOR=1.0000000000
##YFACTOR=1.000000000000000e-9
##FIRSTY=0.53358173
##DELTAX=2.03957629
##XUNITS=1/CM
##YUNITS=ARBITRARY UNITS
##XYDATA=(X++(Y..Y))
399.8E33581734l64900j524150k267838j422763r20355j369536j217365m96090p71880
418.1E23226857j260459k44320O9082r34303j271724k85089j68801j364469j241684
436.5E16525090L0577j57774j146495o02424L08990m09126r54389N0664L87668r22441
456.9E13110340j310826l60667p48754j741588j377404o87480j159847j603484r80913
475.2E03139377r21071j621127j265317j77145l40402j224608r43333m95314j488745
493.6D94662315k155096j099765m74215j380592j610726n65768n02824j519800j568138
511.9D83785391q55208j098394j881450j686693j245468j869262k389043j614541j199663
530.3D69945669j848996j885026r81361q35061j372665r68248k85715o74098j276434
$$ plain form
399.8 533581734 533216834 531692684 529424846 528002083 527081728 525712192 524494827 523998737 523226857
418.1 523226857 521966398 521722078 521791160 520856857 519585133 519300044 519131243 517766774 516525090
436.5 516525090 516555667 516397893 515251398 514648974 514957964 514548838 513594449 513645113 514032781 513110340
456.9 513110340 511799514 511438847 510690093 508948505 507571101 506883621 505723774 504120290 503139377
475.2 503139377 502218306 500597179 499331862 499154717 498814315 497589707 496646374 496151060 494662315
493.6 494662315 492507219 491407454 490933239 489552647 487941921 487376153 486873329 485353529 483785391
511.9 483785391 482930183 481831789 479950339 478263646 477018178 475148916 472759873 471145332 469945669
530.3 469945669 468096673 466211647 465230286 464395225 463022560 462054312 461768597 461094499 459818065
548.6D59818065j092732q50022j297563j673549j373649j379907k169907k594322k306044
567D45080370k401442l017962l029674k538890k589494k838313k578169k278298k513796
585.4D21294332k773196k641320k645642k966165k892465k373784k473414l214509
601.7C99313837l251999k052546q27551m86880m90398l12954L42131K021909M043221
620C98298770M899800M493117L988356M264772M556417M058898L447860L326863K813071
638.4D34147924J398593J63257N51194K266199L121286K143473j282j785636q9108
656.7D41915900N167603Q476049P108241M334122M033565N331457L569603K707780
673.1D82644320L473848L448188K595484K459288K880543K474040J664192J709103
$$ plain form
548.6 459818065 458725333 457875311 456577748 454904199 453530550 452150643 449980736 447386414 445080370
567 445080370 442678928 439660966 436631292 434092402 431502908 428664595 426086426 423808128 421294332
585.4 421294332 418521136 415879816 413234174 410268009 407375544 405001760 402528346 399313837
601.7 399313837 396061838 394009292 393181741 392694861 392204463 391891509 392233640 394255549 398298770
620 398298770 403198570 407691687 411680043 415944815 420501232 424560130 428007990 431334853 434147924
638.4 434147924 435546517 435709774 436260968 438527167 441648453 443791926 443790644 442005008 441915900
656.7 441915900 447083503 455559552 462667793 467001915 471035480 476366937 479936540 482644320
673.1 482644320 486118168 489566356 492161840 494621128 497501671 499975711 501639903 503349006
689.4E03349006J957715J266837N99146R48012J293480R58383J084805K008617K456545
707.7E15922546K156735K333164L050268K980292K336204K535224L163635K897203
724E37375271K443910K643883K767265K207279J699448J897514J957357J500010J490593
742.4E55982530K062321K162576J773059J876116K327859K189696J876593K200543
758.7E72451293K496422K183437J922310K115249K042294J410901R17435P46608J90198
777.1E86476147p65502j226127j093805r68457p38501J90794J658857K997875M197240
795.4E90728521N678475O959617P218302O871044O647230O101846M843354L762424
811.7F38810813L260315K467036J048684k14219j148045k514541m148722n019605n194366
$$ plain form
689.4 503349006 505306721 506573558 507172704 508120716 509414196 510372579 511457384 513466001 515922546
707.7 515922546 518079281 520412445 523462713 526443005 528779209 531314433 534478068 537375271
724 537375271 539819181 542463064 545230329 547437608 549137056 551034570 552991927 554491937 555982530
742.4 555982530 558044851 560207427 561980486 563856602 566184461 568374157 570250750 572451293
758.7 572451293 574947715 577131152 579053462 581168711 583211005 584621906 585539341 586285949 586476147
777.1 586476147 585710645 584484518 583390713 582422256 581683755 581874549 583533406 586531281 590728521
795.4 590728521 596406996 603366613 610584915 617455959 624103189 630205035 635048389 638810813
811.7 638810813 642071128 644538164 645586848 645372629 644224584 641710043 637561321 632541716 627347350
830.1F27347350n493164n675197n189657m587292m521311m493177l833711k722204
846.4E90831637j264870J089514M238903P050812Q973956J0488630J1613786J1694968
862.7F44717336J0959685J0191261R255767P660866N907178M735231L650129K131522
879.1F99208975P83264r9182j103878k258837k853930k745390k389967j757503m62174
897.4F86321378J028001J869142K150297K252460J915872R24110l43918j616955l048659
915.8F91451728m495382n254626m996181m137695k889931j189947M56870J315534J385689
934.1F71646059J240670J105070Q01385M13894J11521l49701j207530k267957l383756
952.5F68109655m719495o258667p806003r372711j1143804j3167560j5168428j6740442
$$ plain form
830.1 627347350 621854186 616178989 610989332 606402040 601880729 597387552 593553841 590831637
846.4 590831637 589566767 590656281 594895184 601945996 610919952 621408582 633022368 644717336
862.7 644717336 655677021 665868282 675124049 682784915 688692093 693427324 697077453 699208975
879.1 699208975 699992239 699893057 698789179 696530342 693676412 690931022 688541055 686783552 686321378
897.4 686321378 687349379 689218521 691368818 693621278 695537150 696461260 696117342 694500387 691451728
915.8 691451728 686956346 681701720 676705539 672567844 669677913 668487966 668944836 670260370 671646059
934.1 671646059 672886729 673991799 674793184 675207078 675318599 674968898 673761368 671493411 668109655
952.5 668109655 663390160 657131493 649325490 639952779 628808975 615641415 600472987 583732545
968.8E83732545j7585992j7436803j6147077j4039993j1816800r999037q603692p585674
985.1D80517477o940276o397307n697220m902363m186660l544569k910972k400845
1001.4D43537265k317190k824724l782928m966318o095022o817401p003069o826848
1017.7D02903765o453394n880893n261034m848092m542738m137427l671199l259003
1034.1C64849985k897621k529293k214670k080679k083987k134174k207548k212017
1050.4C46489996j889468j042187J65224J336396K019137J948565J032919n83052k414018
1068.7C47063512l954471m895746n168408m978389m683971m522980m636615n042195
1085C09180737n610973o085992o040126n096108l381371j441896K53200J407087J972199
$$ plain form
968.8 583732545 566146553 548709750 532562673 518522680 506705880 496706843 488103151 480517477
985.1 480517477 473577201 467179894 461482674 456580311 452393651 448849082 445938110 443537265
1001.4 443537265 441220075 438395351 434612423 429646105 423551083 416733682 409730613 402903765
1017.7 402903765 396450371 390569478 385308444 380460352 375917614 371780187 368108988 364849985
1034.1 364849985 361952364 359423071 357208401 355127722 353043735 350909561 348702013 346489996
1050.4 346489996 344600528 343558341 343723565 345059961 347079098 349027663 350060582 349477530 347063512
1068.7 347063512 343109041 338213295 333044887 328066498 323382527 318859547 314222932 309180737
1085 309180737 303569764 297483772 291443646 286347538 282966167 281524271 281777471 283184558 285156757
1103.4B85156757K030432J728386J216054M70906o59227k217293m201800o361484p275880
1121.8B69886851n212426j070559J847744K050012P00176m02957O4045J831949L475457
1140.1B73170292M131794L926486L311545K713054K345294K196729K294213K760827
1156.4B96850234L588617M658848N967796P515579R044827J0149568J0712713J0803997
1172.7C59292179J0476411R841829R095341Q293808P180720N573333L638535J601845
1189.1D14994001l53247j791119k164364j402587Q1361J910239L712028M871309M990041
1207.4D24847662M383654L571659K677500J808048J308799J239389J238167J172751
1223.7D42247629J307100J698464K008289K151788K460360K862215K945185K799988
$$ plain form
1103.4 285156757 287187189 288915575 290131629 290602535 289943308 287726015 283524215 277162731 269886851
1121.8 269886851 264674425 263603866 265451610 267501622 268201798 267798841 267862886 269694835 273170292
1140.1 273170292 277302086 281228572 284540117 287253171 289598465 291795194 294089407 296850234
1156.4 296850234 300438851 305097699 311065495 318581074 327625901 337775469 348488182 359292179
1172.7 359292179 369768590 379610419 388705760 396999568 404180288 409753621 413392156 414994001
1189.1 414994001 414640754 412849635 410685271 409282684 409364045 411274284 414986312 419857621 424847662
1207.4 424847662 429231316 432802975 435480475 437288523 438597322 439836711 441074878 442247629
1223.7 442247629 443554729 445253193 447261482 449413270 451873630 454735845 457681030 460481018
1240.1D60481018K743482K607137K086819J437008J053274P73459M49658M69953R75281
1258.4D73077089J582890K149284K940387L946304M679650N079866N563229O064802
1274.7E05083501O220043O184995O393254O696820O747783O795346P035494P048130
1291E58205366O600201O120205N823255N294144M478335L861606L484130K929807K266645
1309.4E99063694J923502J755416J392722J157642J377046J666546J698732J710832
1325.7F11746132J842618J706839J097918M49419J60992M0531p9632O9559M70757P62999
1346.1F18268132P96378P28428O03974K87294j40488l84628n91398j132011j694501
1364.5F16741180j836657j831651j795113j899302k229750k583802l539324n354106
$$ plain form
1240.1 460481018 463224500 465831637 467918456 469355464 470408738 471182197 471631855 472101808 473077089
1258.4 473077089 474659979 476809263 479749650 483695954 488375604 493455470 499018699 505083501
1274.7 505083501 511303544 517488539 523881793 530578613 537326396 544121742 551157236 558205366
1291 558205366 564805567 570925772 576749027 582043171 586521506 590383112 593867242 596797049 599063694
1309.4 599063694 600987196 602742612 604135334 605292976 606670022 608336568 610035300 611746132
1325.7 611746132 613588750 615295589 616393507 616842926 617003918 617044449 616964817 617034376 617505133 618268132
1346.1 618268132 619064510 619792938 620396912 620684206 620543718 620159090 619567692 618435681 616741180
1364.5 616741180 614904523 613072872 611277759 609378457 607148707 604564905 601025581 595671475
1380.8E95671475o085634l774405k72393Q48591j24156j169265k169251k872407l470123
1399.1E76582432l849149m073918m429817m074693l456652l122389k537072j824677
1415.5E49214065j629531j625419r69470m01079l12984k89381j64807J27435M65512
1433.8E44414341R11773J586854J840532J990378K236187K734483L441870L886700
1450.1E63043118M172146M835546P381797J0228336Q288323P105828Q318722Q800030
1466.4F22173846P760107Q280993J0775804J0590613P956326O126642M712880L513992
1482.8F81891203K328098J255512l7968j250267j681030k433240l987670m651189m190028
1501.1F67243421l970027n441308r070456p983684o080866o103218n867600n086899
$$ plain form
1380.8 595671475 589585841 585811436 585539043 586387634 586263478 585094213 582924962 580052555 576582432
1399.1 576582432 572733283 568659365 564229548 560154855 556698203 553575814 551038742 549214065
1415.5 549214065 547584534 545959115 544989645 544588566 544275582 543986201 543821394 543948829 544414341
1433.8 544414341 545326114 546912968 548753500 550743878 552980065 555714548 559156418 563043118
1450.1 563043118 567215264 572050810 579432607 589660943 597949266 605055094 613373816 622173846
1466.4 622173846 629933953 638214946 648990750 659581363 667537689 673664331 678377211 681891203
1482.8 681891203 684219301 685474813 685436845 684186578 682505548 680072308 676084638 671433449 667243421
1501.1 667243421 663273394 657832086 648761630 640777946 634697080 628593862 622726262 617639363
1517.4F17639363m038751m111708l966867l419161l595114l156543k883851l301442
1533.7E89165926k699316j893043k280533k197385j087070l37124K90990P58350J122058
1552.1E80842853J388073J354932J077295O02126r9898r03785j791298l020585m385471
1570.5E75064242m436374n226552p837415p768750o930530p775843q396686q609652
1586.8E18082440q832753q973300q842498q753240q499682q103222p921726p780611
1603.1D50375408p451415p268131p399470p147699o482899o944269q242876o506532
1619.4C92932117n352139o308735o053030n183936m597246l392786k663940k833456
1635.7C56546849j717061k14845N45562J060187J830399K643109K509534L290057N490750
$$ plain form
1517.4 617639363 613600612 609488904 605522037 602102876 598507762 595351219 592467368 589165926
1533.7 589165926 586466610 584573567 582293034 580095649 579008579 578671455 578962445 579720795 580842853
1552.1 580842853 582230926 583585858 584663153 585265279 585165381 584261596 582470298 579449713 575064242
1570.5 575064242 570627868 565401316 557563901 549795151 542864621 535088778 526692092 518082440
1586.8 518082440 509249687 500276387 491433889 482680649 474180967 466077745 458156019 450375408
1603.1 450375408 442923993 435655862 428256392 421108693 414625794 407681525 399438649 392932117
1619.4 392932117 387579978 381271243 375218213 370034277 365437031 362044245 359380305 356546849
1635.7 356546849 354829788 354614943 355160505 356220692 358051091 360694200 363203734 366493791 371984541
1654.1C71984541M848063M442603N436867O935448P660508P012606P990866R823025
1670.4D26134527R072035R565115J0811210R833515R216457J0863036J4913291J3201713
1686.7E13610899J0841251J1492967J0671139J1744797J3641119J3914049J5865266
1701F01781487J2665928J0528505J0881602R100378P599056O899178O703853P239998
1717.3F73399985O201982M445017M159748M423678M315376M319430M209518M957378
1733.6G10432112N232454M170775M487097M953802M836678M836083M893005N184948
1749.9G49026954N193770M298329L798128L597974L226221L224075K774894K219200
1766.3G77359545K193630K181232K116322K074838J907885J785219J669943J676560
$$ plain form
1654.1 371984541 376832604 381275207 386712074 393647522 401308030 408320636 416311502 426134527
1670.4 426134527 435206562 444771677 455582887 465416402 474632859 485495895 500409186 513610899
1686.7 513610899 524452150 535945117 546616256 558361053 572002172 585916221 601781487
1701 601781487 614447415 624975920 635857522 644957900 652556956 659456134 666159987 673399985
1717.3 673399985 679601967 684046984 688206732 692630410 696945786 701265216 705474734 710432112
1733.6 710432112 715664566 719835341 724322438 729276240 734112918 738949001 743842006 749026954
1749.9 749026954 754220724 758519053 762317181 765915155 769141376 772365451 775140345 777359545
1766.3 777359545 779553175 781734407 783850729 785925567 787833452 789618671 791288614 792965174
1782.6G92965174J799464J670480J340270J356780J698077J432300J079619J193940
1798.9H04536104J346827J125395R50754J052677R96411P70211P38442Q84951P90417
1817.2H13192189N93424O39796P79152O81102M94957O62506Q15153N41925L93391O08206
1837.6H19401801O41107L89278L84450O52969N27561K76923L54409N33462M58717K55227
1858H23875904L23832M62353L24250J32084K81155M93288L14712J64569K86102L31998
1878.4H26990247J42038J00314K73347K83659J08182J21772K53559J86622Q9943J73450
1898.8H28723133K39729Q7381j7524J18852J98185M1306m4346Q6427J50681R179p6771
1921.3H29516232P3969J40667k9862p9214M4405J5199j55687j20878K801j05738k48790
$$ plain form
1782.6 792965174 794764638 796435118 797775388 799132168 800830245 802262545 803342164 804536104
1798.9 804536104 805882931 807008326 807959080 809011757 810008168 810778379 811516821 812401772 813192189
1817.2 813192189 813785613 814425409 815204561 815885663 816380620 817043126 817858279 818400204 818793595 819401801
1837.6 819401801 820042908 820432186 820816636 821469605 821997166 822274089 822628498 823161960 823620677 823875904
1858 823875904 824199736 824662089 824986339 825118423 825399578 825892866 826207578 826372147 826658249 826990247
1878.4 826990247 827132285 827232599 827505946 827789605 827897787 828019559 828273118 828459740 828549683 828723133
1898.8 828723133 828962862 829050243 829032719 829151571 829349756 829391062 829346716 829433143 829583824 829593003 829516232
1921.3 829516232 829590201 829730868 829701006 829621792 829666197 829681396 829525709 829404831 829407632 829301894 829053104
1943.7H29053104j40250k2948j28805k41459j62243j08481k33710k53498j16527j26899
1964.1H27518284k62916k32398j03057j56223k90037k37226r6321j48535k41756j65582
1984.5H25584233r7990k13742k99812j70350r4294k21313l06010k40028k18272k86877
2004.9H23435545l04580k26557k07543l04282l29673k61426k77698l63112l16739k08616
2025.3H20635319k43366l45409l19183k54154k89619l43263k92838k00808k32100k84493
2045.7H17830086k13266j60813k81215l53753k12133j20044k30193k87950j54436r5308
2066.1H15720975j96039k10762j05679j10746j91152j24097L219p7188k27988j40846
2086.5H14339697j9788j36793k43366p3314O4493p9036j71304j669P1287q5771j05321
$$ plain form
1943.7 829053104 828912854 828889906 828761101 828519642 828357399 828248918 828015208 827761710 827645183 827518284
1964.1 827518284 827255368 827022970 826919913 826763690 826473653 826236427 826140106 825991571 825749815 825584233
1984.5 825584233 825486243 825272501 824972689 824802339 824708045 824486732 824180722 823940694 823722422 823435545
2004.9 823435545 823130965 822904408 822696865 822392583 822062910 821801484 821523786 821160674 820843935 820635319
2025.3 820635319 820391953 820046544 819727361 819473207 819183588 818840325 818547487 818346679 818114579 817830086
2045.7 817830086 817616820 817456007 817174792 816821039 816608906 816488862 816258669 815970719 815816283 815720975
2066.1 815720975 815524936 815314174 815208495 815097749 814906597 814782500 814785719 814708531 814480543 814339697
2086.5 814339697 814319909 814183116 813939750 813866436 813930929 813851893 813680589 813678920 813750207 813664436 813559115
2108.9H13559115K9862J2874r9062j8239J39296J09016P868P4148J67072O6519l219
2131.3H14045250J24872J83523M0114J0073J79827K19107R5546Q6784J78338J63316
2151.7H15326750Q2255J14321K10643J65701O7055J22607K24292J80781J23620K17200
2172.1H16835225K80082J72496R0062J78933K40982J26481M5896J53124K15828Q9825
2192.5H18428934L3438J41501J30058k3485J2040J83464J31845m4882R894J53482M7743
2215H19204032p7247M3571J29401J4842l0339J03057J27673o3300j25826M6313Q4162
2237.4H19456339p4387r4831K5153j7762j60873j02877K7060o4611j90020p1168N8472
2259.8H18790495m2915j18315K7716J05679m590P16J28507J15455K2411P2420J90198
$$ plain form
2108.9 813559115 813588977 813601851 813502789 813484550 813623846 813732862 813740730 813814878 813981950 814048469 814045250
2131.3 814045250 814170122 814353645 814393759 814403832 814583659 814802766 814898312 814985096 815163434 815326750
2151.7 815326750 815409005 815523326 815733969 815899670 815966725 816089332 816313624 816494405 816618025 816835225
2172.1 816835225 817115307 817287803 817377865 817556798 817797780 817924261 817970157 818123281 818339109 818428934
2192.5 818428934 818462372 818603873 818733931 818710446 818722486 818905950 819037795 818992913 819002807 819156289 819204032
2215 819204032 819126785 819170356 819299757 819314599 819284260 819387317 819514990 819451690 819325864 819372177 819456339
2237.4 819456339 819381952 819287121 819312274 819294512 819133639 819030762 819057822 818993211 818803191 818732023 818790495
2259.8 818790495 818747580 818629265 818656981 818762660 818758070 818758786 818887293 819002748 819025159 819097579 819287777
2282.3H19287777J50621J7583L7849J30773Q4996L0279J11699J54197O1095L0756Q9765
2304.7H20187390Q5294K0862M5955J88768J91808J0192o497J57416J50919M3034P1109
2327.1H21146250J92940K02835N4895O795R3759J05261P8380K43426M67598L49880
2347.5H22942019L5941p9453J5855M5896L2484J53363K57253K50519K83003L21984
2367.9H24258864L33905L08335K76148K84553L04699L46601L68655K92241J65343J12296
2388.3H27051640J05440P7903P0215R9301J03235P6533O7651O8545N4121M3392N2691
2410.8H27870667L6716j370k7538n5492q4638r5785j05739j17361r8646n8234k4378
2433.2H27238202l3438n9188o3836q0645j11401j14382q5711o7413q7261r3043o0856
$$ plain form
2282.3 819287777 819438398 819455981 819493830 819624603 819709599 819739878 819851577 820005774 820066869 820097625 820187390
2304.7 820187390 820272684 820293546 820339501 820528269 820720077 820730269 820723772 820881188 821032107 821075141 821146250
2327.1 821146250 821339190 821542025 821596920 821603715 821697474 821802735 821881115 822124541 822592139 822942019
2347.5 822942019 822977960 822898507 822914362 822960258 822992742 823146105 823403358 823653877 823936880 824258864
2367.9 824258864 824592769 824901104 825177252 825461805 825766504 826113105 826481760 826774001 826939344 827051640
2388.3 827051640 827157080 827234983 827305198 827404499 827507734 827584267 827651918 827720463 827774584 827817976 827870667
2410.8 827870667 827907383 827906013 827878475 827822983 827738345 827642560 827536821 827419460 827320814 827262580 827238202
2433.2 827238202 827204764 827145576 827081740 827001095 826889694 826775312 826689601 826622188 826534927 826441884 826381028
2455.6H26381028j03772k08914j94490p8440Tj69158j60694j17540j44184j60098j14441
2478.1H24850857j08719j66356j82271j36793j21713j90615k07544j28924j35243k16723
2498.5H23255956j93596j11222j23799j85609j88112j45614j64330k13087j60813j15752
2518.9H21654022j66297j84179j57117j61529j92404j99497j51276j25528j79290j94371
2539.2H19942534j42813j51515j86026j54853j40965k03311k38121j82628j60933k44021
2559.6H18137348k70784j72198j38819k37644l15011l03447k85923l27111l30805k73407
2580H15482199l11017m05729l98695l74079m37915m62055l84093l71873m82261n38469
2600.4H11316013n02646n30660n90384n36084m60744n12481o02483n95034n54740n96642
$$ plain form
2455.6 826381028 826277256 826068342 825873852 825795412 825716972 825547814 825387120 825269580 825125396 824965298 824850857
2478.1 824850857 824742138 824575782 824393511 824256718 824135005 823944390 823736846 823607922 823472679 823255956
2498.5 823255956 823062360 822951138 822827339 822641730 822453618 822308004 822143674 821930587 821769774 821654022
2518.9 821654022 821487725 821303546 821146429 820984900 820792496 820592999 820441723 820316195 820136905 819942534
2539.2 819942534 819799721 819648206 819462180 819307327 819166362 818963051 818724930 818542302 818381369 818137348
2559.6 818137348 817866564 817694366 817555547 817317903 817002892 816699445 816413522 816086411 815755606 815482199
2580 815482199 815171182 814765453 814366758 813992679 813554764 813092709 812708616 812336743 811854482 811316013
2600.4 811316013 810813367 810282707 809692323 809156239 808695495 808183014 807580531 806985497 806430757 805834115
2620.8H05834115o31214n67913n31315o01590o27637n46038n16594n72204n83291n42522
2641.2H00113797n44548n72026n61893n54919n86688n80252n10513m78268n51164o18756
2661.6G94554770n56469m92096n37932n51998n01872n17249n77449n82874n44429n82993
2682G89109409o75976o53804n70833n76437o41644o59347o36637o70790p27714p07030
2702.4G82589197o69896o90878p07567p09176p36296p83861p96020p44760p02023p26342
2722.8G75322378p73669p81476p58767p38263p01607o37054o52254p72357q10206p09056
2743.2G67987669o54877o89983o74546o67572p93815q84473q05795p60734q49366q89540
2763.6G60316968q26299q29041r38952r81927r27210r46760j036883j039505j001358
$$ plain form
2620.8 805834115 805202901 804634988 804103673 803502083 802874446 802328408 801811814 801239610 800656319 800113797
2641.2 800113797 799569249 798997223 798435330 797880411 797293723 796713471 796202958 795724690 795173526 794554770
2661.6 794554770 793998301 793506205 792968273 792416275 791914403 791397154 790819705 790236831 789692402 789109409
2682 789109409 788433433 787779629 787208796 786632359 785990715 785331368 784694731 784023941 783296227 782589197
2702.4 782589197 781919301 781228423 780520856 779811680 779075384 778291523 777495503 776750743 776048720 775322378
2722.8 775322378 774548709 773767233 773008466 772270203 771568596 770931542 770279288 769506931 768696725 767987669
2743.2 767987669 767332792 766642809 765968263 765300691 764506876 763622403 762816608 762055874 761206508 760316968
2763.6 760316968 759490669 758661628 757722676 756740749 755813539 754866779 753829896 752790391 751789033
2782G51789033j042306j116991j139820j149714j223862j306176j285732j233399j339316
2800.3G40951717j472116j427233j386642j481831j552284j541197j569152j667381
2816.6G28853881j730084j715958j733840j826405j897276j949250k100408k326608
2832.9G13574052k531767k806127l262580l872275m589498n368173n794287n237102
2849.3F80112243l836811k471089j649916j255334j160681j447320k037227k610445
2865.6F63643420l013194l230810l123343k724528k310872k032280j853526j757264
2881.9F43597603j803637j972198k140105k267480k388418k500236k603113k685726
2898.2F25236690k718389k755105k912105l215372l643692m235983m844606n094468
$$ plain form
2782 751789033 750746727 749629736 748489916 747340202 746116340 744810164 743524432 742291033 740951717
2800.3 740951717 739479601 738052368 736665726 735183895 733631611 732090414 730521262 728853881
2816.6 728853881 727123797 725407839 723673999 721847594 719950318 718001068 715900660 713574052
2832.9 713574052 711042285 708236158 704973578 701101303 696511805 691143632 685349345 680112243
2849.3 680112243 676275432 673804343 672154427 670899093 669738412 668291092 666253865 663643420
2865.6 663643420 660630226 657399416 654276073 651551545 649240673 647208393 645354867 643597603
2881.9 643597603 641793966 639821768 637681663 635414183 633025765 630525529 627922416 625236690
2898.2 625236690 622518301 619763196 616851091 613635719 609992027 605756044 600911438 595816970
2914.5E95816970m842103m242599l464043k644956j913786j248479n73456l278M90784
2932.9E77375054J121223J811684K366065K751410K923430K748966K188801J436770
2949.2E94723403P85649L08275J0849J1682K49445N22793O97732Q22842R85622J059294
2969.6F00177586J020312J013577J021922J017153J030565R68813Q29459P71939P52092
2987.9F08603418O47366M10497J3709l41952n82099q31782j021505j144290j228809
3006.3F04524553j203537j137078j176238j322329j510561j685440j787007j813650
3022.6E92888713j866222j954853j954436j920283j935840k031326k191901k237022
3038.9E76796830k200067k276361k424658k505660k487123k475619k544940k595901
$$ plain form
2914.5 595816970 590974867 586732268 583268225 580623269 578709483 577461004 576887548 576884270 577375054
2932.9 577375054 578496277 580307961 582674026 585425436 588348866 591097832 593286633 594723403
2949.2 594723403 595509052 595817327 595828176 595839858 596089303 596612096 597309828 598132670 599118292 600177586
2969.6 600177586 601197898 602211475 603233397 604250550 605281115 606249928 607079387 607851326 608603418
2987.9 608603418 609250784 609661281 609674990 609333038 608750939 607919157 606897652 605753362 604524553
3006.3 604524553 603321016 602183938 601007700 599685371 598174810 596489370 594702363 592888713
3022.6 592888713 591022491 589067638 587113202 585192919 583257079 581225753 579033852 576796830
3038.9 576796830 574596763 572320402 569895744 567390084 564902961 562427342 559882402 557286501
3055.3E57286501k577305k533674k473354k394379k322256k326429k415717k463400
3071.6E37779987k406120k283872k202034k298951k468407k523422k477884k397716
3087.9E18721581k379299k482950k589047k590120k547562k580345k689242k745867
3104.2D98117149k706945k687156k778709k815634k726197k759606k936512l102839
3120.5D75603551l235817l268093l168583l069371l098518l233850l296435l233969
3136.8D49998915l227770l378391l501922l447831l371745l340751l319174l428221
3153.2D22983110l603756l649772l632664l590584l499478l457964l495633l549666
3169.5C94503593l560841l552198l556699l533035l444702l381013l421009l477663
$$ plain form
3055.3 557286501 554709196 552175522 549702168 547307789 544985533 542659104 540243387 537779987
3071.6 537779987 535373867 533089995 530887961 528589010 526120603 523597181 521119297 518721581
3087.9 518721581 516342282 513859332 511270285 508680165 506132603 503552258 500863016 498117149
3104.2 498117149 495410204 492723048 489944339 487128705 484402508 481642902 478706390 475603551
3120.5 475603551 472367734 469099641 465931058 462861687 459763169 456529319 453232884 449998915
3136.8 449998915 446771145 443392754 439890832 436443001 433071256 429730505 426411331 422983110
3153.2 422983110 419379354 415729582 412096918 408506334 405006856 401548892 398053259 394503593
3169.5 394503593 390942752 387390554 383833855 380300820 376856118 373475105 370054096 366576433
3185.8C66576433l461093l413230l385573l331364l256857l213972l219574l240556
3202.1C40054214l195763l082335l018558l025680l004641k944320k892852k859950
3218.4C16030115k824128k783328k735496k678781k619923k539634k479077k526641
3234.7B94843107k569615k474517k364844k315521k256304k187342k163529k174348
3251.1B76337087k154827k093106k086074k099901k045810k007395k019704j987725
3267.4B59842545j868367j814187j887321j957536j986921j946420j872807j876816
3283.7B44632170j860470j782566j716972j686081j730278j772747j803040j848519
3300B30431497j791775j657397j613363j699522j820147j854375j766727j680478j656175
$$ plain form
3185.8 366576433 363115340 359702110 356316537 352985173 349728316 346514344 343294770 340054214
3202.1 340054214 336858451 333776116 330757558 327731878 324727237 321782917 318890065 316030115
3218.4 316030115 313205987 310422659 307687163 305008382 302388459 299848825 297369748 294843107
3234.7 294843107 292273492 289798975 287434131 285118610 282862306 280674964 278511435 276337087
3251.1 276337087 274182260 272089154 270003080 267903179 265857369 263849974 261830270 259842545
3267.4 259842545 257974178 256159991 254272670 252315134 250328213 248381793 246508986 244632170
3283.7 244632170 242771700 240989134 239272162 237586081 235855803 234083056 232280016 230431497
3300 230431497 228639722 226982325 225368962 223669440 221849293 219994918 218228191 216547713 214891538
3318.4B14891538j601756j514270j498566j587897j640752j549691j445264j408055
3334.7B02645287j371950j354203j419767j473859j439989j335263j203522j212910
3351A91833824j336277j356259j204937j028493r99615j021206q91656p74518q87736
3369.3A82333127j079515j052752p90745o17877n91039n95972n42134l37437o3196
3387.7A76662460J05157j043k39089k10210J56104M06504J59442k07424q2046K89291
3408.1A77039146M36277M33638L71144L29941M77046O07475N93886P36311J007289
3426.5A82032153J153514J121253J153051J281798J181603R13143R01654J169697J415580
3444.8A92323446J527414J511216J537085J649752J784772J949534K074658J966939
$$ plain form
3318.4 214891538 213289782 211775512 210276946 208689049 207048297 205498606 204053342 202645287
3334.7 202645287 201273337 199919134 198499367 197025508 195585519 194250256 193046734 191833824
3351 191833824 190497547 189141288 187936351 186907858 185908243 184887037 183995381 183220863 182333127
3369.3 182333127 181253612 180200860 179410115 178792238 178201199 177605227 177063093 176725656 176662460
3387.7 176662460 176767617 176766574 176527485 176317275 176473379 176879883 177039325 176831901 176749855 177039146
3408.1 177039146 177475423 177909061 178280205 178610146 179087192 179694667 180288553 181024864 182032153
3426.5 182032153 183185667 184306920 185459971 186741769 187923372 188836515 189738169 190907866 192323446
3444.8 192323446 193850860 195362076 196899161 198548913 200333685 202283219 204357877 206324816
3461.1B06324816J912012K274216K538398K245351J800820J806573K140983K486930
3477.4B23530099K572089K338350K302170K569631K611562K503723K665058K885520
3493.8B43978202K951175K829895K774939K942800K910555K654880K774805L197938
3510.1B67015189L469825L400147L150582L159225L431082L803521L833711L518552
3526.4B94781834L498703L749311L899396M059344M184038M074603M190683M528225
3542.7C26966137M627585M337371M110336M306614M597932M672528M778027N021304
3559C63417834N012393M693717M795551N826473O149978N471855N310059N639821N919486
3577.4D12237167O164939O312847O177365O238997O739319O771147O315321O520510
$$ plain form
3461.1 206324816 208236828 210511044 213049442 215294793 217095613 218902186 221043169 223530099
3477.4 223530099 226102188 228440538 230742708 233312339 235923901 238427624 241092682 243978202
3493.8 243978202 246929377 249759272 252534211 255477011 258387566 261042446 263817251 267015189
3510.1 267015189 270485014 273885161 277035743 280194968 283626050 287429571 291263282 294781834
3526.4 294781834 298280537 302029848 305929244 309988588 314172626 318247229 322437912 326966137
3542.7 326966137 331593722 335931093 340041429 344348043 348945975 353618503 358396530 363417834
3559 363417834 368430227 373123944 377919495 383745968 389895946 395367801 400677860 406317681 412237167
3577.4 412237167 418402106 424714953 430892318 437131315 443870634 450641781 456957102 463477612
3593.7D63477612P003486P130772P199823P204682O837428O620168P251442P661462
3610E20386875P468640P386089P122815P544457Q375526P543504O330550O198644P881821
3628.4E86238921Q891463P202566O632030O743490O592095O594956O298483N558610
3644.7F40752614N555152P242442P689356N486370M686772N613685N495131M590690
3661F87112212M226268L942430L531098L819644M169286L280580L507077M100621L262520
3679.4G20951736K786219K615213K403319K690852L194213K791941K157271J900852
3695.7G41491616J670241J560509J865208J944125J486182J125873J180648J623988
3712G53948390J652420J208544J009106R65953Q60572Q71480J045286R77099O83904
$$ plain form
3593.7 463477612 470481098 477611870 484811693 492016375 498853803 505473971 512725413 520386875
3610 520386875 527855515 535241604 542364419 549908876 558284402 565827906 572158456 578357100 586238921
3628.4 586238921 595130384 602332950 608964980 615708470 622300565 628895521 635194004 640752614
3644.7 640752614 646307766 653550208 661239564 666725934 671412706 677026391 682521522 687112212
3661 687112212 691338480 695280910 698812008 702631652 706800938 710081518 713588595 717689216 720951736
3679.4 720951736 723737955 726353168 728756487 731447339 734641552 737433493 739590764 741491616
3695.7 741491616 743161857 744722366 746587574 748531699 750017881 751143754 752324402 753948390
3712 753948390 755600810 756809354 757818460 758784413 759644985 760516465 761561751 762538850 763222754
3730.3G63222754O98507J013875J343906J174569M38392k2948N77152J029611M74155
3748.7G69949973O34551J209676R57847N48899N77986P44164N66125M36246M00782
3767.1G76026249M91559Q15452P02440L30389L43978N94378N08964K21312K80142M34696
3787.5G80749559M24564L35276J48893J28507J73748L3796L47137O34432L71575M76003
3807.8G83823490N01394J37687q4579J27673K24531M5657M37260N11229K36094J57237
3828.2G86117673J4663K0504J42932J45197J89483K45332K76626L72111K27452j98663
3848.6G87553310o53207n44190O16312Q41975K52664p4625L0279L42667J17064k02894
3869G88279355R1552L10362K40206o3300k61128J07169L30806L32713K08855j67191
$$ plain form
3730.3 763222754 763921261 764935136 766279042 767453611 767892003 767869055 768446207 769475818 769949973
3748.7 769949973 770584524 771794200 772752047 773300946 773878932 774623096 775189221 775625467 776026249
3767.1 776026249 776517808 777333260 778035700 778366089 778710067 779304445 779813409 780034721 780314863 780749559
3787.5 780749559 781174123 781509399 781658292 781786799 781960547 781994343 782341480 782975912 783347487 783823490
3807.8 783823490 784324884 784462571 784377992 784505665 784730196 784775853 785213113 785724342 785960436 786117673
3828.2 786117673 786132336 786152840 786295772 786440969 786630452 786875784 787152410 787524521 787751973 787553310
3848.6 787553310 786900103 786355913 786972225 787814200 788066864 787992239 788022518 788365185 788482249 788279355
3869 788279355 788370907 788681269 788921475 788858175 788597047 788704216 789035022 789367735 789576590 789409399
3889.4G89409399r9659K23160J09434j75238k80976j20044J32025K73466J88887M1544
3909.8G89701998K384m2378n4300N4896N2154n7757P927J00076K0802j0311J57416
3932.3G89932907K81870J04427q0645o3598k980L2008M5061O0320L7491n9545m17J79767
3956.7G90466666J22369K1338J11997J48416J51038J77622J13249J10864J64449O8903
3977.1G91656911O140Q8811J17242P1824L1769M6491J31369J87755J42693Q3745
3997.5G92564750
$$ plain form
3889.4 789409399 789309740 789532900 789642334 789467096 789186120 789066076 789198101 789471567 789660454 789701998
3909.8 789701998 789704382 789662004 789607704 789662600 789714754 789656997 789664924 789765000 789785802 789775491 789932907
3932.3 789932907 790214777 790319204 790238559 790174961 790171981 790203989 790249050 790309370 790346861 790287316 790286899 790466666
3956.7 790466666 790589035 790610373 790722370 790870786 791021824 791199446 791312695 791423559 791588008 791656911
3977.1 791656911 791663051 791751862 791869104 791940928 791972697 792019188 792150557 792338312 792481005 792564750
3997.5 792564750
##END=$$ End of the data block
