##TITLE=$$ Begin of the data block
##JCAMP-DX=5.00 $$ ACD/SpecManager v 10.08
##SPECTROMETER/DATA SYSTEM=Alpha
##DATE=10 Apr 2014 09:27:12
##DATA TYPE=INFRARED SPECTRUM
##DATA CLASS=XYDATA
##ORIGIN=
##OWNER=
##NPOINTS=1765
##FIRSTX=399.75695801
##LASTX=3997.56933594
##MAXX=3997.56933594
##MINX=399.75695801
##MAXY=0.84090251
##MINY=0.13042161
##XFACTOR=1.0000000000
##YFACTOR=1.000000000000000e-9
##FIRSTY=0.57462049
##DELTAX=2.03957629
##XUNITS=1/CM
##YUNITS=ARBITRARY UNITS
##XYDATA=(X++(Y..Y))
399.8E74620485j224100l160358k636254j023411j587510j700879r07361j914561k952635
418.1E57513416o36459J21296j150012n03361n49138j720488r58562o20484k140641
436.5E49355567j414955L23117m57466q66473P9572o00576j089215K4080l52323j712024
456.9E43289304j038969p47978j802862j167178l96312j525163j622379o08981j414954
475.2E32964528j813651m11629l19362j326322q31604m31002j138389r03904n88536
493.6E25200129j650870j732529q01384j209617j449227o21796j001060j611292q50499
511.9E14271855q91268k038300j724124r35495j760959k248586j629591j881182k175778
530.3D98986572j324564j328081k051085j401037p49171j229316j032263m58956j086533
$$ y = [574620485, 573396385, 570236027, 567599773, 566576362, 564988852, 563287973, 562380612, 560466051, 557513416, 556876957, 556998253, 555848241, 555344880, 554795742, 553075254, 552116692, 551496208, 549355567, 547940612, 548263729, 547806263, 546939790, 547019362, 546418786, 545329571, 545353651, 545001328, 543289304, 542250335, 541502357, 539699495, 538532317, 538136005, 536610842, 534988463, 534379482, 532964528, 531150877, 530739248, 530419886, 529093564, 528261960, 527830958, 526692569, 525788665, 525200129, 523549259, 521816730, 521015346, 519805729, 518356502, 517734706, 516733646, 515122354, 514271855, 513380587, 511342287, 509618163, 508682668, 506921709, 504673123, 503043532, 501162350, 498986572, 497662008, 496333927, 494282842, 492881805, 492132634, 490903318, 489871055, 489412099, 488325566]
548.6D88325566j467198q73119j126140j720190j283378j296609k166242k208650k093941
567D74090099k878189k942800k249211k631575l119022k480596k450794l238589l211260
585.4D48888063l001451l560185l780097l492654l668308l533929k897621l164828
601.7D21788990l583461k504199j202464r99600j093000r86129n36770J127362L302157
620D15312886M020512L911198M345178M467845L910452L950179M099369L292680K512902
638.4D49823201J960605M87536j95086J784534L440827K205431k37346j660555K28345
656.7D57837492N199224P997900O338179L483296K641886L769219L437430L022849
673.1D93727475K990723K321065K186089K479136J996458J603246J888990J686633
$$ y = [488325566, 486858368, 485985249, 484859109, 483138919, 481855541, 480558932, 478392690, 476184040, 474090099, 471211910, 468269110, 466019899, 463388324, 460269302, 457788706, 455337912, 452099323, 448888063, 445886612, 442326427, 438546330, 435053676, 431385368, 427851439, 424953818, 421788990, 418205529, 415701330, 414498866, 413499266, 412406266, 411420137, 410883367, 412010729, 415312886, 419333398, 423244596, 427589774, 432057619, 435968071, 439918250, 444017619, 447310299, 449823201, 451783806, 452271342, 452076256, 453860790, 457301617, 459507048, 459269702, 457609147, 457837492, 463036716, 471034616, 477372795, 480856091, 483497977, 487267196, 490704626, 493727475, 496718198, 499039263, 501225352, 503704488, 505700946, 507304192, 509193182, 510879815]
689.4E10879815J154601J240194J139998N22376O84022J333833J372934J527130K229512
707.7E22084415K343178K039790K360821K534926K133011K281547K693713K326727
724E40798128K093374K422810K270579J867712K031267K030313J544177J661003K091944
742.4E58811307J875758J772106K204060K184391J993895K383172K525449K241671
758.7E75991809K487600K771974K394676K314568K611279K260983J659513J552701
775E94045103J133322K03133j23024r4414m48227l76165N64516J446903K365052L925324
795.4F02641523N256116N881429O586552P025480O459415N722403N289674M538894
811.7F49401486L696144L295004K621233J462400O73116k0743j283467k333223k736390
$$ y = [510879815, 512034416, 513274610, 514414608, 514936984, 515621006, 516954839, 518327773, 519854903, 522084415, 524427593, 526467383, 528828204, 531363130, 533496141, 535777688, 538471401, 540798128, 542891502, 545314312, 547584891, 549452603, 551483870, 553514183, 555058360, 556719363, 558811307, 560687065, 562459171, 564663231, 566847622, 568841517, 571224689, 573750138, 575991809, 578479409, 581251383, 583646059, 585960627, 588571906, 590832889, 592492402, 594045103, 595178425, 595381558, 595258534, 595164120, 594715893, 594339728, 594904244, 596351147, 598716199, 602641523, 607897639, 613779068, 620365620, 627391100, 633850515, 639572918, 644862592, 649401486, 653097630, 656392634, 659013867, 660476267, 661149383, 661128640, 659845173, 657511950, 654775560]
830.1F54775560l305316l803790l638625l583968l976643m058599l922701l744602
846.4F24741316k438843K88546L287732O105304Q847296J0678828J1116147J0975540
862.7F73601866J0495603R229123P745803O622434N422413M246116L560066K777040
879.1G23700464J619220R09447M46022m41611r82881p76767o35445l78013O61552J661300
899.4G25783288J989544K335608K570808J937449J002312L01420q54432k316118l116667
917.8G29633212l499031l696382k879143j268923O4909J271665K446712K654016K097904
936.2G26824939J853585J493633O35505K88725K90811l79145j112640j479507k468347
954.5G25947559l858149m758597n933046p914245r901404j2037278j4770150j6988516
$$ y = [654775560, 651470244, 647666454, 644027829, 640443861, 636467218, 632408619, 628485918, 624741316, 622302473, 622591019, 625878751, 631984055, 640831351, 651510179, 662626326, 673601866, 684097469, 693326592, 701072395, 707694829, 713117242, 717363358, 720923424, 723700464, 725319684, 726229131, 726675153, 726233542, 725250661, 724473894, 723838449, 723460436, 724121988, 725783288, 727772832, 730108440, 732679248, 734616697, 735619009, 735920429, 735065997, 732749879, 729633212, 726134181, 722437799, 719558656, 718289733, 718354642, 719626307, 722073019, 724727035, 726824939, 728678524, 730172157, 730807662, 731096387, 731387198, 731008053, 729895413, 728415906, 725947559, 722089410, 717330813, 711397767, 703483522, 693582118, 681544840, 666774690, 649786174]
970.8F49786174j7805040j7404437j5654266j2858033j0423064q910000p710457o699920
987.1E52320957n985260n063712l886044l063918k419293j491487p46309o32584j084924
1005.5E27947426k318680m235864n917668o900967p542908p875413p769316p701099
1021.8D77685511p887632p905870p710070p479190o921888n968243n036682m287511
1038.1D24488425l647595l353149l481299l690541l953456m248262l954708k703429
1054.5C95455986r48220P35104J896173J982361P56591j250267l337890n087435o128848
1072.8C84073555o419658o454349o549090o580144o757140p336915q110195q756757
1089.1C27109307q819848p662744n288809k570421k61545J295090J969188J946271
$$ y = [649786174, 631981134, 614576697, 598922431, 586064398, 575641334, 566731334, 559020877, 552320957, 546335697, 541271985, 537385941, 534322023, 531902730, 530411243, 529664934, 529032350, 527947426, 525628746, 521392882, 515475214, 508574247, 501031339, 493155926, 485386610, 477685511, 469797879, 461892009, 454181939, 446702749, 439780861, 433812618, 428775936, 424488425, 420840830, 417487681, 414006382, 410315841, 406362385, 402114123, 398159415, 395455986, 394507766, 395242870, 397139043, 399121404, 399877995, 398627728, 395289838, 390202403, 384073555, 377653897, 371199548, 364650458, 358070314, 351313174, 343976259, 335866064, 327109307, 318289459, 310626715, 305337906, 302767485, 302505940, 303801030, 305770218, 307716489]
1105.4C07716489J675725J262784N29378n12182k014578m431754p564545r162783o227434
1123.8B81271100l5584L975391L436983N27084j566738n42462K871394N720228O558955
1142.2C02216351N978346M823208L767878L148883K872706K903699L347278M152268
1158.5C33210617N265802O854356Q836448J0742962J2165130J2879878J2777000J2150318
1174.8D14882511J1445314J0635048R511202Q193016O640107M530340K080292k02358
1191.1D67715472k101392l186553k879918j232803J283825M093438O249160O923377
1207.4D76864606O281734N091518L773242K654105K125860J996129J858026J855731
1223.7E02500951K094567K245307K333820K587318K779305K823294K940356K968371
$$ y = [307716489, 309392214, 310654998, 311184376, 310672194, 308657616, 304225862, 296661317, 287498534, 281271100, 281235516, 285210907, 288647890, 289174974, 287608236, 287065774, 289937168, 295657396, 302216351, 308194697, 313017905, 316785783, 319934666, 322807372, 325711071, 329058349, 333210617, 338476419, 345330775, 354167223, 364910185, 377075315, 389955193, 402732193, 414882511, 426327825, 436962873, 446474075, 454667091, 461307198, 465837538, 467917830, 467715472, 465614080, 462427527, 459547609, 458314806, 459598631, 463692069, 469941229, 476864606, 483146340, 488237858, 492011100, 494665205, 496791065, 498787194, 500645220, 502500951, 504595518, 506840825, 509174645, 511761963, 514541268, 517364562, 520304918, 523273289]
1240.1E23273289K680123K336323K021492J471877R19819P57515Q26240J024961J637161
1258.4E36948800K606630L566981M567742N614996O319940O760836P195532P341504
1274.7E80922961P142544P010162O956756O761670O667078O787419O683767O291032
1291F35223389N927801N457222M758775M159570L616512K855837K211273J894057J490831
1309.4F67595267J020193R06885Q72374P27057R25243J299441J347542J346826J429439
1327.8F77470267J124322N00977j5557m62055p92742n03063N9068J45793J36376L12030
1348.1F77975416K56837n9843k32339m35472r13203j400351j646280j742661j938105
1366.5F69863999k172530k389014k887189l404379l940105o293178j0971308j2867748
$$ y = [523273289, 525953412, 528289735, 530311227, 531783104, 532702923, 533460438, 534286678, 535311639, 536948800, 539555430, 543122411, 547690153, 553305149, 559625089, 566385925, 573581457, 580922961, 588065505, 595075667, 602032423, 608794093, 615461171, 622248590, 628932357, 635223389, 641151190, 646608412, 651367187, 655526757, 659143269, 661999106, 664210379, 666104436, 667595267, 668615460, 669522345, 670394719, 671121776, 672047019, 673346460, 674694002, 676040828, 677470267, 678594589, 679095566, 679080009, 678617954, 677825212, 677322149, 677381217, 677527010, 677663386, 677975416, 678232253, 678172410, 677940071, 677504599, 676591396, 675191045, 673544765, 671802104, 669863999, 667691469, 665302455, 662415266, 659010887, 655070782, 648777604, 637806296, 624938548]
1382.8F24938548o218374M566908Q188009M087806M41372j193166j933574k676070
1399.1F30201459l102362l379047l760934l453612k841175k487361k189041j896143
1415.5F07091784j710772j230538n48959j89542k5273m9949J42098O37591Q88467J729965
1435.9F06734872L184974L203034L061057L197968L201782L608525M127622L993153
1452.2F34312987L797055N924880R674966Q100689O083906O697058P209897N979896
1468.5F87781334N735457P722556Q278728O421626M732251L337741K295255J190067
1484.8G27495015p4745r74714r20236j081467k381086l717840l635764l442288m017889
1503.2G07248986n974412q617401o234467m617155n320728n937814n562187m474878
$$ y = [624938548, 618720174, 623287082, 631475091, 635562897, 636004269, 634811103, 632877529, 630201459, 627099097, 623720050, 619959116, 616505504, 613664329, 611176968, 608987927, 607091784, 605381012, 604150474, 603601515, 603411973, 603386700, 603336751, 603478849, 604116440, 605004907, 606734872, 609919846, 613122880, 616183937, 619381905, 622583687, 626192212, 630319834, 634312987, 638110042, 644034922, 653709888, 661810577, 667894483, 674591541, 681801438, 687781334, 693516791, 701239347, 709518075, 715939701, 720671952, 724009693, 726304948, 727495015, 727420270, 726445556, 725525320, 724443853, 722062767, 718344927, 714709163, 711266875, 707248986, 701274574, 692657173, 686422706, 681805551, 676484823, 670547009, 664984822, 660509944]
1519.5F60509944m354537l867507l248214l409088l269732l508031l886760l206491
1535.8F31759584l126144m006088k779126r16183m32015m36902m05133l3319N7578
1554.1F19682252m45962o51240P13527L01242j242578k339065l528356m580081m489303
1572.5F03420436n552768p940531p456005o800830p867694q570135q766532q951366
1588.8E41514575r149551r083807q967221q706033q372575q265019q233309q081555
1605.1D72655505q041561q202254q026183p649571q369535r347409p241130o230950
1621.4D09546912p109195o568790n530715m776567l769517l320783k916307j056939
1637.8C74498099J68592N42968P03633J538545K950937K533495L138810O719172O066293
$$ y = [660509944, 656155407, 652287900, 649039686, 645630598, 642360866, 638852835, 634966075, 631759584, 628633440, 624627352, 621848226, 620932043, 620500028, 620063126, 619657993, 619624674, 619682252, 619236290, 618585050, 619298577, 619599819, 618357241, 616018176, 612489820, 607909739, 603420436, 597867668, 589927137, 582471132, 575670302, 567802608, 559232473, 550465941, 541514575, 532365024, 523281217, 514313996, 505607963, 497235388, 488970369, 480737060, 472655505, 464613944, 456411690, 448385507, 440735936, 432366401, 423018992, 415777862, 409546912, 402437717, 395868927, 390338212, 385561645, 381792128, 378471345, 375555038, 374498099, 374666691, 375209659, 375913292, 377451837, 380402774, 382936269, 386075079, 392794251, 398860544]
1656.1C98860544M819065N654097P582366Q672983P560432Q410185J0923565J0219246
1672.4D62702483J0730237J2395322J0993868R641200J1222363J6619205J5254498
1686.7E49559176J2001634J2301147J0948300J1497080J3303101J3558269J5662491
1701F38831198J2458086R997308J0536314R033322P320702O199896N795539P193267
1717.3G07365632P535696N752266M945516M849374M290998L798128L354370M311979
1733.6G46203959N282938M017592L886402M393637M195034L829181L693521M175246
1749.9G79677510M583001L718794L001690K747476K386868K513587K382338J743079
1766.3H02754343J290559J049579J584529K417565K016246J393557J379668J545549
$$ y = [398860544, 403679609, 409333706, 416916072, 425589055, 433149487, 441559672, 452483237, 462702483, 473432720, 485828042, 496821910, 506463110, 517685473, 534304678, 549559176, 561560810, 573861957, 584810257, 596307337, 609610438, 623168707, 638831198, 651289284, 661286592, 671822906, 680856228, 688176930, 694376826, 700172365, 707365632, 714901328, 720653594, 725599110, 730448484, 734739482, 738537610, 741891980, 746203959, 751486897, 755504489, 759390891, 763784528, 767979562, 771808743, 775502264, 779677510, 784260511, 787979305, 790980995, 793728471, 796115339, 798628926, 801011264, 802754343, 804044902, 805094481, 806679010, 809096575, 811112821, 812506378, 813886046, 815431595]
1782.6H15431595J442730J290262R32634N22196J007140J568913J189411P10130R10938
1800.9H25005949J228094R60409O39081N59449O28889P46846P72715O07490M68135
1819.3H31617057L88861K45929J79827K27392M36067P83682P30574M95375L93986J86146
1839.7H35684896o0499J0729M78625P13050O33002L76820K17259K93434J99556Q1301
1860.1H38628173J83642N4478l80694j99438N79954O38067K91646K28822J66178J7464
1880.5H40208292P6354J04904j04487j26720J77443J62542R299J60455J55449n603
1900.9H40817928L5405M9174j20759q8095J39296O0975k22027k23517k8670m0531L0815
1923.3H40409994J64390L993j12772n5015q9109j52707j22666k48730m16398j83702
$$ y = [815431595, 816874325, 818164587, 819097221, 819619417, 820626557, 822195470, 823384881, 824095011, 825005949, 826234043, 827194452, 827833533, 828392982, 829021871, 829768717, 830541432, 831148922, 831617057, 832005918, 832251847, 832431674, 832659066, 833095133, 833878815, 834609389, 835104764, 835498750, 835684896, 835624397, 835635126, 836113751, 836826801, 837459803, 837836623, 838053882, 838347316, 838546872, 838628173, 838811815, 838866293, 838485599, 838286161, 838866115, 839504182, 839795828, 840024650, 840190828, 840208292, 840284646, 840389550, 840285063, 840158343, 840335786, 840498328, 840507627, 840668082, 840823531, 840817928, 840853333, 840902507, 840781748, 840693653, 840832949, 840893924, 840671897, 840448380, 840419710, 840379179, 840409994, 840574384, 840578377, 840465605, 840410590, 840321481, 840168774, 840046108, 839797378, 839380980, 839197278]
1943.7H39197278M6968p9572j59800j26123k13146k82646k13742j93059k66135l10600
1964.1H37399423k94328k24828j63377j44303j82747k36273k04206k25901l02196k52783
1984.5H35168481j94729l20136l97325k05516j06276k40206k72155k09689k69830l31700
2004.9H32620919l11733l07798l14891k98143l49521l99948k86638k17378k91050k93672
2025.3H29550147k20001k80738l59892k85864k52545l32356l16560k37584k85566k99036
2045.7H26680005k10166k37108l21388k56956k04503k79546k71559j97708k34306k28107
2066.1H24238658r6440j08123k15769j62840q6129j60575j44839m6670j41144k27451
2086.5H22848678j20640q8632j64569n8591N7876l3855o9201J4186l0816q3506K7239
$$ y = [839197278, 839244246, 839164674, 839004874, 838878751, 838665605, 838382959, 838169217, 837976158, 837710023, 837399423, 837105095, 836880267, 836716890, 836572587, 836389840, 836153567, 835949361, 835723460, 835421264, 835168481, 834973752, 834653616, 834256291, 834050775, 833944499, 833704293, 833432138, 833222449, 832952619, 832620919, 832309186, 832001388, 831686497, 831388354, 831038833, 830638885, 830352247, 830134869, 829843819, 829550147, 829330146, 829049408, 828689516, 828403652, 828151107, 827818751, 827502191, 827264607, 826979041, 826680005, 826469839, 826232731, 825911343, 825654387, 825449884, 825170338, 824898779, 824701071, 824466765, 824238658, 824142218, 824034095, 823818326, 823655486, 823569357, 823408782, 823263943, 823217273, 823076129, 822848678, 822728038, 822639406, 822474837, 822416246, 822474122, 822440267, 822371066, 822385252, 822354436, 822270930, 822298169]
2108.9H22298169K6941q9943l1590P6353J2994r596J03771J01328J9670O7830R0301
2131.3H22666228J3768P5758J47045L6299K0981J67310J39952L4690J19328J53005
2151.7H23574364L7074O5744J51456N4419L5941J80841J62959L9339R5427J50025O8724
2174.2H24616313J16169J78218L6836p15J48356J13308p212Q9347J40906J0490K0683
2196.6H25462699J06215j3768q1003O6161Q7261j78Q0645J07705n3406m9293O9917
2219H25782955l4035j02520L9161M2200o1095j1206J7703o7651k7299M9650r8705j74999
2243.5H25354159l576j1683j76370j19984l6955j26064j12414n603m6492p6890K8670
2265.9H24666798J7464q4579K027J00911K7894L6717J33038O9856J0193O6757N960
$$ y = [822298169, 822325110, 822235167, 822203577, 822279930, 822292924, 822283328, 822387099, 822488427, 822508097, 822575927, 822666228, 822679996, 822755754, 822902799, 822939098, 822960079, 823127389, 823267341, 823302031, 823421359, 823574364, 823611438, 823677182, 823828638, 823883057, 823918998, 824099839, 824262798, 824302137, 824397564, 824547589, 824616313, 824732482, 824910700, 824947536, 824946821, 825095177, 825208485, 825201273, 825290620, 825431526, 825442016, 825462699, 825568914, 825555146, 825474143, 825540304, 825627565, 825627387, 825708032, 825815737, 825762331, 825713038, 825782955, 825748920, 825646400, 825685561, 825727761, 825666666, 825655460, 825673163, 825605512, 825578213, 825627863, 825529158, 825354159, 825350583, 825338900, 825162530, 825042546, 825005591, 824879527, 824767113, 824761510, 824715018, 824638128, 824666798, 824684262, 824599683, 824601710, 824702621, 824730515, 824767232, 824900270, 824970126, 824980319, 825047076, 825053036]
2288.4H25053036j23977r4057m7564j56522j87278q9705j39355k73049k65181k51055
2308.8H23425293k78771j53661r1731l33369n61416m93109l33667k90573k95579k95222
2329.2H20298195k56062j19805n5015j86265k20239P2778N40077J089573J049221L2246
2349.6H22244704j113177j491248j032531m73679m5955L37959N53965P64311J140415
2367.9H20884764J357913J304984J288176J279235J100182R37224Q75592O96063M03583
2386.3H30127716K46167J64330M7207O4790J87755J57118M8935O1274L8326m5598K3305
2408.7H31121325J10627K5749p510N9724k5034j64152j30295p5341p3373N4836J66059
2431.2H31062615P8082J9610P7724K8074o0856k563o735j14918n5075M7863k8313p4267
$$ y = [825053036, 824929059, 824835002, 824787438, 824630916, 824443638, 824353933, 824214578, 823941529, 823676348, 823425293, 823146522, 822992861, 822901130, 822567761, 822006345, 821513236, 821179569, 820888996, 820593417, 820298195, 820042133, 819922328, 819867313, 819681048, 819460809, 819533587, 820073664, 821163237, 822212458, 822244704, 821131527, 819640279, 818607748, 818134069, 818088114, 818426073, 818980038, 819744349, 820884764, 822242677, 823547661, 824835837, 826115072, 827215254, 828152478, 829028070, 829724133, 830127716, 830373883, 830538213, 830585420, 830650210, 830837965, 830995083, 831044018, 831105292, 831143618, 831098020, 831121325, 831231952, 831257701, 831250191, 831309915, 831284881, 831120729, 830990434, 830915093, 830841720, 830896556, 831062615, 831140697, 831160307, 831238031, 831266105, 831205249, 831202686, 831195951, 831081033, 831025958, 831073821, 831045508, 830971241]
2455.6H30971241o56l1411j06991m6610k6227j25765j03772j8120q8930j19984j2398
2478.1H30290377l5941j58012j07050k1935j14620j47163n3227r1732j44362n7638
2498.5H29358697n5492j38402j04487p2718j44779j33515l7431q8334j86325j14858
2518.9H28282356q4758j64449j09136n9485j62185j69217p2003r9122j74463j44005
2539.2H27043533j43528k05814j50204q2970j53541j55271n9366j10626k19643j90377
2559.6H25572193j65582k24233k02715j35899j85370k35438j90080k11835k78055k45571
2580H23497415k35200l16084k99811k28107l07381l71695l18825l49641m07576l44456
2600.4H20318639l21746m10080m38153m18067m52638m32432l27646l51489m60744m31895
$$ y = [830971241, 830970585, 830939174, 830832183, 830785573, 830759346, 830633581, 830529809, 830511689, 830422759, 830302775, 830290377, 830254436, 830096424, 829989374, 829967439, 829852819, 829705656, 829652429, 829560697, 829416335, 829358697, 829303205, 829164803, 829060316, 828987598, 828842819, 828709304, 828671873, 828583539, 828397214, 828282356, 828197598, 828033149, 827924013, 827864528, 827702343, 827533126, 827461123, 827362001, 827187538, 827043533, 826900005, 826694191, 826543987, 826461017, 826307476, 826152205, 826092839, 825982213, 825762570, 825572193, 825406611, 825182378, 824979663, 824843764, 824658394, 824422956, 824232876, 824021041, 823742986, 823497415, 823262215, 822946131, 822646320, 822418213, 822110832, 821739137, 821420312, 821070671, 820663095, 820318639, 819996893, 819586813, 819148660, 818730593, 818277955, 817845523, 817517877, 817166388, 816705644, 816273749]
2620.8H16273749l97623m78208m77254m16875m60982m59373l69013m06682m94242m30107
2641.2H11883390l78430m65393m87983m11928m36544m96149m36426m08768m75347m63307
2661.6H07423115m24028m75526m67121l75211m10736n08666m77850m37975n03421n39959
2682H02802622n10692n07057m88043m77075n76079o27518n34654n02765n76734n70894
2702.4G97431111n25474n97835o53267o01172o08802o78718o57380o06715o28710o15418
2722.8G91257620n76675o28769o58453o11961o52373p07626o21855n69761o42657o46532
2743.2G84940958n85198o10114o40511o14524o57797p40289p44641p42317p84516p49767
2763.6G78071284o63399p03931p76530p69019q31484r28760q97229q74221r45449r49562
$$ y = [816273749, 815876126, 815397918, 814920664, 814503789, 814042807, 813583434, 813214421, 812807739, 812313497, 811883390, 811504960, 811039567, 810551584, 810139656, 809703112, 809206963, 808770537, 808361769, 807886422, 807423115, 806999087, 806523561, 806056440, 805681229, 805270493, 804761827, 804283977, 803846002, 803342581, 802802622, 802291930, 801784873, 801296830, 800819755, 800243676, 799616158, 799081504, 798578739, 798002005, 797431111, 796905637, 796307802, 795654535, 795053363, 794444561, 793765843, 793108463, 792501748, 791873038, 791257620, 790680945, 790052176, 789393723, 788781762, 788129389, 787421763, 786799908, 786230147, 785587490, 784940958, 784355760, 783745646, 783105135, 782490611, 781832814, 781092525, 780347884, 779605567, 778821051, 778071284, 777407885, 776703954, 775927424, 775158405, 774326921, 773398161, 772500932, 771626711, 770681262, 769731700]
2784G69731700r05394r31859r83238j009286j060962j115323j094997j127064j264930
2802.3G60238647j280605j173616j179039j283109j335502j355410j391053j387000
2818.7G49853313j402915j532793j630485j611650j637756j729727j812935k007544
2835G36487508k321541k653301l102780l726124m334510m628420m310071l324807k160787
2853.3G05925167j425326j143098j073301j235664j629352k062977k406537k605200
2869.7F92343712k555967k313196k089262j892388j678050j571178j661658j835943
2886F76746070j940071k030730k146721k196670k300262k501607k566517k575338k759695
2904.3F55728459l038764l334939l775418m327297m655838m568637m155218l550887
$$ y = [769731700, 768826306, 767894447, 766911209, 765901923, 764840961, 763725638, 762630641, 761503577, 760238647, 758958042, 757784426, 756605387, 755322278, 753986776, 752631366, 751240313, 749853313, 748450398, 746917605, 745287120, 743675470, 742037714, 740307987, 738495052, 736487508, 734165967, 731512666, 728409886, 724683762, 720349252, 715720832, 711410761, 708085954, 705925167, 704499841, 703356743, 702283442, 701047778, 699418426, 697355449, 694948912, 692343712, 689787745, 687474549, 685385287, 683492899, 681814849, 680243671, 678582013, 676746070, 674805999, 672775269, 670628548, 668431878, 666131616, 663630009, 661063492, 658488154, 655728459, 652689695, 649354756, 645579338, 641252041, 636596203, 632027566, 627872348, 624321461]
2920.6F24321461k898991k307773j692176j060724o51539l10838K66075Q78811J322866
2939F17867172J725793J982987J825571J336097P80106K71201k30789n77867n92232
2957.4F24388039m05133j55329P3373K11716L26097M54306M90308L75569K22564J55687
2977.8F26137197J10567p451q8453p0453n7101q1778k65956o47306r21488j127601
2998.1F22980177j444995j647770j683116j729310j748562j667022j688004j890659
3014.5F09480739k048612k096891k171159k233625k210617k230704k299726k285301
3030.8E91904104k227545k360225k580285k553165k462387k560019k752006k911866
3047.1E71496606k899587k806008k858281k958477k978504k942562k870202k762019
$$ y = [624321461, 621422470, 619114697, 617422521, 616361797, 615710258, 615399420, 615665495, 616544306, 617867172, 619592965, 621575952, 623401523, 624737620, 625517726, 625788927, 625558138, 624980271, 624388039, 623982906, 623827577, 623900950, 624112666, 624438763, 624893069, 625383377, 625758946, 625981510, 626137197, 626247764, 626240313, 626151860, 626081407, 626024306, 625942528, 625676572, 625029266, 624107778, 622980177, 621535182, 619887412, 618204296, 616474986, 614726424, 613059402, 611371398, 609480739, 607432127, 605335236, 603164077, 600930452, 598719835, 596489131, 594189405, 591904104, 589676559, 587316334, 584736049, 582182884, 579720497, 577160478, 574408472, 571496606, 568597019, 565791011, 562932730, 559974253, 556995749, 554053187, 551182985, 548420966]
3063.4E48420966k661825k700746k856731k910256k790749k624155k557158k709746
3079.7E26609600k912760k912104k852679k844333k858639k974331l075123l004074
3096E03175557k886117k945036l135621l172517l058374l078699l267914l288418l115356
3114.4D75227505l113687l293812l503323l668606l664047l559977l527730l593862
3130.7D47302461l663898l626078l529698l559202l772139l947527l926038l808827
3147D17469054l690093l654033l803611m022926m063636l967315l913552l934949l978461
3165.4C82440478l997326l970027l906787l888726l930390l944188l871620l835976
3181.7C51095438l899574l914804l817796l725499l739894l766775l742993l703266
$$ y = [548420966, 545759141, 543058395, 540201664, 537291408, 534500659, 531876504, 529319346, 526609600, 523696840, 520784736, 517932057, 515087724, 512229085, 509254754, 506179631, 503175557, 500289440, 497344404, 494208783, 491036266, 487977892, 484899193, 481631279, 478342861, 475227505, 472113818, 468820006, 465316683, 461648077, 457984030, 454424053, 450896323, 447302461, 443638563, 440012485, 436482787, 432923585, 429151446, 425203919, 421277881, 417469054, 413778961, 410124928, 406321317, 402298391, 398234755, 394267440, 390353888, 386418939, 382440478, 378443152, 374473125, 370566338, 366677612, 362747222, 358803034, 354931414, 351095438, 347195864, 343281060, 339463264, 335737765, 331997871, 328231096, 324488103, 320784837]
3198C20784837l641844l566682l502309l439457l376394l328026l311902l289074l207087
3216.4B90122062l130376l122419l137738l070444k951056k865135k767802k685010
3232.7B66392082k724797k794265k753854k646178k521664k396047k324760k376109
3249B45854408k417118k313524k217174k219751k234310k228156k206042k149061k071664
3267.4B25797608k002358j989767k071008k160400k133399k040506j994893j994610
3283.7B09410667j990109j957730j918614j905247j934216j980230k019137k006456
3300A93698928j897067j800805j864329k012834k089560k074466k009704j949623j914576
3318.4A76085964j853436j780033j770691j818239j832292j786515j753881j678780
$$ y = [320784837, 317142993, 313576311, 310074002, 306634545, 303258151, 299930125, 296618223, 293329149, 290122062, 286991686, 283869267, 280731529, 277661085, 274710029, 271844894, 269077092, 266392082, 263667285, 260873020, 258119166, 255472988, 252951324, 250555277, 248230517, 245854408, 243437290, 241123766, 238906592, 236686841, 234452531, 232224375, 230018333, 227869272, 225797608, 223795250, 221805483, 219734475, 217574075, 215440676, 213400170, 211405277, 209410667, 207420558, 205462828, 203544214, 201638967, 199704751, 197724521, 195705384, 193698928, 191801861, 190001056, 188136727, 186123893, 184034333, 181959867, 179950163, 178000540, 176085964, 174232528, 172452495, 170681804, 168863565, 167031273, 165244758, 163490877, 161812097]
3334.7A61812097j513496j477391j625105j698748j669988j575500j407697j413614
3351A49430558j564264j545474j343310j179397j182348j190245r93907q34912r75147
3369.3A38621554j217321j217693r57042p71865p33018p24226o55204m72084k08139
3387.7A31664962p90j09911m23327m11973K3947K73868l7327l75390j82450J50501
3408.1A30572110K45825K54840K00986J45048K72259M53324N07324O10143Q46044J023098
3428.5A35131001R41113R20147J113877R97707O24075O09190R25690J194760J362428
3446.8A43819988J378089J341149J433432J617283J801744J927450J841158J846015
3463.2A57006308K225414K428651K062917J582220J637846K051860K418980K470270
$$ y = [161812097, 160298601, 158821210, 157196105, 155497357, 153827369, 152251869, 150844172, 149430558, 147866294, 146320820, 144977510, 143798113, 142615765, 141425520, 140431613, 139596701, 138621554, 137404233, 136186540, 135229498, 134457633, 133724615, 133000389, 132345185, 131873101, 131664962, 131664172, 131554261, 131130934, 130718961, 130742908, 131016776, 130979449, 130604059, 130421609, 130572110, 130817935, 131072775, 131273761, 131418809, 131691068, 132144392, 132651716, 133261859, 134107903, 135131001, 136072114, 136992261, 138106138, 139103845, 139727920, 140337110, 141262800, 142457560, 143819988, 145198077, 146539226, 147972658, 149589941, 151391685, 153319135, 155160293, 157006308, 159231722, 161660373, 163723290, 165305510, 166943356, 168995216, 171414196, 173884466]
3479.5A73884466K202705K166033K484396K619937K522096K592563K811268K983228
3495.8A94266692K903789K824873K972200K930731K679095K797842L278166L635555
3512.1B18288943L541440L215030L229826L593967L999322L900841L549397L726885
3528.4B47045651M099593M234165M394859M481375M299104M371911M688025M874140
3544.7B82488823M734307M489810M636824N036890N103261N038619N262285N304218
3561.1C22095037M894733N054086O545782P031352O001234N682260O114930O467253
3577.4C69886667O705552O761223O415963O482899P512153P738918O797134O866903
3593.7D25167412P605284P836163P942796P968634P444531P160872Q036643Q533955
$$ y = [173884466, 176087171, 178253204, 180737600, 183357537, 185879633, 188472196, 191283464, 194266692, 197170481, 199995354, 202967554, 205898285, 208577380, 211375222, 214653388, 218288943, 221830383, 225045413, 228275239, 231869206, 235868528, 239769369, 243318766, 247045651, 251145244, 255379409, 259774268, 264255643, 268554747, 272926658, 277614683, 282488823, 287223130, 291712940, 296349764, 301386654, 306489915, 311528534, 316790819, 322095037, 326989770, 332043856, 338589638, 345620990, 351622224, 357304484, 363419414, 369886667, 376592219, 383353442, 389769405, 396252304, 403764457, 411503375, 418300509, 425167412, 432772696, 440608859, 448551655, 456520289, 463964820, 471125692, 479162335, 487696290]
3610D87696290Q215696Q123546P750094Q413375R835005Q678257O607711O231189Q911610
3628.4E60462773J0832071Q592129P688820P777334P486104P314504O705284N548179
3644.7F22407198N489886Q116007R481251O697833N427778O599188O410599N137622
3661F75767362M526496L840923L151238L829539M493594L264428L775954M941344L950179
3679.4G11541057L196895K648592J995504K215266L230154L295005K558410K003729
3695.7G32684612J524210J295388J756907J938819J153291M57585Q51571K232790K354443
3714G46249616J260460O31749N72264P09355R12309J100421P90059M7565j87516P59601
3734.4G52845883K023816J531899n9n43237M47512P09533j3530Q71837J944006J170337
$$ y = [487696290, 495911986, 504035532, 511785626, 520199001, 530034006, 538712263, 545319974, 551551163, 560462773, 571294844, 579886973, 587575793, 595353127, 602839231, 610153735, 616859019, 622407198, 627897084, 636013091, 645494342, 652192175, 657619953, 664219141, 670629740, 675767362, 680293858, 684134781, 687286019, 691115558, 695609152, 698873580, 702649534, 707590878, 711541057, 714737952, 717386544, 719382048, 721597314, 724827468, 728122473, 730680883, 732684612, 734208822, 735504210, 737261117, 739199936, 740353227, 740810812, 741662383, 743895173, 746249616, 747510076, 748141825, 748714089, 749423444, 750335753, 751436174, 752226233, 752273798, 752086282, 752845883, 754869699, 756401598, 756401539, 755858302, 756305814, 757015347, 757001817, 757873654, 759817660, 760987997]
3754.8G60987997M11093O46234R49561M84825J05500J52171N73098J048029P33018
3773.2G66091526R5307j3947M09067N51045K72393L20375M50134L52740J40369k33948
3793.6G68435061l60131l10839k70843M33981P63774N18918Q34763N98312k62559o95109
3814G69685328l80039j44005P5042R02832P40826J97291L9161j87040l06070l88086
3834.4G70235240l30209K41577P07746P62939P33614J80066q99494j655817n77032
3852.7G69398630J729965J250684P510m86433l75390K7179j08122j50502M18127N86867
3873.1G72298515M37260j4067m01735j19031J63972L59476K08437j68502J92881L95477
3893.5G73352683k70188q17120p22409q7678O78182R79840N55396N2214j90020l86416
$$ y = [760987997, 761399090, 762045324, 762994885, 763479710, 763585210, 763737381, 764310479, 765358508, 766091526, 766186833, 766172886, 766581953, 767132998, 767405391, 767725766, 768175900, 768528640, 768669009, 768435061, 768074930, 767764091, 767493248, 767927229, 768691003, 769209921, 770044684, 770642996, 770380437, 769685328, 769305289, 769161284, 769236326, 770139158, 770879984, 771077275, 771116436, 770929396, 770623326, 770235240, 769905031, 770146608, 770854354, 771617293, 772350907, 772530973, 771631479, 769975662, 769398630, 771128595, 772379279, 772386789, 771900356, 771524966, 771552145, 771444023, 771293521, 771711648, 772298515, 772735775, 772721708, 772319973, 772200942, 772364914, 772724390, 772932827, 772764325, 772957206, 773352683, 773082495, 772265375, 771542966, 771455288, 772133470, 773113310, 773668706, 773720920, 773530900, 773144484]
3913.9G73144484l72112M1187K31504o8367j07347J47879j4544j49131K69115M45545
3934.3G73568213N1141k68162j95026O4075Q5414k9982K9087Q5831N3287K4736L337
3956.7G73471951L1829Q1003P9930J7702o0021j9730Q8573J52707K12550J17362o3122
3979.2G74110734j847J30117J02281N8651O6459M2022l0160m2379N2810
3997.5G74488688
$$ y = [773144484, 772772372, 772813559, 773045063, 772976696, 772869349, 773017228, 773002684, 772853553, 773122668, 773568213, 773619354, 773351192, 773156166, 773220241, 773305655, 773275673, 773304760, 773390591, 773443878, 773468614, 773471951, 773503780, 773584783, 773664713, 773682415, 773622394, 773602664, 773691237, 773843944, 774056494, 774173856, 774110734, 774108887, 774239004, 774341285, 774399936, 774466395, 774508417, 774478257, 774435878, 774488688]
##END=$$ End of the data block
