##TITLE=$$ Begin of the data block
##JCAMP-DX=5.00 $$ ACD/SpecManager v 10.08
##SPECTROMETER/DATA SYSTEM=Alpha
##DATE=10 Apr 2014 09:27:12
##DATA TYPE=INFRARED SPECTRUM
##DATA CLASS=XYDATA
##ORIGIN=
##OWNER=
##NPOINTS=1765
##FIRSTX=399.75695801
##LASTX=3997.56933594
##MAXX=3997.56933594
##MINX=399.75695801
##MAXY=0.84151733
##MINY=0.13036540
##XFACTOR=1.0000000000
##YFACTOR=1.000000000000000e-9
##FIRSTY=0.57489103
##DELTAX=2.03957629
##XUNITS=1/CM
##YUNITS=ARBITRARY UNITS
##XYDATA=(X++(Y..Y))
399.8E74891031j323521k730310k559066j573026k281010j924575l75151j098812k432704
$$ 574891031 573567510 570837200 568278134 566705108 564424098 562499523 562124372 561025560 558592856
418.1E58592856j171291q92579j493574m0948K15352j491309j546383j169681j946330
$$ 558592856 557421565 556528986 555035412 554994464 555209816 553718507 552172124 551002443 549056113
436.5E49056113j101852J93417n10752o33776J64509q06749j406729j65344j47879
$$ 549056113 547954261 548147678 547636926 547003150 547167659 546360910 544954181 544788837 544640958
454.8E44640958j200795o61611o38664j861096j319110m54783j465440j692176p32780
$$ 544640958 543440163 542778552 542139888 540278792 538959682 538504899 537039459 535347283 534614503
473.2E34614503j319527j604140l67522n48244j452625o61552l77118j277328r88125
$$ 534614503 533294976 531690836 531323314 530775070 529322445 528660893 528283775 527006447 526018322
491.5E26018322o65069j762331j796186p52091j094639j464606o24954q03352j540243
$$ 526018322 525353253 523590922 521794736 521042645 519948006 518483400 517858446 517055094 515514851
509.9E15514851j130939j103043j919926j590848r37521j705587k070367j543045j961410
$$ 515514851 514383912 513280869 511360943 509770095 508832574 507126987 505056620 503513575 501552165
528.3E01552165k280206j464814j478702k074629j350939p85112j327455j093746l96907
$$ 501552165 499271959 497807145 496328443 494253814 492902875 492117763 490790308 489696562 489299655
546.6D89299655r04411j352072q90314j132429j664251j212776j263887k157747k116621
$$ 489299655 488395244 487043172 486152858 485020429 483356178 482143402 480879515 478721768 476605147
565D76605147j940787k817005l078520k478957k759576l157735k556264k483517l097177
$$ 476605147 474664360 471847355 468768835 466289878 463530302 460372567 457816303 455332786 452235609
583.3D52235609l043353k962917l635913l926188l636211l734917l508270k834230
$$ 452235609 449192256 446229339 442593426 438667238 435031027 431296110 427787840 424953610
599.6D24953610l132075l615499k538741j119107q47548j004398j024007o65188J116782
$$ 424953610 421821535 418206036 415667295 414548188 413700640 412696242 411672235 411007047 412123829
618D12123829L429890M113138L936380M263162M325301L860742L992647M186838L401488
$$ 412123829 415553719 419666857 423603237 427866399 432191700 436052442 440045089 444231927 447633415
636.3D47633415K503515J839757M53591j94490J735389L450215K262682j81675j629949
$$ 447633415 450136930 451976687 452430278 452235788 453971177 457421392 459684074 459502399 457872450
654.7D57872450J32263N062193P985532O347537L463686K749651L965676L436029K884984
$$ 457872450 458004713 463066906 471052438 477399975 480863661 483613312 487578988 491015017 493900001
673.1D93900001K860755K312302K264291K574742K087236J622259J828671J623869
$$ 493900001 496760756 499073058 501337349 503912091 505999327 507621586 509450257 511074126
689.4E11074126J113593J217127J141250N65410P83503J395762J333475J456380K152145
$$ 511074126 512187719 513404846 514546096 515111506 515895009 517290771 518624246 520080626 522232771
707.7E22232771K250016J982331K384126K564550K077639K229452K739250K408743
$$ 522232771 524482787 526465118 528849244 531413794 533491433 535720885 538460135 540868878
724E40868878K166093K442538K184332J805484K117634K135158J533866J581370K008021
$$ 540868878 543034971 545477509 547661841 549467325 551584959 553720117 555253983 556835353 558843374
742.4E58843374J820028J779914K254426K249241K052307K370835K454340K189160
$$ 558843374 560663402 562443316 564697742 566946983 568999290 571370125 573824465 576013625
758.7E76013625K492845K853155K459884K271354K568364K253234J606584J481771
$$ 576013625 578506470 581359625 583819509 586090863 588659227 590912461 592519045 594000816
775E94000816J121402K71261p8738j25706m88818l82423N84006J438022K348423L972828
$$ 594000816 595122218 595393479 595314741 595189035 594700217 594317794 594901800 596339822 598688245 602661073
795.4F02661073N335510N912423O553590O947637O415665N784631N360246M511952
$$ 602661073 607996583 613909006 620462596 627410233 633825898 639610529 644970775 649482727
811.7F49482727L589690L214240K668977J558900O86287m7981j290560k340019k743423
$$ 649482727 653072417 656286657 658955634 660514534 661200821 661152840 659862280 657522261 654778838
830.1F54778838l312647l828108l654838l538370l908575m027068l888131l728270
$$ 654778838 651466191 647638083 643983245 640444875 636536300 632509232 628621101 624892831
846.4F24892831k500236J99020L218889O074309Q889437J0765314J1185289J1020362
$$ 624892831 622392595 622591615 625810504 631884813 640774250 651539564 662724853 673745215
862.7F73745215J0514736R205401P724106O627441N381882M190326L580749K873719
$$ 673745215 684259951 693465352 701189458 707816899 713198781 717389107 720969856 723843575
879.1G23843575J723110Q97050L74973m26769r82941q63611o93321l59714O91473J691043
$$ 723843575 725566685 726463735 726838708 726411939 725428998 724565387 723872066 723512352 724203825 725894868
899.4G25894868K038837K343654K529502J913488J008571L03745q74222k316892l073156
$$ 725894868 727933705 730277359 732806861 734720349 735728920 736032665 735158443 732841551 729768395
917.8G29768395l452241l688395k891243j247882Q4698J228750K367556K611041K135634
$$ 729768395 726316154 722627759 719736516 718488634 718573332 719802082 722169638 724780679 726916313
936.2G26916313J905739J502753O42001K72572K29240m05133j089513j473308k459228
$$ 726916313 728822052 730324805 730966806 731239378 731468618 731063485 729973972 728500664 726041436
954.5G26041436l820777m761696n977273p908225r829998j1964023j4771342j7054021
$$ 726041436 722220659 717458963 711481690 703573465 693743467 681779444 667008102 649954081
970.8F49954081j7837584j7398954j5650511j2848496j0419190q917987p711828o690622
$$ 649954081 632116497 614717543 599067032 586218536 575799346 566881359 559169531 552478909
987.1E52478909n994558n115449l945470l090084k412915j459420p29084o77108j157880
$$ 552478909 546484351 541368902 537423432 534333348 531920433 530461013 529731929 529054821 527896941
1005.5E27896941k348006m204452n861640o851852p535696p905722p773250p663310
$$ 527896941 525548935 521344483 515482843 508630991 501095295 493189573 485416323 477753013
1021.8D77753013p843911p874966p697344p479816o894678n925984n045771m309028
$$ 477753013 469909102 462034136 454336792 446856976 439962298 434036314 428990543 424681515
1038.1D24681515l644974l368109l502786l672660l913968m242182l946781k655328
$$ 424681515 421036541 417668432 414165646 410492986 406579018 402336836 398390055 395734727
1054.5C95734727r50425O71416J881689J993269P12484j280874l315062n073875o122291
$$ 395734727 394784302 395455718 397337407 399330676 400043160 398762286 395447224 390373349 384251058
1072.8C84251058o402105o437033o537229o593585o757647p298470q117824q831591
$$ 384251058 377848953 371411920 364874691 358281106 351523459 344224989 336107165 327275574
1089.1C27275574q873850p660150n243153k510726k58178J227707J919210J979530
$$ 327275574 318401724 310741574 305498421 302987695 302729517 303957224 305876434 307855964
1105.4C07855964J740873J301080N38587n23150k026200m460931p601947r160250o223470
$$ 307855964 309596837 310897917 311436504 310913354 308887154 304426223 296824276 287664026 281440556
1123.8B81440556p8410L952146L482997N72413j551002n28723K846748N652070O533861
$$ 281440556 281362146 285314292 288797289 289369702 287818700 287289977 290136725 295788795 302322656
1142.2C02322656O012559M846841L753036L118545K869248K946943L398151M158020
$$ 302322656 308335215 313182056 316935092 320053637 322922885 325869828 329267979 333425999
1158.5C33425999N234122O820649Q809864J0721565J2153029J2893707J2835204J2203843
$$ 333425999 338660121 345480770 354290634 365012199 377165228 390058935 402894139 415097982
1174.8D15097982J1413872J0570049R500414Q211136O650746M554629K104313k19673
$$ 415097982 426511854 437081903 446582317 454793453 461444199 465998828 468103141 467883468
1191.1D67883468k129674l190756k857387j177907J325458M082948O222040O907552
$$ 467883468 465753794 462563038 459705651 458527744 459853202 463936150 470158190 477065742
1207.4D77065742O271929N078464L779978K693355K139211J966625J837313J858950
$$ 477065742 483337671 488416135 492196113 494889468 497028679 498995304 500832617 502691567
1223.7E02691567K094746K246201K341449K591371K788186K831102K941489K973318
$$ 502691567 504786313 507032514 509373963 511965334 514753520 517584622 520526111 523499429
1240.1E23499429K696216K340198K002239J487076R90570P96795P82072R97246J681506
$$ 523499429 526195645 528535843 530538082 532025158 533015728 533812523 534594595 535591841 537273347
1258.4E37273347K628684L526569M513800N573928O299615O766677P213831P341504
$$ 537273347 539902031 543428600 547942400 553516328 559815943 566582620 573796451 581137955
1274.7E81137955P123411P006109O971597O763697O666124O814062O696463O267488
$$ 581137955 588261366 595267475 602239072 609002769 615668893 622482955 629179418 635446906
1291F35446906N920768N463123M742146M151225L633261K858161K201736J906574J526177
$$ 635446906 641367674 646830797 651572943 655724168 659357429 662215590 664417326 666323900 667850077
1309.4F67850077J058340R07719Q38876P08997R11296J271128J346052J366437J417577
$$ 667850077 668908417 669816136 670655012 671364009 672275305 673546433 674892485 676258922 677676499
1327.8F77676499J095772N17189M0353m30108p96079n12600N0604J50204J54257L21090
$$ 677676499 678772271 679289460 679329813 678899705 678103626 677591026 677641630 677791834 677946091 678267181
1348.1F78267181K59340n2810k40445m56929r11296j365244j598060j715720j943409
$$ 678267181 678526521 678473711 678233266 677776337 676865041 675499797 673901737 672186017 670242608
1366.5F70242608k185047k393723k883792l405928l966868o329954j1011183j2917101
$$ 670242608 668057561 665663838 662780046 659374118 655407250 649077296 638066113 625149012
1382.8F25149012o245435M575134Q212208M124642M81248j165211j922489k681911
$$ 625149012 618903577 623478711 631690919 635815561 636296809 635131598 633209109 630527198
1399.1F30527198l124237l403306l769397l445328k829373k477705k183437j901985
$$ 630527198 627402961 623999655 620230258 616784930 613955557 611477852 609294415 607392430
1415.5F07392430j727223j243532n54681k03132n4658p6413J42992O57200Q86500J696527
$$ 607392430 605665207 604421675 603866994 603663862 603609204 603532791 603675783 604332983 605219483 606916010
1435.9F06916010L156007L204524L071726L188729L178894L595472M122078L988087
$$ 606916010 610072017 613276541 616348267 619536996 622715890 626311362 630433440 634421527
1452.2F34421527L783286N924761R730280Q133352O073117O684840P214248N994081
$$ 634421527 638204813 644129574 653859854 661993206 668066323 674751163 681965411 687959492
1468.5F87959492N760253P747233Q284747O421030M724622L313362K267599J177132
$$ 687959492 693719745 701466978 709751725 716172755 720897377 724210739 726478338 727655470
1484.8G27655470p9035r61006r01163j108467k423525l728211l628075l417194l951788
$$ 727655470 727576435 726615429 725714266 724605799 722182274 718454063 714825988 711408794 707457006
1503.2G07457006n906642q631944o284416m637480n322098n927563n544901m450023
$$ 707457006 701550364 692918420 686634004 681996524 676674426 670746863 665201962 660751939
1519.5F60751939m360914l898800l243208l395378l281117l517508l850460l145159
$$ 660751939 656391025 652492225 649249017 645853639 642572522 639055014 635204554 632059395
1535.8F32059395l105700m030466k752125q43346m02093m50373m28200m2259P1287
$$ 632059395 628953695 624923229 622171104 621327758 620925665 620475292 620047092 620004833 620076120
1554.1F20076120m22239o46592O57261K45273j254141k306998l495038m592299m514873
$$ 620076120 619653881 619007289 619664550 619909823 618655682 616348684 612853646 608261347 603746474
1572.5F03746474n536914p898688p449091o810069p875025q595050q804619q973598
$$ 603746474 598209560 590310872 582861781 576051712 568176687 559581637 550777018 541803420
1588.8E41803420r172142r134471q999885q704960q398533q326053q269966q055776
$$ 541803420 532631278 523496807 514496922 505791962 497393429 489067376 480797410 472741634
1605.1D72741634q014202q233160q066923p673025q382022r336829p245392o262869
$$ 472741634 464727432 456494272 448427349 440754324 432372302 423035473 415790081 409527212
1621.4D09527212p124811o531239n484551m775852l791481l333002k903074j023800
$$ 409527212 402402401 395871162 390386611 385610759 381819278 378486276 375583202 374559402
1637.8C74559402J60665N05626O98864J590461L022879K562404L116995O696791O107777
$$ 374559402 374720067 375225693 375924557 377515018 380537897 383100301 386217296 392914087 399021864
1656.1C99021864M877031N693167P589072Q650691P537931Q403897J0929197J0250181
$$ 399021864 403898895 409592062 417181134 425831825 433369756 441773653 452702850 462953031
1672.4D62953031J0766685J2398303J0990798R638786J1223555J6652524J5262902
$$ 462953031 473719716 486118019 497108817 506747603 517971158 534623682 549886584
1686.7E49886584J1978448J2303650J0991216J1535942J3304472J3557315J5674651
$$ 549886584 561865032 574168682 585159898 596695840 610000312 623557627 639232278
1701F39232278J2469172J0010362J0541379R020389P306873O190539N795240P241547
$$ 639232278 651701450 661711812 672253191 681273580 688580453 694770992 700566232 707807779
1717.3G07807779P594467N758583M925728M826367M275143L794908L350795M307627
$$ 707807779 715402246 721160829 726086557 730912924 735188067 738982975 742333770 746641397
1733.6G46641397N294085M034281L902674M411697M223406L857315L711760M181623
$$ 746641397 751935482 755969763 759872437 764284134 768507540 772364855 776076615 780258238
1749.9G80258238M565060L686667K969801K745867K419651K528965K358854J711071
$$ 780258238 784823298 788509965 791479766 794225633 796645284 799174249 801533103 803244174
1766.3H03244174J288175J082718J598299K408147K030790J399040J352131J532913
$$ 803244174 804532349 805615067 807213366 809621513 811652303 813051343 814403474 815936387
1782.6H15936387J452446J300573R37045N03242R71913J553178J206934P43926R19163
$$ 815936387 817388833 818689406 819626451 820129693 821101606 822654784 823861718 824605644 825524807
1800.9H25524807J217246R68039O51419N57900O33001P58588P88212O24776M54724
$$ 825524807 826742053 827710092 828361511 828919411 829552412 830311000 831099212 831723988 832178712
1819.3H32178712L45886K09450J71721K33412M43518Q05557P57217N05329L91900J97709
$$ 832178712 832524598 832734048 832905769 833139181 833582699 834388256 835145473 835650802 836042702 836240411
1839.7H36240411m6432o855M39525O96897O36876L88145K43128L23891K17319Q0347
$$ 836240411 836193979 836187124 836626649 837323546 837960422 838348567 838591695 838915586 839132905 839213252
1860.1H39213252J74463N5551l74615j99258N76734O22333K67207K21670J81794L7432
$$ 839213252 839387715 839443266 839068651 838869393 839446127 840068460 840335667 840557337 840739131 840776563
1880.5H40776563P3433P9572j27495j38402J73152J72019M8816K20537J90437k7179
$$ 840776563 840849996 840929568 840802073 840663671 840836823 841008842 841057658 841278195 841468632 841441453
1900.9H41441453L397N2690j10447q1658J51813O0081k32875k16603j4067l8564J6689
$$ 841441453 841444850 841497540 841387093 841305435 841457248 841517329 841284454 841067851 841053784 841015220 841031909
1923.3H41031909J38700o378j00910n5433j05917j53661j17242k62082m32789j74582
$$ 841031909 841170609 841164231 841063321 841007888 840901971 840748310 840631068 840368986 839936197 839761615
1943.7H39761615P9930o6936j86980j50919k11775k66672k08497k11417k70725k87115
$$ 839761615 839841545 839774609 839587629 839436710 839224935 838958263 838749766 838538349 838267624 837980509
1964.1H37980509k92301k61784j82927j22189j58549k30312k04265k18332k97487k79247
$$ 837980509 837688208 837426424 837243497 837121308 836962759 836732447 836528182 836309850 836012363 835733116
1984.5H35733116k30313l21984l86119k05755r3877k11835k60532k28167k99692l40760
$$ 835733116 835502803 835180819 834794700 834588945 834495068 834283233 834022701 833794534 833494842 833154082
2004.9H33154082k89619k84195l11613l03745l49879m00305k95639k30014l03984k93493
$$ 833154082 832864463 832580268 832268655 831964910 831615031 831214726 830919087 830689073 830385089 830091596
2025.3H30091596j95086k62738l65555k90394k59578l51012l20494k15650k62737k98023
$$ 830091596 829896510 829633772 829268217 828977823 828718245 828367233 828046739 827831089 827568352 827270329
2045.7H27270329k30074k63929l28064k34306j89424k83360k62082j79827k32995k48968
$$ 827270329 827040255 826776326 826448262 826213956 826024532 825741172 825479090 825299263 825066268 824817300
2066.1H24817300j23084j17182k13266j62542q7976j69635j75417p8856j25707j88112
$$ 824817300 824694216 824577034 824363768 824201226 824113250 823943615 823768198 823689342 823563635 823375523
2086.5H23375523j08421p3850j36256o3896L2186l6537o2287J7464j9193q1301J6153
$$ 823375523 823267102 823193252 823056996 822993100 823025286 822988749 822926462 822943926 822924733 822843432 822859585
2108.9H22859585M2498p3850m5299P7069L6716P391J00076Q0049J550Q3864J15275
$$ 822859585 822902083 822828233 822782934 822860003 822896719 822904110 823004186 823084235 823085785 823169649 823284924
2131.3H23284924p15N4836J60933N6445L815J40011J52171O0916J30594J55270L3617
$$ 823284924 823284209 823339045 823499978 823556423 823560238 823700249 823852420 823913336 824043930 824199200 824232817
2153.8H24232817O4671J63018P9155N4002J60158J15693K5391J23203J75536Q2135
$$ 824232817 824297488 824460506 824539661 824593663 824753821 824869514 824894905 825018108 825193644 825275779
2174.2H25275779J21474J74105L7372j788J41144J19507K39Q3148J38104R000K5154
$$ 825275779 825397253 825571358 825608730 825606942 825748086 825867593 825867832 825950980 826089084 826098084 826123238
2196.6H26123238J23143k206n9664R6202Q7679m7684J0252O7532n2035k2113R7751
$$ 826123238 826246381 826244175 826184511 826280713 826368392 826320708 826330960 826398492 826346457 826324344 826422095
2219H26422095k3842j00910N6147O0797p5459q166O4730m3690o4850j0430j02401j38641
$$ 826422095 826398253 826297343 826353490 826414287 826338828 826330662 826395392 826351702 826286852 826276422 826174021 826035380
2243.5H26035380K802j2934j64330j20759n0605j36852j12712n96m4525p8559J8001
$$ 826035380 826038182 826025248 825860918 825740159 825689554 825552702 825439990 825439394 825394869 825316310 825334311
2265.9H25334311J2278o9976J9551J14023J9610M888J16586Q6070L7312N7638l7551
$$ 825334311 825346589 825276613 825296164 825410187 825429797 825434685 825551271 825637341 825674653 825732291 825694740
2288.4H25694740j28567m5717k086j29402j76132j03533j33693k21670k20477k33174
$$ 825694740 825566173 825520456 825518370 825388968 825212836 825109303 824975610 824753940 824533463 824300289
2308.8H24300289k69532j70708j23381l30091n24223m72545l47674l00348k72036k04026
$$ 824300289 824030757 823860049 823736668 823406577 822882354 822409809 822062135 821761787 821489751 821285725
2329.2H21285725j00017m0233j58250l26276k02120J52350N36919J022934R66013K8729
$$ 821285725 821185708 821145475 820987225 820660949 820458829 820611179 821148098 822171032 823137045 823165774
2349.6H23165774j003861j401365j052141m96805n2810K93434N18024Q02159J207531
$$ 823165774 822161913 820760548 819708407 819211602 819158792 819452226 819970250 820772409 821979940
2367.9H21979940J355231J232624J198053J222432J089752R28640Q40366O37650L55780
$$ 821979940 823335171 824567795 825765848 826988280 828078032 829006672 829847038 830484688 830840468
2386.3H30840468K49803K07425P2538N3227J63079J31964J9849K8431M0233o675M4942
$$ 830840468 831090271 831297696 831370234 831423461 831586540 831718504 831738353 831766784 831807017 831800342 831845284
2408.7H31845284J15156K9564p928O8009k1338j85013j52052p6651o8248M9532J66118
$$ 831845284 831960440 831990004 831982076 832050085 832028747 831843734 831691682 831615031 831546783 831596315 831762433
2431.2H31762433R9063L3438N6684M173n3406M530O258o7830j7285M7505m7803j09673
$$ 831762433 831861496 831894934 831951618 831955791 831902385 831906915 831913173 831845343 831828058 831875563 831827760 831718087
2455.6H31718087l8087m9412j05679r954J5616j24931j12594k2828j09136j55747m6551
$$ 831718087 831680000 831630588 831524909 831514955 831530571 831405640 831293046 831270218 831161082 831005335 830958784
2478.1H30958784n1618j38164q8393m7624j11342r0241j8835r5368j60277o8128o2942
$$ 830958784 830907166 830769002 830680609 830632985 830521643 830431402 830412567 830317199 830156922 830088794 830025852
2500.5H30025852j48118r5010l9458j22547j36733o4552j25348j92822r8764r1017
$$ 830025852 829877734 829782724 829743266 829620719 829483986 829419434 829294086 829101264 829002500 828911483
2520.9H28911483j97470j21951l3140j39654j69098q1778j11401j76966j30653j26124
$$ 828911483 828714013 828592062 828558922 828419268 828250170 828168392 828056991 827880025 827749372 827623248
2541.3H27623248k02060j52647p5519j49071j72675r5427j15216j70112j62184j77204
$$ 827623248 827421188 827268541 827193022 827043951 826871276 826775849 826660633 826490521 826328337 826151133
2561.7H26151133j95682j31727j27911k65241k99215j76132j55747k35558k50518k93553
$$ 826151133 825955451 825823724 825695813 825430572 825131357 824955225 824799478 824563920 824313402 824019849
2582.1H24019849l72886l02852k08795l01361l63886k93553l31581m07874l38733l04938
$$ 824019849 823646963 823344111 823135316 822833955 822470069 822176516 821844935 821437061 821098328 820793390
2602.5H20793390m00066m27067l90232m42803m77493l98397l81231m38512m14729l88384
$$ 820793390 820393324 819966257 819576025 819133222 818655729 818257332 817876101 817437589 817022860 816634476
2622.9H16634476m28974m28439m14312m70757m92811m25756m07756m38928m17531m25458
$$ 816634476 816205502 815777063 815362751 814891994 814399183 813973427 813565671 813126743 812709212 812283754
2643.3H12283754m81546m66466m22596m44711m54008m06266m10080m70399m66109m33147
$$ 812283754 811802208 811335742 810913146 810468435 810014427 809608161 809198081 808727682 808261573 807828426
2663.7H07828426m70757m72009m00901m16100m71831m49597m64499n37157n26488m85003
$$ 807828426 807357669 806885660 806484759 806068659 805596828 805147231 804682732 804145575 803619087 803134084
2684.1H03134084n15759n22018m99248n58615n90563n24938n28514o03795n82278n30601
$$ 803134084 802618325 802096307 801597059 801038444 800447881 799922943 799394429 798790634 798208356 797677755
2704.5G97677755n73396o13690n97954o11782o64532o62267o49571o78003n97120m93943
$$ 797677755 797104359 796490669 795892715 795280933 794616401 793954134 793304563 792626560 792029440 791535497
2724.8G91535497o00875p25567o70016o30140o43850n86867n97358o85513o52134n69344
$$ 791535497 790934622 790209055 789539039 788908899 788265049 787678182 787080824 786395311 785743177 785173833
2745.2G85173833n96881o38425o24716o65844p33077p29501p47800q07345p35343o24120
$$ 785173833 784576952 783938527 783313811 782647967 781914890 781185389 780437589 779630244 778894901 778270781
2765.6G78270781p06792p99954p65562q25405r40382r14991q70407r14454r43125r32991
$$ 778270781 777563989 776764035 775998473 775173068 774232686 773317695 772447288 771532834 770589709 769656718
2786G69656718r51231r74536r86695j042366j089454j084685j134932j231849j246989
$$ 769656718 768705487 767730951 766744256 765701890 764612436 763527751 762392819 761160970 759913981
2804.4G59913981j200557j223743j307964j346827j375973j410603j375914j394629
$$ 759913981 758713424 757489681 756181717 754834890 753458917 752048314 750672400 749277771
2820.7G49277771j535178j612246j589954j626968j748741j870155k026796k278448
$$ 749277771 747742593 746130347 744540393 742913425 741164684 739294529 737267733 734989285
2837G34989285k635717l135979l743053m310131m624843m337073l325224k157390j444935
$$ 734989285 732353568 729217589 725474536 721164405 716539562 712202489 708877265 706719875 705274940
2855.4G05274940j140655j027941j206398j651109k062380k368033k602517k597928
$$ 705274940 704134285 703106344 701899946 700248837 698186457 695818424 693215907 690617979
2871.7F90617979k352596k097845j888096j679123j568973j655757j818359j920521
$$ 690617979 688265383 686167538 684279442 682600319 681031346 679375589 677557230 675636709
2888F75636709k036035k148867k179623k295851k513051k594889k618134k785682l031791
$$ 675636709 673600674 671451807 669272184 666976333 664463282 661868393 659250259 656464577 653432786
2906.4F53432786l324508l791750m342794m648686m552543m142821l552496k903163
$$ 653432786 650108278 646316528 641973734 637325048 632772505 628629684 625077188 622174025
2922.7F22174025k301336j671314j029015o20067k95102K44200Q53360J345396J775384
$$ 622174025 619872689 618201375 617172360 616552293 616257191 616501391 617354751 618700147 620475531
2941F20475531K012312J796782J278758P67768K72810k55406n85318n72562l85284
$$ 620475531 622487843 624284625 625563383 626331151 626603961 626348555 625763237 625190675 624805391
2959.4F24805391j36614Q5831K03192L10779M51147M90964L61979J95562J59085J58489
$$ 624805391 624668777 624754608 624957800 625268579 625719726 626210690 626572669 626768231 626927316 627085805
2979.8F27085805K7060q6903o3896m1664p0274k51889o34551r26197j169026j508832
$$ 627085805 627112865 627025962 626962066 626920402 626850128 626598239 625963688 625037491 623868465 622359633
3000.2F22359633j690626j711428j743555j713872j610398j665890j890839k037048
$$ 622359633 620669007 618957579 617214024 615500152 613889754 612223864 610333025 608295977
3016.5F08295977k136528k243102k195895k149939k286196k349377k236604k182722
$$ 608295977 606159449 603916347 601720452 599570513 597284317 594934940 592698336 590515614
3032.8E90515614k369702k585233k539336k460242k596974k813578k917885k834738
$$ 590515614 588145912 585560679 583021343 580561101 577964127 575150549 572232664 569397926
3049.1E69397926k766609k884626k978862k971649k962410k915263k805293k680242
$$ 569397926 566631317 563746691 560767829 557796180 554833770 551918507 549113214 546432972
3065.5E46432972k680242k828717k901972k813160k653241k566457k705276k896547
$$ 546432972 543752730 540924013 538022041 535208881 532555640 529989183 527283907 524387360
3081.8E24387360k903641k856910k871096k904594k975404l041804l008068k906203
$$ 524387360 521483719 518626809 515755713 512851119 509875715 506833911 503825843 500919640
3098.1E00919640k935499l140926l215969l080070l048003l226757l280252l131688
$$ 500919640 497984141 494843215 491627246 488547176 485499173 482272416 478992164 475860476
3114.4D75860476l132611l329217l563911l712595l649532l506423l489732l574372
$$ 475860476 472727865 469398648 465834737 462122142 458472610 454966187 451476455 447902083
3130.7D47902083l650963l636092l557086l600240l813743l946543l896624l799170
$$ 447902083 444251120 440615028 437057942 433457702 429643959 425697416 421800792 418001622
3147D18001622l706187l696680l847987m027098m048914l966897l915370l939062m011810
$$ 418001622 414295435 410598755 406750768 402723670 398674756 394707859 390792489 386853427 382841617
3165.4C82841617m027426l960491l902584l905535l931880l949463l922343l881038
$$ 382841617 378814191 374853700 370951116 367045581 363113701 359164238 355241895 351360857
3181.7C51360857l869622l863752l813595l734499l738046l796458l809244l741055
$$ 351360857 347491235 343627483 339813888 336079389 332341343 328544885 324735641 320994586
3198C20994586l609419l513098l502011l475249l409356l374070l353059l292829l211737
$$ 320994586 317385167 313872069 310370058 306894809 303485453 300111383 296758324 293465495 290253758
3216.4B90253758l174185l130436l060341l021121l004700k931863k773106k673090
$$ 290253758 287079573 283949137 280888796 277867675 274862975 271931112 269158006 266484916
3232.7B66484916k733946k798259k721727k599656k522856k438337k361909k379342
$$ 266484916 263750970 260952711 258230984 255631328 253108472 250670135 248308226 245928884
3249B45928884k389908k305970k219006k219767k259597k234384k175361k138108k087757
$$ 245928884 243538976 241233006 239014000 236794233 234534636 232300252 230124891 227986783 225899026
3267.4B25899026k022371k022549k072901k113149k120852k068564k010659k007872
$$ 225899026 223876655 221854106 219781205 217668056 215547204 213478640 211467981 209460109
3283.7B09460109j997903j940086j899943j906514j947462k006591k055511k029359
$$ 209460109 207462206 205522120 203622177 201715663 199768201 197761610 195706099 193676740
3300A93676740j887709j766294j841784k032011k131805k113328k022654j906305j850411
$$ 193676740 191789031 190022737 188180953 186148942 184017137 181903809 179881155 177974850 176124439
3318.4A76124439j857311j836881j772225j786038j853481j825079j769409j689225
$$ 176124439 174267128 172430247 170658022 168871984 167018503 165193424 163424015 161734790
3334.7A61734790j548171j519710j622796j683683j655012j529708j359046j385361
$$ 161734790 160186619 158666909 157044113 155360430 153705418 152175710 150816664 149431303
3351A49431303j567319j576900j388759j208290j159683j162753j008540q58545r92105
$$ 149431303 147863984 146287084 144898325 143690035 142530352 141367599 140359059 139500514 138508409
3369.3A38508409j229033j224264r68367p38710o69792p05898o37695m48421k24799
$$ 138508409 137279376 136055112 135086745 134348035 133678243 132972345 132334650 131886229 131661430
3387.7A31661430r581p9379l88220m09245o780K46346n3436m01422j94311J93983L00586
$$ 131661430 131651849 131572470 131184250 130775005 130768225 131014571 130961135 130559713 130365402 130559385 130859971
3410.1A30859971K29299J07497R8124L12761M92036M86687N73054Q30874J015111R42261
$$ 130859971 131089270 131196767 131294891 131607652 132099688 132586375 133159429 133990303 135005414 135947675
3430.5A35947675R46596J135766J018703O56203O10590R08687J214534J390100J374632
$$ 135947675 136894271 138030037 139048740 139704943 140315533 141224220 142438754 143828854 145203486
3448.9A45203486J363620J476512J622393J794383J918659J811385J796171K184898
$$ 145203486 146567106 148043618 149666011 151460394 153379053 155190438 156986609 159171507
3465.2A59171507K435982K100080J614943J647786K045929K443493K526789K237291
$$ 159171507 161607489 163707569 165322512 166970298 169016227 171459720 173986509 176223800
3481.5A76223800K173245K485454K591326K506331K640173K834827K957314K908289
$$ 176223800 178397045 180882499 183473825 185980156 188620329 191455156 194412470 197320759
3497.8A97320759K834931K943024K902389K689168K870396L373012L645703L502801
$$ 197320759 200155690 203098714 206001103 208690271 211560667 214933679 218579382 222082183
3514.2B22082183L264412L348678L621161L911451L861353L585413L721699M067600
$$ 222082183 225346595 228695273 232316434 236227885 240089238 243674651 247396350 251463950
3530.5B51463950M228562M411518M528433M346461M376292M690677M902452M740655
$$ 251463950 255692512 260104030 264632463 268978924 273355216 278045893 282948345 287689000
3546.8B87689000M478753M644841N062342N153894N095065N278140N304068M900098
$$ 287689000 292167753 296812594 301874936 307028830 312123895 317402035 322706103 327606201
3563.1C27606201N067110O609619P094532O011039N657017O074280O435543O691069
$$ 327606201 332673311 339282930 346377462 352388501 358045518 364119798 370555341 377246410
3579.4C77246410O779819O446839O501078P533342P761776O839216O937653P687986
$$ 377246410 384026229 390473068 396974146 404507488 412269264 419108480 426046133 433734119
3595.7D33734119P906258P968903P986694P477075P136554P958769Q523137Q306294
$$ 433734119 441640377 449609280 457595974 465073049 472209603 480168372 488691509 496997803
3612.1D96997803Q238346P851004Q479059R798765Q621753O632149O291389Q959771
$$ 496997803 505236149 513087153 521566212 531364977 539986730 546618879 552910268 561870039
3628.4E61870039J0851502Q590043P658362P726967P471502P352352O777287N608022
$$ 561870039 572721541 581311584 588969946 596696913 604168415 611520767 618298054 623906076
3644.7F23906076N518436Q173526R473741O590545N344808O571114O487846N285502
$$ 623906076 629424512 637598038 647071779 653662324 659007132 665578246 672066092 677351594
3661F77351594M607081L843487L116190L737688M456520L361941L830075M830897L824472
$$ 677351594 681958675 685802162 688918352 692656040 697112560 700474501 704304576 709135473 712959945
3679.4G12959945L159583K677738K010823K159714L220559L410399K605319J965642
$$ 712959945 716119528 718797266 720808089 722967803 726188362 729598761 732204080 734169722
3695.7G34169722J531779J357973J785040J922130J139820M34339Q17597K237499K386391
$$ 734169722 735701501 737059474 738844514 740766644 741906464 742340803 743158400 745395899 747782290
3714G47782290J262009O07014N71251P55429R39250J108170Q04126J3292j86205Q43048
$$ 747782290 749044299 749651313 750222564 750977993 751917243 753025413 753829539 753842831 753656626 754499674
3734.4G54499674K017617J466870l4153n77986M24206P09891p212R53734K035379J154125
$$ 754499674 756517291 757984161 757950008 757372022 757796228 758506119 758498907 759452641 761488020 762642145
3754.8G62642145L70443O42657R22442M26471R3877J87874N56946R80496P25627J62661
$$ 762642145 763012588 763655245 764577687 765004158 765098035 765285909 765842855 766823351 767548978 767711639
3775.2G67711639Q7619M59314N16533K37823K94983M53115L96907J77443k08258l43323
$$ 767711639 767799258 768258572 768775105 769012928 769307911 769761026 770157933 770335376 770127118 769783795
3795.6G69783795l31521l49820L53575P98702O07431Q40664N41687k91765p03454m20391
$$ 769783795 769452274 769102454 769456029 770254731 770862162 771702826 772244513 771952748 771249294 770828903
3816G70828903k05696Q2195R84192P60257J33872J2279j48356k59042l32296k88546
$$ 770828903 770623207 770705402 771689594 772449851 772583723 772596002 772447646 772188604 771856308 771567762
3836.4G71567762K26438O07252O78659P52270J90913q78930j523435m96328J596272
$$ 771567762 771794200 772401452 773080111 773832381 774023294 773144364 771620929 771124601 772720873
3854.8G72720873J228571J40548l62337l39388J3589j94013l61800K86698O45817M83930
$$ 772720873 773949444 774089992 773727655 773388267 773401856 773207843 772846043 773132741 773778558 774262488
3875.2G74262488j8299l62873j04248O9022L10540K71916j63555J54972M53771k18213
$$ 774262488 774244189 773881316 773777068 773846090 774156630 774428546 774264991 774419963 774873734 774655521
3895.5G74655521q32200p19905k8491P49469R51767M32789j2159j51277l23295k95878
$$ 774655521 773823321 773103416 773074925 773824394 774776161 775208950 775196791 775045514 774722219 774426341
3915.9G74426341M2975J46210n5134m1425J66416L4273j02044K38419M16219Q941l57330
$$ 774426341 774469316 774615526 774560392 774518967 774685383 774719656 774617612 774856031 775272250 775281191 774923861
3938.4G74923861l07202J8894J97888L5167k1577J18971J71005R6202J0669J0431N7042
$$ 774923861 774616659 774635553 774833441 774868608 774847031 774966002 775137007 775233209 775243878 775254309 775311351
3960.8G75311351P7188N4240J3173k0147J908N5194J17898J35242N7459P75P332O0320
$$ 775311351 775388539 775442779 775455952 775435805 775437713 775492907 775610805 775746047 775803506 775804281 775811613 775871933
3985.3G75871933Q6486K1040j4186N5373J26124J30593
$$ 775871933 775958419 775979459 775965273 776020646 776146770 776277363
3997.5G76277363
$$ 776277363
##END=$$ End of the data block
