##TITLE=$$ Begin of the data block
##JCAMP-DX=5.00 $$ ACD/SpecManager v 10.08
##SPECTROMETER/DATA SYSTEM=Alpha
##DATE=10 Apr 2014 09:27:12
##DATA TYPE=INFRARED SPECTRUM
##DATA CLASS=XYDATA
##ORIGIN=
##OWNER=
##NPOINTS=1765
##FIRSTX=399.75695801
##LASTX=3997.56933594
##MAXX=3997.56933594
##MINX=399.75695801
##MAXY=0.84182364
##MINY=0.13010488
##XFACTOR=1.0000000000
##YFACTOR=1.000000000000000e-9
##FIRSTY=0.57498908
##DELTAX=2.03957629
##XUNITS=1/CM
##YUNITS=ARBITRARY UNITS
##XYDATA=(X++(Y..Y))
399.8E74989080j547336l158569k598107r93193j644313j862526q30412j357257k007306
$$ 574989080 573441744 570283175 567685068 566691875 565047562 563185036 562354624 560997367 558990061
418.1E58990061p59780j064777j697958l93152l62337j708925j219093q26121k082228
$$ 558990061 558230281 557165504 555467546 555074394 554712057 553003132 551784039 550957918 548875690
436.5E48875690j250148N04613m10200j064360m2259m50313j060844k54512l44217
$$ 548875690 547625542 548130155 547719955 546655595 546613336 546163023 545102179 544847667 544503450
454.8E44503450j231908p48575p55966j837373j301050n85735j638829j771927p92682
$$ 544503450 543271542 542522967 541767001 539929628 538628578 538042843 536404014 534632087 533839405
473.2E33839405j289845j479328l29613n66721j492083o80507k50339j146078j046360
$$ 533839405 532549560 531070232 530740619 530173898 528681815 528001308 527750969 526604891 525558531
491.5E25558531p55489j686275j570105o82354j369178j749754o70374o98387j381040
$$ 525558531 524803042 523116767 521546662 520864308 519495130 517745376 517075002 516376615 514995575
509.9E14995575q82268r80079k109349j814604j057029j763820k036333j452029j882017
$$ 514995575 514113307 513133228 511023879 509209275 508152246 506388426 504352093 502900064 501018047
528.3E01018047k252787j487970j434923j915752j176358o64860j386314j326621n62102
$$ 501018047 498765260 497277290 495842367 493926615 492750257 492085397 490699083 489372462 488810360
546.6D88810360q50737j121312p14779j154959j737923j282513j283586k103686k222449
$$ 488810360 487959623 486838311 486123532 484968573 483230650 481948137 480664551 478560865 476338416
565D76338416k204477k990306l081381k392262k661080k986788k345503k421468l098756
$$ 476338416 474133939 471143633 468062252 465669990 463008910 460022122 457676619 455255151 452156395
583.3D52156395l008604l035963l776431m037589l676414l607303l353715k871245
$$ 452156395 449147791 446111828 442335397 438297808 434621394 431014091 427660376 424789131
599.6D24789131l240317l631860k540470j208305r56923r90987r69588o75112J152634
$$ 424789131 421548814 417916954 415376484 414168179 413211256 412220269 411250681 410575569 411728203
618D11728203L519506M120379L880441M272610M365892L881007M019529M139334L276884
$$ 411728203 415247709 419368088 423248529 427521139 431887031 435768038 439787567 443926901 447203785
636.3D47203785K483458J928657N26905j11252J718700L278821K206266r7930j561314
$$ 447203785 449687243 451615900 452142805 452031553 453750253 457029074 459235340 459137410 457576096
654.7D57576096J91867N139113Q052766O373048L472924K719999L922194L489405K939939
$$ 457576096 457767963 462907076 470959842 477332890 480805814 483525813 487448007 490937412 493877351
673.1D93877351K900958K346963K214342K455116J992285J620650J922012J702964
$$ 493877351 496778309 499125272 501339614 503794730 505787015 507407665 509329677 511032641
689.4E11032641J128912J196563J113951N65827P72894J382768J377702J542449K206981
$$ 511032641 512161553 513358116 514472067 515037894 515810788 517193556 518571258 520113707 522320688
707.7E22320688K202391J901806K362966K571404K079428K223193K742350K426267
$$ 522320688 524523079 526424885 528787851 531359255 533438683 535661876 538404226 540830493
724E40830493K149641K416850K219617J817226K018154K038181J563012J674772K049863
$$ 540830493 542980134 545396984 547616601 549433827 551451981 553490162 555053174 556727946 558777809
742.4E58777809J831830J805663K266526K226830J983225K296328K459825K289772
$$ 558777809 560609639 562415302 564681828 566908658 568891883 571188211 573648036 575937808
758.7E75937808K571404K807378K423406K330780K570391K183795J554668J444041
$$ 575937808 578509212 581316590 583739996 586070776 588641167 590824962 592379630 593823671
775E93823671J112044K83480o6221r4890m30108l34441N84423J429260K349079L921628
$$ 593823671 594935715 595219195 595152974 595058084 594627976 594293535 594877958 596307218 598656297 602577925
795.4F02577925N261659N917073O621658P012666O410896N724073N363822M603624
$$ 602577925 607839584 613756657 620378315 627390981 633801877 639525950 644889772 649493396
811.7F49493396L693283L237843K609492J536846P23481m4882j299262k335251k762794
$$ 649493396 653186679 656424522 659034014 660570860 661294341 661249459 659950197 657614946 654852152
830.1F54852152l287315l754974l639340l563583l891349m034519l981710l766536
$$ 654852152 651564837 647809863 644170523 640606940 636715591 632681072 628699362 624932826
846.4F24932826k406419K94268L220439O028653Q798539J0634720J1106790J0989904
$$ 624932826 622526407 622820675 626041114 632069767 640868306 651503026 662609816 673599720
862.7F73599720J0482192R198964P752895O645501N379736M194915L639579K949238
$$ 673599720 684081912 693280876 701033771 707679272 713059008 717253923 720893502 723842740
879.1G23842740J722813Q88824L98517m25697r86576q53836o85096l56674P21454J720608
$$ 723842740 725565553 726454377 726852894 726427197 725440621 724586785 723901689 723545015 724266469 725987077
899.4G25987077K001524K297759K522945J901269R92954L26395q23557k301813l116965
$$ 725987077 727988601 730286360 732809305 734710574 735703528 736029923 735206366 732904553 729787588
917.8G29787588l493965l688156k891302j303315J8060J246571K426982K615929K090514
$$ 729787588 726293623 722605467 719714165 718410850 718428910 719675481 722102463 724718392 726808906
936.2G26808906J869022J519084O72460K65300K20537l80098j061142j460910k461075
$$ 726808906 728677928 730197012 730869472 731134772 731355309 730975211 729914069 728453159 725992084
954.5G25992084l847421m776299n955100p899344r878516j2030482j4764428j6981542
$$ 725992084 722144663 717368364 711413264 703513920 693635404 681604922 666840494 649858952
970.8F49858952j7787874j7387688j5663863j2899696j0453940q884311p677137o703854
$$ 649858952 632071078 614683390 599019527 586119831 575665891 566781580 559104443 552400589
987.1E52400589o008685n108893l950238l117323k448857j500189p49826o83546j190544
$$ 552400589 546391904 541283011 537332773 534215450 531766593 530266404 529516578 528833032 527642488
1005.5E27642488k384483m222393n862475o850302p540047p877529p713824p619054
$$ 527642488 525258005 521035612 515173137 508322835 500782788 492905259 485191435 477572381
1021.8D77572381p846325p900417p688135p449537o885320n909235n012303m294455
$$ 477572381 469726056 461825639 454137504 446687967 439802647 433893412 428881109 424586654
1038.1D24586654l644735l370553l487945l658473l920824m224419l939122k709210
$$ 424586654 420941919 417571366 414083421 410424948 406504124 402279705 398340583 395631373
1054.5C95631373r86934P23988J950711K006710O98417j304179l342957n091041o123781
$$ 395631373 394644439 395368427 397319138 399325848 400024265 398720086 395377129 390286088 384162307
1072.8C84162307o412596o476938o549240o549924o738335p345647q154422q793443
$$ 384162307 377749711 371272773 364723533 358173609 351435274 344089627 335935205 327141762
1089.1C27141762q826852p662565n266606k527595k47717J267880J950235J947551
$$ 327141762 318314910 310652345 305385739 302858144 302610427 303878307 305828542 307776093
1105.4C07776093J657904J256853N66900m90517k017527m430891p570147r187549o273926
$$ 307776093 309433997 310690850 311257750 310767233 308749706 304318815 296748668 287561119 281287193
1123.8B81287193q6993L950268L462017N74142j517237m91827K879321N683691O524831
$$ 281287193 281200200 285150468 288612485 289186627 287669390 287177563 290056884 295740575 302265406
1142.2C02265406N977034M844606L774613L142804K860010K901673L395081M189968
$$ 302265406 308242440 313087046 316861659 320004463 322864473 325766146 329161227 333351195
1158.5C33351195N238682O817013Q827031J0741919J2149364J2871801J2809337J2205153
$$ 333351195 338589877 345406890 354233921 364975840 377125204 389997005 402806342 415011495
1174.8D15011495J1458040J0594159R489506Q210481O665975M565119K101422k45005
$$ 415011495 426469535 437063694 446553200 454763681 461429656 465994775 468096197 467851192
1191.1D67851192k173037l213316k860367j172185J355231M102289O219328O932169
$$ 467851192 465678155 462464839 459604472 458432287 459787518 463889807 470109135 477041304
1207.4D77041304O321818N104929L745496K621025K114236K002389J866340J864791
$$ 477041304 483363122 488468051 492213547 494834572 496948808 498951197 500817537 502682328
1223.7E02682328K109707K273500K357781K575516K772451K838134K929211K942205
$$ 502682328 504792035 507065535 509423316 511998832 514771283 517609417 520538628 523480833
1240.1E23480833K682030K360523K036869J495898R79245Q13066Q28147R78768J584232
$$ 523480833 526162863 528523386 530560255 532056153 533035398 533848464 534676611 535655379 537239611
1258.4E37239611K570093L543436M542411N582690O291389O744504P190288P323682
$$ 537239611 539809704 543353140 547895551 553478241 559769630 566514134 573704422 581028104
1274.7E81028104P106483O993353O984055O806255O700217O810129O686628O289422
$$ 581028104 588134587 595127940 602111995 608918250 615618467 622428596 629115224 635404646
1291F35404646N940140N445659M717946M148483L657460K911568K244175J888990J477420
$$ 635404646 641344786 646790445 651508391 655656874 659314334 662225902 664470077 666359067 667836487
1309.4F67836487J040161R44197Q86738P09176R01461J308680J381695J364470J416742
$$ 667836487 668876648 669820845 670707583 671416759 672318220 673626900 675008595 676373065 677789807
1327.8F77789807J093567M84705K920m38094p86364n03123N4539J36613J39475L33488
$$ 677789807 678883374 679368079 679370999 678932905 678146541 677643418 677697957 677834570 677974045 678307533
1348.1F78307533K94745q583k05397m58658r38952j379371j594305j729190j970291
$$ 678307533 678602278 678593695 678388298 677929640 676990688 675611317 674017012 672287822 670317531
1366.5F70317531k171874k361834k913058l447175l925383o277919j1027873j2974083
$$ 670317531 668145657 665783823 662870765 659423590 655498207 649220288 638192415 625218332
1382.8F25218332o300748M558504Q259416M172027M74155j194835j929283k669633
$$ 625218332 618917584 623476088 631735504 635907531 636381686 635186851 633257568 630587935
1399.1F30587935l102481l395080l785015l461182k844512k500534k194822j903534
$$ 630587935 627485454 624090374 620305359 616844177 613999665 611499131 609304309 607400775
1415.5F07400775j748443j257837n15818j60933m9114p2837J68681O47486Q21709J630307
$$ 607400775 605652332 604394495 603878677 603717744 603668630 603595793 603764474 604411960 605233669 606863976
1435.9F06863976L146469L226698L074228L182531L184736L595173M100501L980935
$$ 606863976 610010445 613237143 616311371 619493902 622678638 626273811 630374312 634355247
1452.2F34355247L800392N913437R702146Q162558O119668O718517P239460N990565
$$ 634355247 638155639 644069076 653771222 661933780 668053448 674771965 682011425 688001990
1468.5F88001990N703271P679045Q283317O462157M774451L370822K306699J170099
$$ 688001990 693705261 701384306 709667623 716129780 720904231 724275053 726581752 727751851
1484.8G27751851j13785r92716r09626j103878k454817l794074l637195l392100l982902
$$ 727751851 727638066 726645350 725735724 724631846 722177029 718382955 714745760 711353660 707370758
1503.2G07370758n981028q625448o192028m577339n313456n958080n583585m499256
$$ 707370758 701389730 692764282 686572254 681994915 676681459 670723379 665139794 660640538
1519.5F60640538m377604l831088l172994l346920l242254l527046l883421l134191
$$ 660640538 656262934 652431846 649258852 645911932 642669678 639142632 635259211 632125020
1535.8F32125020l115535m086673k744079p95066l51846m13239m24326n9485M0889
$$ 632125020 629009485 624922812 622178733 621383667 621031821 620618582 620194256 620134771 620175660
1554.1F20175660m83215p30157P00891L42011j213252k312362l518820m564524m464090
$$ 620175660 619692445 618962288 619663179 620005190 618791938 616479576 612960756 608396232 603932142
1572.5F03932142n566001p964074p423818o760955p874728q621931q823037q987605
$$ 603932142 598366141 590402067 582978249 576217294 568342566 559720635 550897598 541909993
1588.8E41909993r188235r156287r037852q729279q382499q297086q270949q099437
$$ 541909993 532721758 523565471 514527619 505798340 497415841 489118755 480847806 472748369
1605.1D72748369q048773q222908q068025p711649q416921r330183p214457o263166
$$ 472748369 464699596 456476688 448408663 440697014 432280093 422949910 415735453 409472287
1621.4D09472287p167578o584197n498946m728764l746242l331929k934545j058996
$$ 409472287 402304709 395720512 390221566 385492802 381746560 378414631 375480086 374421090
1637.8C74421090J62214N43594P19726J553685L012836K607643L140122O686807O098747
$$ 374421090 374583304 375126898 375846624 377400309 380413145 383020788 386160910 392847717 398946464
1656.1C98946464M892767N736142P621378Q664727P553339Q408666J0935902J0250658
$$ 398946464 403839231 409575373 417196751 425861478 433414817 441823483 452759385 463010043
1672.4D63010043J0745734J2411386J1024713R642035J1205852J6649127J5286148
$$ 463010043 473755777 486167163 497191876 506833911 518039763 534688890 549975038
1686.7E49975038J2007534J2330651J1003971J1530579J3284146J3539791J5693248
$$ 549975038 561982572 574313223 585317194 596847773 610131919 623671710 639364958
1701F39364958J2501836J0022163J0538757R024441P333875O214082N751133P157147
$$ 639364958 651866794 661888957 672427714 681452155 688786030 695000112 700751245 707908392
1717.3G07908392P589757N806327M972697M858136M276514L777623L332853M287660
$$ 707908392 715498149 721304476 726277173 731135309 735411823 739189446 742522299 746809959
1733.6G46809959N309463M060388L910064M436434M225671L798604L657699M203438
$$ 746809959 752119422 756179810 760089874 764526308 768751979 772550583 776208282 780411720
1749.9G80411720M663170L758907K954721K707303K412617K520502K352178J716554
$$ 780411720 785074890 788833797 791788518 794495821 796908438 799428940 801781118 803497672
1766.3H03497672J280606J054466J591742K448320K055466J398862J367092J540184
$$ 803497672 804778278 805832744 807424486 809872806 811928272 813327134 814694226 816234410
1782.6H16234410J433074J297534R62853N24163R68040J541674J187205P35402R38594
$$ 816234410 817667484 818965018 819927871 820452034 821420074 822961748 824148953 824884355 825822949
1800.9H25822949J228154R63986O36876N32984O15240P56561Q01504O58214M88043
$$ 825822949 827051103 828015089 828651965 829184949 829800189 830556750 831358254 832016468 832504511
1819.3H32504511L53932K07484J64032K09272M23610Q18730P80522N01693L77059J98364
$$ 832504511 832858443 833065927 833229959 833439231 833862841 834681571 835462093 835963786 836340845 836539209
1839.7H36539209n3048k8074M51624P17223O35862L96550K47836L07441K05696P9274
$$ 836539209 836486161 836458087 836909711 837626934 838262796 838659346 838907182 839214623 839420319 839499593
1860.1H39499593J79350P3135l61741k13623N62847O43194K90692K18033J74582M3035
$$ 839499593 839678943 839752078 839390337 839176714 839739561 840382755 840673447 840891480 841066062 841109097
1880.5H41109097P8797P8857j28388j43886J67489J71125K7120J77086J58310k1041
$$ 841109097 841187894 841266751 841138363 840994477 841161966 841333091 841360211 841537297 841695607 841674566
1900.9H41674566J9610M7744r1792l3140J69456L7193k63452k21491N305m9412J847
$$ 841674566 841694176 841741920 841650128 841616988 841786444 841823637 841560185 841338694 841343999 841294587 841296434
1923.3H41296434J79351M2915q7917p0929j32501j58310r0599k38777m28557j79708
$$ 841296434 841475785 841518700 841430783 841359854 841227353 841069043 840978444 840739667 840311110 840131402
1943.7H40131402O6936o4552j57773j35958k42174l10481k14874k00391k91407l20614
$$ 840131402 840198338 840133786 839976013 839840055 839597881 839287400 839072526 838872135 838580728 838260114
1964.1H38260114k85744k08438j28627j11162j96398k71916j98484j90019l00408k93433
$$ 838260114 837974370 837765932 837637305 837526143 837329745 837057829 836859345 836669326 836368918 836075485
1984.5H36075485k14935k90334l82364k50578j43587k29478k56062k15947k89023l23773
$$ 836075485 835860550 835570216 835187852 834937274 834793687 834564209 834308147 834092200 833803177 833479404
2004.9H33479404k58326k71022l38972l28958l38137l80457k94745k32040k92063k78235
$$ 833479404 833221078 832950056 832611084 832282126 831943989 831563532 831268787 831036747 830744684 830466449
2025.3H30466449j86562k53558l49820k88367k88368l71992l03984j96636k75373l24726
$$ 830466449 830279887 830026329 829676509 829388142 829099774 828727782 828423798 828227162 827951789 827627063
2045.7H27627063k49028k67923l19422k34007j99438k93254k59459j57416k23399k54929
$$ 827627063 827378035 827110112 826790690 826556683 826357245 826063991 825804532 825647116 825423717 825168788
2066.1H25168788j19865j25288k30611j65760q0943j45853j57654r3878j43289j96636
$$ 825168788 825048923 824923635 824693024 824527264 824446321 824300468 824142814 824048936 823905647 823709011
2086.5H23709011j17242o4492j09256o4254l755m6014l0339L3080j8060o5327K9982
$$ 823709011 823591769 823527277 823418021 823353767 823350012 823303998 823273659 823306739 823288679 823223352 823253334
2108.9H23253334L1113r5248l3319J06215K6405l3199O4134O8843L5763J18137J05261
$$ 823253334 823284447 823189199 823155880 823262095 823288500 823255301 823319435 823388278 823424041 823542178 823647439
2131.3H23647439k2351M3928J49906M7565L9398K09093J80781M7326J15216J50323
$$ 823647439 823625088 823669016 823818922 823866487 823905885 824114978 824295759 824343085 824458301 824608624
2151.7H24608624L5942N7160J37508M9770K9147J52945J37151M7803J28567J86980
$$ 824608624 824644566 824701726 824839234 824889004 824918151 825071096 825208247 825256050 825384617 825571597
2172.1H25571597R7215J18553J70410M0472P093J50859J13428R53R7215J30415j8000
$$ 825571597 825668812 825787365 825957775 825998247 826005340 826156199 826269627 826270580 826367795 826498210 826480210
2194.6H26480210k444J18315K8253m4465P0810P2837k205P2360P3790o7591k4140J01804
$$ 826480210 826477766 826596081 826624334 826579869 826650679 826723516 826721311 826793671 826867461 826799870 826775730 826877534
2219H26877534n960q6308L3558J4722q6844P034N4121q0824q4639K4259m6909j08421
$$ 826877534 826871574 826785266 826818824 826833546 826746702 826753736 826807857 826727033 826642394 826666653 826619744 826511323
2243.5H26511323r53m6194j90019j15216k4677j08003j07527k2352n1975m3213M1842
$$ 826511323 826510370 826464176 826274157 826158941 826134264 826026261 825918734 825896382 825844407 825801194 825843036
2265.9H25843036n305p1644K4676Q0109M351N4121J64032P0750j8358K3782k6404j03414
$$ 825843036 825837731 825766087 825790763 825870872 825875223 825929344 826093376 826164126 826145768 826169550 826143146 826039732
2290.4H26039732k5273J0014j28269j55449o0440j20282k31206k15769k42591l00169
$$ 826039732 826014459 826024473 825896204 825740755 825680315 825560033 825328827 825113058 824870467 824570298
2310.8H24570298j76072j18315l62873n46038m31121l29554l22461k73049k69830k24888
$$ 824570298 824394226 824275911 823913038 823367000 822935879 822606325 822283864 822010815 821740985 821516097
2331.2H21516097m7982j2875j91807k41876L3259N16773J071989J013517M1008j042127
$$ 821516097 821468115 821455240 821263433 821021557 821054816 821571589 822643578 823657095 823698103 822655976
2351.6H22655976j395762r76682n18858j51098K81334N81205P96079J136005J352370
$$ 822655976 821260214 820283532 819764674 819613576 819894910 820476115 821272194 822408199 823760569
2370H23760569J302660J262307J239121J075268R17732Q45194O62983L78966K41458
$$ 823760569 825063229 826325536 827564657 828639925 829557657 830402851 831065834 831444800 831686258
2388.3H31686258J77205N2988N7519J64866J26362M9711R7036Q9526m649J9848Q2076
$$ 831686258 831863463 831916451 831973970 832138836 832265198 832314909 832411945 832501471 832496822 832516670 832598746
2410.8H32598746l815l7551M6611k6762j47880q5890n2631q9943M7505J89781J04546
$$ 832598746 832594931 832557380 832603991 832577229 832429349 832343459 832290828 832200885 832248390 832438171 832542717
2433.2H32542717J7286N1081J6093m3034K563q703q3386k4736N1319m1723j12414l9459
$$ 832542717 832560003 832611084 832627177 832584143 832586706 832578003 832494617 832469881 832521200 832479477 832367063 832327604
2457.7H32327604l4570r3222l5822o915j07407r4474m291q5354j55032o4134m8697
$$ 832327604 832293034 832199812 832163990 832157075 832049668 831955194 831950903 831865549 831710517 831646383 831597686
2480.1H31597686j25289r9898n9425j10507j03355m4942q9228j21474n3942n3943j14321
$$ 831597686 831472397 831372499 831313074 831202567 831099212 831054270 830965042 830843568 830789626 830735683 830621362
2502.5H30621362r5547p9989j38223j33455o9261j11043j55270p9095q9884j87516
$$ 830621362 830525815 830445826 830307603 830174148 830104887 829993844 829838574 829759479 829669595 829482079
2522.9H29482079j29283o5327j47342j40846o2287j28388j93954j22130j34408k35558
$$ 829482079 829352796 829287469 829140127 828999281 828936994 828808606 828614652 828492522 828358114 828122556
2543.3H28122556j50502k8371j21713j93656j28448j40845j80722j18196j12474k05516
$$ 828122556 827972054 827943683 827821970 827628314 827499866 827359021 827178299 827060103 826947629 826742113
2563.7H26742113k03967j63258k56538k97606j81556j56283k31981k51592k82228l36349
$$ 826742113 826538146 826374888 826118350 825820744 825639188 825482905 825250924 824999332 824717104 824380755
2584.1H24380755k93016k44141l01361k94745k40624l49581m59552l83317l31640m07756
$$ 824380755 824087739 823843598 823542237 823247492 823006868 822657287 822197735 821814418 821482778 821075022
2604.5H21075022m26948m04298m55022m48167l42727l39508m15683m09245m26948m88699
$$ 821075022 820648074 820243776 819788754 819340587 818997860 818658352 818242669 817833424 817406476 816917777
2624.9H16917777m35412l99589n00262n12183l83019l76106m71830m37021l79920m37022
$$ 816917777 816482365 816082776 815582514 815070331 814687312 814311206 813839376 813402355 813022435 812585413
2645.3H12585413m60684m23014m61638m89473m13061m11748m86494m43935m02093m88937
$$ 812585413 812124729 811701715 811240077 810750604 810337543 809925795 809439301 808995366 808593273 808104336
2665.7H08104336m96328m05907m26352m80235m31836m33445n35130n49316m95613n09024
$$ 808104336 807608008 807202101 806775749 806295514 805863678 805430233 804895103 804345787 803850174 803341150
2686.1H03341150n09023m87626n64635o00278n10156n03898n96344n96762n38707n79536
$$ 803341150 802832127 802344501 801779866 801179588 800669432 800165534 799569190 798972428 798433721 797854185
2706.5G97854185o24120n88596o17981o86645o64711o39320o57618o02126n37634o05404
$$ 797854185 797230065 796641469 796023488 795336843 794672132 794032812 793375194 792773068 792235434 791630030
2726.9G91630030o68288o27577o25849o44803o08325o22451o75082o34253n62251o04391
$$ 791630030 790961742 790334165 789708316 789063513 788455188 787832737 787157655 786523402 785961151 785356760
2747.3G85356760o65367o40392o61910p37071p34746p28786p61867p05182o50883p32899
$$ 785356760 784691393 784051001 783389091 782652020 781917274 781188488 780426621 779721439 779070556 778337657
2767.7G78337657p84039p43032q10861r58681Tr00030r29297r34362q96275r21667
$$ 778337657 777553618 776810586 775999725 775041044 774082363 773182333 772253036 771318674 770422399 769500732
2788.1G69500732r84609j014113j057267j109541j078784j098752j250029j282096
$$ 769500732 768516123 767502010 766444743 765335202 764256418 763157666 761907637 760625541
2804.4G60625541j182973j190126j284301j328826j362741j422823j404762j392424
$$ 760625541 759442568 758252442 756968141 755639315 754276574 752853751 751448989 750056565
2820.7G50056565j511634j596987j601219j685441j790165j845122k017140k319098
$$ 750056565 748544931 746947944 745346725 743661284 741871119 740025997 738008857 735689759
2837G35689759k635538l088594l746986m361749m641890m318297l320456k157986j426816
$$ 735689759 733054221 729965627 726218641 721856892 717215002 712896705 709576249 707418263 705991447
2855.4G05991447j122296j025617j197040j634836k086640k414643k620817k597510
$$ 705991447 704869151 703843534 702646494 701011658 698925018 696510375 693889558 691292048
2871.7F91292048k350748k090812j881957j693606j598597j658857j782298j889586
$$ 691292048 688941300 686850488 684968531 683274925 681676328 680017471 678235173 676345587
2888F76345587k043426k195597k226412k280474k468169k584874k615393k773344l042281
$$ 676345587 674302161 672106564 669880152 667599678 665131509 662546635 659931242 657157898 654115617
2906.4F54115617l357410l812432m336536m638553m548013m129291l534674k921105
$$ 654115617 650758207 646945775 642609239 637970686 633422673 629293382 625758708 622837603
2922.7F22837603k357900j707137j016497n88000k72513K52367Q47101J329064J754403
$$ 622837603 620479703 618772566 617756069 617168069 616895556 617147923 617995024 619324088 621078491
2941F21078491K004981J811385J289666P56681K59578k32696n43475n58019m13418
$$ 621078491 623083472 624894857 626184523 626941204 627200782 626968086 626424611 625866592 625453174
2959.4F25453174j87456O0081K28345L60608M80593M92692L48747J83641J35243J22249
$$ 625453174 625265718 625325799 625554144 625914752 626395345 626888037 627236784 627420425 627555668 627677917
2979.8F27677917M7625k5809o5804r4294r5845k51770o47485r50396j155138j455784
$$ 627677917 627725542 627699733 627633929 627539635 627443790 627192020 626544535 625594139 624439001 622983217
3000.2F22983217j663148j706243j740992j740455j656056j680195j858056k004742
$$ 622983217 621320069 619613826 617872834 616132379 614476323 612796128 610938072 608933330
3016.5F08933330k104462k201795k207875k189935k274811k314031k238989k208471
$$ 608933330 606828868 604627073 602419198 600229263 597954452 595640421 593401432 591192961
3032.8E91192961k390147k593278k527357k464711k626538k808989k893626k868355
$$ 591192961 588802814 586209536 583682179 581217468 578590930 575781941 572888315 570019960
3049.1E70019960k824425k894283k975285k987563k968133k905488k802908k695203
$$ 570019960 567195535 564301252 561325967 558338404 555370271 552464783 549661875 546966672
3065.5E46966672k705813k834439k881169k790749k651155k576888k683997k867222
$$ 546966672 544260859 541426420 538545251 535754502 533103347 530526459 527842462 524975240
3081.8E24975240k923190k910734k912163k899766k931357k996385k988279k931416
$$ 524975240 522052050 519141316 516229153 513329387 510398030 507401645 504413366 501481950
3098.1E01481950k995252l169030l187001l057689l071188l262818l303290l139078
$$ 501481950 498486698 495317668 492130667 489072978 486001790 482738972 479435682 476296604
3114.4D76296604l128022l319443l551453l717452l663153l505826l505051l621399
$$ 476296604 473168582 469849139 466297686 462580234 458917081 455411255 451906204 448284805
3130.7D48284805l674060l632665l577828l609002l789753l938079l913194l823101
$$ 448284805 444610745 440978080 437400252 433791250 430001497 426063418 422150224 418327123
3147D18327123l717870l694415l838330m017294m081189m017890l928691l933847l992438
$$ 418327123 414609253 410914838 407076508 403059214 398978025 394960135 391031444 387097597 383105159
3165.4C83105159m006446l983676l945768l914654l920108l939688l899813l860176
$$ 383105159 379098713 375115037 371169269 367254615 363334507 359394819 355495006 351634830
3181.7C51634830l880709l884554l820717l761679l784657l808409l795445l760963
$$ 351634830 347754121 343869567 340048850 336287171 332502514 328694105 324898660 321137697
3198C21137697l662497l549338l511399l481835l421932l371120l312379l248632l228575
$$ 321137697 317475200 313925862 310414463 306932628 303510696 300139576 296827197 293578565 290349990
3216.4B90349990l239870l183842l088116l004819k933205k883941k803057k714396
$$ 290349990 287110120 283926278 280838162 277833343 274900138 272016197 269213140 266498744
3232.7B66498744k741813k791822k730847k653479k557397k426088k370730k410814
$$ 266498744 263756931 260965109 258234262 255580783 253023386 250597298 248226568 245815754
3249B45815754k415240k312466k234266k261966k261639k183020k167776k190098k101690
$$ 245815754 243400514 241088048 238853782 236591816 234330177 232147157 229979381 227789283 225687593
3267.4B25687593j988172k010376k080902k071172k040327k053916k071396k043128
$$ 225687593 223699421 221689045 219608143 217536971 215496644 213442728 211371332 209328204
3283.7B09328204j985654j952231j927539j900524j929865j998603k041295k019510
$$ 209328204 207342550 205390319 203462780 201562256 199632391 197633788 195592493 193572983
3300A93572983j944095j866087j855195j952693k093344k143696k041683j905054j859367
$$ 193572983 191628888 189762801 187907606 185954913 183861569 181717873 179676190 177771136 175911769
3318.4A75911769j851856j805544j768321j806855j849458j810998j760646j676307
$$ 175911769 174059913 172254369 170486048 168679193 166829735 165018737 163258091 161581784
3334.7A61581784j541435j543209j655281j679480j640931j543849j406148j440123
$$ 161581784 160040349 158497140 156841859 155162379 153521448 151977599 150571451 149131328
3351A49131328j565665j532674j373291j235649j194611j158178r76145q39174r73269
$$ 149131328 147565663 146032989 144659698 143424049 142229438 141071260 140095115 139255941 138282672
3369.3A38282672j215518j230463r59143p44298p15897p22498o32420m48629k24292
$$ 138282672 137067154 135836691 134877548 134133250 133417353 132694855 132062435 131613806 131389514
3387.7A31389514k6435p7471l44441l64005J1012K34187p5982m25159k16335J91673
$$ 131389514 131363079 131285608 130941167 130577162 130588174 130822361 130746379 130321220 130104885 130296558
3408.1A30296558L05817K46733J53676J09404K56047M12851M58509O40914R09746J026973
$$ 130296558 130602375 130849108 131002784 131112188 131368235 131781086 132239595 132880509 133790255 134817228
3428.5A34817228R60797J011431J149848R56819N97521O12468R48041J210645J335606
$$ 134817228 135778025 136789456 137939304 138896123 139493644 140106112 141054153 142264798 143600404
3446.8A43600404J332805J380309J521811J648531J816868J928911J795068J810894
$$ 143600404 144933209 146313518 147835329 149483860 151300728 153229639 155024707 156835601
3463.2A56835601K257272K505958K104193J544327J572147K024099K420545K476617
$$ 156835601 159092873 161598831 163703024 165247351 166819498 168843597 171264142 173740759
3479.5A73740759K238542K239943K528146K575472K498910K683326K889320K980888
$$ 173740759 175979301 178219244 180747390 183322862 185821772 188505098 191394418 194375306
3495.8A94375306K898068K822354K948269K922371K725393K906337L388807L668830
$$ 194375306 197273374 200095728 203043997 205966368 208691761 211598098 214986905 218655735
3512.1B18655735L526539L214076L248185L601029M003510L967226L644794L746688
$$ 218655735 222182274 225396350 228644535 232245564 236249074 240216300 243861094 247607782
3528.4B47607782M080579M256815M441857M527956M321814M350275M686355M926026
$$ 247607782 251688361 255945176 260387033 264914989 269236803 273587078 278273433 283199459
3544.7B83199459M781634M543185M693449N054414N138308N118251N333781N334765
$$ 283199459 287981093 292524278 297217727 302272141 307410449 312528700 317862481 323197246
3561.1C23197246M859417M980982O555020P157565O130606N756437O169379O517649
$$ 323197246 328056663 333037645 339592665 346750230 352880836 358637273 364806652 371324301
3577.4C71324301O718695O749421O417275O506741P533401P772267O877392O978959
$$ 371324301 378042996 384792417 391209692 397716433 405249834 413022101 419899493 426878452
3593.7D26878452P706672P912100Q057981Q093745P481456P143289Q016586Q526087
$$ 426878452 434585124 442497224 450555205 458648950 466130406 473273695 481290281 489816368
3610D89816368Q273840Q241057P865190Q494258R872318Q733034O698370O304383Q908570
$$ 489816368 498090208 506331265 514196455 522690713 532563031 541296065 547994435 554298818 563207388
3628.4E63207388J0796368Q637369P737457P795752P528722P328510O697714N575479
$$ 563207388 574003756 582641125 590378582 598174334 605703056 613031566 619729280 625304759
3644.7F25304759N497276Q116901R510815O720186N450844O623090O492078N265296
$$ 625304759 630802035 638918936 648429751 655149937 660600781 667223871 673715949 678981245
3661F78981245M586696L800512L067851L723740M400134L258169L817320M964292L965795
$$ 678981245 683567941 687368453 690436304 694160044 698560178 701818347 705635667 710599959 714565754
3679.4G14565754L217220K688706K041817K148986L105223L323674K605975K003073
$$ 714565754 717782974 720471680 722513497 724662483 727767706 731091380 733697355 735700428
3695.7G35700428J565755J361906J785815J949310J143396L95358P74801K209127K407849
$$ 735700428 737266183 738628089 740413904 742363214 743506610 743901968 744676769 746885896 749293745
3714G49293745J318395O36756N43475O97196R19044J105070P73728j9372j96874Q90196
$$ 749293745 750612140 751248896 751792371 752489567 753408611 754513681 755287409 755268037 755071163 755961359
3734.4G55961359K072751J498640J6272n98491K97547O78480K7835R35912K063036
$$ 755961359 758034110 759532750 759549022 758950531 759248078 759926558 759954393 760890305 762953341
3752.8G62953341J233101L99947O20782R26078M74870J21892J56879N40316J047254
$$ 762953341 764186442 764586389 765207171 766133249 766608119 766730011 766886890 767427206 768474460
3771.1G68474460P91371J43408j4305L57866N10455K61724L02136M98235M22716J05619
$$ 768474460 769265831 769409239 769394934 769752800 770263255 770524979 770827115 771325350 771748066 771853685
3791.5G71853685k77161l30687l16977l98815K80380P60556N88834Q94606O82831j95086
$$ 771853685 771576524 771245837 770928860 770530045 770810425 771570981 772159815 773054421 773737252 773542166
3811.9G73542166p12395m65393k37227L219R51111Q54731K59459M4167k36332k83361
$$ 773542166 772829771 772364378 772127151 772130370 773081481 773936212 774195671 774239838 774003506 773720145
3832.3G73720145k46227l06785Q7202O61015Q47161P53939J50204q69274j606226o19709
$$ 773720145 773473918 773167133 773254335 773915350 774762511 775516450 775666654 774797380 773191154 772571445
3852.7G72571445J643776J262725O8545m55856l47018J43289k0146k29299K87294N95093
$$ 772571445 774215221 775477946 775546491 775090635 774743617 774886906 774866760 774637461 774924755 775519848
3873.1G75519848N38349M0054l64303p8321J03116L31104K98143k50817n2631L82781
$$ 775519848 776058197 776098251 775733948 775655627 775758743 776089847 776387990 776137173 776084542 776467323
3893.5G76467323j09672p40707o74606j0669O24240Q06927M87209J15335j12355l89993
$$ 776467323 776357651 775616944 774942338 774931669 775555909 776362836 776850045 776965380 776853025 776463032
3913.9G76463032m59850l7432K50638L9696m7326P9573n1320j01447K64942M14491
$$ 776463032 776003182 775965750 776216388 776256084 776208758 776288331 776237011 776135564 776400506 776814997
3934.3G76814997Q8811k02775k62678l4451J74582O0k5869K05279J57952o2883o4433
$$ 776814997 776903808 776701033 776438355 776403904 776578486 776578546 776552677 776757956 776915908 776853025 776788592
3956.7G76788592Q6308J50442J33097L8147J0908R2268K7954j0728J43289J29879k7836
$$ 776788592 776874900 777025342 777158439 777196586 777207494 777299762 777327716 777316988 777460277 777590156 777562320
3979.2G77562320L6478J50800Q1360J550p570p75L8684J15871J30058
$$ 777562320 777598798 777749598 777830958 777832508 777824938 777824163 777862847 777978718 778108776
3997.5G78108776
$$ 778108776
##END=$$ End of the data block
