##TITLE=$$ Begin of the data block
##JCAMP-DX=5.00 $$ ACD/SpecManager v 10.08
##SPECTROMETER/DATA SYSTEM=Alpha
##DATE=10 Apr 2014 09:27:12
##DATA TYPE=INFRARED SPECTRUM
##DATA CLASS=XYDATA
##ORIGIN=
##OWNER=
##NPOINTS=1765
##FIRSTX=399.75695801
##LASTX=3997.56933594
##MAXX=3997.56933594
##MINX=399.75695801
##MAXY=0.84270054
##MINY=0.13018698
##XFACTOR=1.0000000000
##YFACTOR=1.000000000000000e-9
##FIRSTY=0.57674336
##DELTAX=2.03957629
##XUNITS=1/CM
##YUNITS=ARBITRARY UNITS
##XYDATA=(X++(Y..Y))
$$ plain form
399.8 576743364 574551642 571312129 568893433 567722917 565828741 564060450 563522756 562143683 559431791
418.1 559431791 558121324 557542026 556593001 556418717 555808902 553961694 552836359 552089155 550073862
436.5 550073862 548684776 548893213 548548222 547707915 547651112 547042787 545779526 545498490 545200348 543749332
456.9 543749332 542876482 542194545 540290534 539002359 538689792 537330866 535690248 534907579 533446312
475.2 533446312 531729221 531275153 530656517 529185236 528623164 528335869 526991665 525921166 525289297
493.6 525289297 523641109 521979809 521287501 520079732 518469036 517832935 516974211 515322566 514291406
511.9 514291406 513308406 511230469 509417593 508438468 506781876 504723310 503239453 501392901 499082565
530.3 499082565 497516394 496051908 494075656 492841154 492072612 490710765 489721328 489394873 488397360
$$ packed form
399.8E76743364k191722l239513k418696j170516j894176j768291n37694j379073k711892
418.1E59431791j310467n79298r49025j74284o09815j847208j125335p47204k015293
436.5E50073862j389086K08437l44991q40307n6803o08325j263261k81036k98142j451016
456.9E43749332q72850o81937j904011j288175l12567j358926j640618p82669j461267
475.2E33446312j717091m54068o18636j471281n62072k87295j344204j070499o31869
493.6E25289297j648188j661300o92308j207769j610696o36101q58724j651645j031160
511.9E14291406r83000k077937j812876r79125j656592k058566j483857j846552k310336
530.3D99082565j566171j464486j976252j234502p68542j361847r89437l26455r97513
$$ plain form
548.6 488397360 486976594 486075103 484920323 483240604 481979042 480710596 478706867 476705223 474675328
567 474675328 471634448 468384236 465960145 463403910 460388482 457904488 455505252 452446818 449384689
585.4 449384689 446398407 442723542 438698769 434964001 431292862 427908123 425070673 421920508
601.7 421920508 418343931 415791512 414569646 413617074 412614942 411687613 411083639 412181318 415564686
620 415564686 419626474 423552573 427907944 432358831 436256588 440188318 444236070 447505385 450042039
638.4 450042039 452013880 452556759 452447414 454223514 457621694 459888607 459760636 458092839 458175510
656.7 458175510 463280737 471323431 477719426 481299967 484228164 488246024 491512567 494258165
673.1 494258165 497156501 499602973 501921535 504410088 506358504 507913172 509731352 511331439
$$ packed form
548.6D88397360j420766r01491j154780j679719j261562j268446k003729k001644k029895
567D74675328l040880l250212k424091k556235l015428k483994k399236l058434l062129
585.4D49384689k986282l674865m024773l734768l671139l384739k837450l150165
601.7D21920508l576577k552419j221866r52572j002132r27329o03974J097679L383368
620D15564686M061788L926099M355371M450887L897757L931730M047752L269315K536654
638.4D50042039J971841N42879j09345J776100L398180K266913j27971j667797Q2671
656.7D58175510N105227Q042694O395995L580541K928197M017860L266543K745598
673.1D94258165K898336K446472K318562K488553J948416J554668J818180J600087
$$ plain form
689.4 511331439 512463987 513740838 514902592 515467465 516213655 517559528 518912852 520396411 522496760
707.7 522496760 524694145 526709437 529121518 531683803 533806324 536065400 538779318 541181564
724 541181564 543373704 545861125 548089623 549874485 551879823 553877175 555372417 557033241 559144378
742.4 559144378 561062634 562909782 565154076 567339182 569331765 571687758 574165225 576369286
758.7 576369286 578830421 581608891 583998978 586294293 588942945 591197193 592761993 594226718
775 594226718 595325589 595592976 595558882 595504224 595071852 594651520 595158219 596621394 599022448 602952957
795.4 602952957 608216166 614137173 620765567 627751470 634121180 639837444 645214498 649832249
811.7 649832249 653526962 656771600 659394562 660945117 661685050 661624432 660270452 657936335 655268252
$$ packed form
689.4E11331439J132548J276851J161754N64873P46190J345873J353324J483559K100349
707.7E22496760K197385K015292K412081K562285K122521K259076K713918K402246
724E41181564K192140K487421K228498J784862K005338J997352J495242J660824K111137
742.4E59144378J918256J847148K244294K185106J992583K355993K477467K204061
758.7E76369286K461135K778470K390087K295315K648652K254248J564800J464725
775E94226718J098871K67387l4094n4658m32372m20332N06699J463175K401054L930509
795.4F02952957N263209N921007O628394O985903O369710N716264N377054M617751
811.7F49832249L694713L244638K622962J550555P39933o0618j353980k334117k668083
$$ plain form
830.1 655268252 652022481 648201585 644507647 640939951 637030602 633005023 629131615 625462890
846.4 625462890 623030663 623226523 626388133 632421494 641249776 651897848 662993371 673975468
862.7 673975468 684438288 693611681 701378226 708078146 713525236 717795968 721436620 724266946
879.1 724266946 725896537 726778924 727193415 726761281 725752294 724885285 724213779 723885715 724573731
897.4 724573731 726225257 728200674 730490327 733003974 734924018 735974193 736337543 735499144 733183026
915.8 733183026 730066359 726563990 722878933 720030963 718778908 718803525 720019817 722411692 724974394
934.1 724974394 727016449 728889287 730416358 731079876 731370330 731645823 731295407 730211616 728710949
952.5 728710949 726223767 722368896 717604280 711651802 703729391 693834245 681827962 667131960
$$ packed form
830.1F55268252l245771l820896l693938l567696l909349m025579l873408l668725
846.4F25462890k432227J95860L161610O033361Q828282J0648072J1095523J0982097
862.7F73975468J0462820R173393P766545O699920N447090M270732L640652K830326
879.1G24266946J629591Q82387M14491m32134j008987q67009o71506l28064O88016
897.4G24573731J651526J975417K289653K513647J920044J050175L63350q38399k316118
915.8G33183026l116667l502369l685057k847970j252055K4617J216292K391875K562702
934.1G24974394K042055J872838J527071O63518K90454K75493l50416j083791j500667
952.5G28710949k487182l854871m764616n952478p922411r895146j2006283j4696002
$$ plain form
968.8 667131960 650204062 632386923 614936709 599275053 586436093 576019824 567129493 559435606
985.1 559435606 552709758 546673656 541534483 537554860 534420311 531964123 530439675 529639304 528935969
1003.5 528935969 527775824 525405645 521158576 515267789 508432627 500950992 493108988 485400617
1019.8 485400617 477794498 469981194 462118268 454425991 446951449 440079272 434217542 429236859
1036.1 429236859 424927175 421277046 417948872 414485425 410813719 406894356 402702570 398799688
1052.4 398799688 396108150 395120978 395827979 397730440 399648756 400271535 398963541 395656049 390579790
1070.8 390579790 384446591 378033817 371583700 365070403 358537614 351800710 344456941 336299121
1087.1 336299121 327480674 318628132 310963869 305691838 303141952 302883536 304165125 306147963
$$ packed form
968.8F67131960j6927898j7817139j7450214j5661656j2838960j0416269q890331p693887
985.1E59435606o725848o036102n139173l979623l134549k456188j524448q00371p03335
1003.5E28935969j160145k370179m247069n890787o835162p481635p842004p708371
1019.8D85400617p606119p813304p862926p692277p474542o872177n861730m980683
1036.1D29236859m309684l650129l328174l463447l671706l919363m191786l902882
1052.4C98799688k691538r87172P07001J902461J918316O22779j307994l307492n076259
1070.8C90579790o133199o412774o450117o513297o532789o736904p343769q157820
1087.1C36299121q818447q852542p664263n272031k549886k58416J281589J982838
$$ plain form
1103.4 306147963 308167517 309905440 311156571 311659217 311148733 309150308 304715514 297107011 287884146
1121.8 287884146 281592041 281479448 285398751 288847297 289435178 287936240 287441403 290302455 295982152
1140.1 295982152 302541822 308549255 313392162 317171723 320322305 323190153 326116830 329507440
1156.4 329507440 333660454 338882655 345689118 354501188 365262091 377469361 390379250 403175622
1172.7 403175622 415346652 426765025 437321723 446805805 455034465 461685061 466211230 468293637
1189.1 468293637 468068689 465948939 462760508 459886551 458685637 460013181 464148670 470434308
1205.4 470434308 477385223 483689815 488782316 492539018 495174199 497283220 499293625 501197875
1221.7 501197875 503078699 505155504 507395566 509754539 512345552 515106797 517930448 520890832
$$ packed form
1103.4C06147963K019554J737923J251131N02646n10484j998425m434794p608503r222865
1121.8B87884146o292105j12593L919303L448546N87881j498938m94837K861052N679697
1140.1B95982152O559670O007433M842907L779561L150582K867848K926677L390610
1156.4C29507440M153014N222201O806463Q812070J0760903J2207270J2909889J2796372
1172.7D03175622J2171030J1418373J0556698R484082Q228660O650596M526169K082407
1189.1D68293637k24948k119750l188431k873957j200914J327544M135489O285638
1205.4D70434308O950915O304592N092501L756702K635181K109021K010405J904250
1221.7E01197875J880824K076805K240062K358973K591013K761245K823651K960384
$$ plain form
1238 520890832 523889542 526622653 529007792 531041443 532524109 533480704 534261942 535080671 536098957
1256.4 536098957 537718892 540280581 543802261 548316836 553869724 560143292 566865563 574019313
1272.7 574019313 581317008 588433862 595454633 602450252 609251857 615945816 622762263 629445851
1289 629445851 635713220 641675055 647180200 651928365 656076908 659724534 662626266 664871454 666772068
1307.4 666772068 668265462 669326365 670282066 671160758 671869099 672771454 674059391 675426602 676800251
1325.7 676800251 678239644 679364026 679858387 679838896 679387093 678610384 678113103 678158462 678302109 678481042
1346.1 678481042 678839803 679108083 679056644 678842187 678416312 677520275 676150739 674517751 672770143
1364.5 672770143 670839190 668693721 666325510 663433254 660013795 656044126 649688184 638614595
$$ packed form
1238E20890832K998710K733111K385139K033651J482666R56595P81238Q18729J018286
1256.4E36098957J619935K561689L521680M514575N552888O273568O722271P153750
1272.7E74019313P297695P116854P020771O995619O801605O693959O816447O683588
1289F29445851O267369N961835N505145M748165M148543L647626K901732K245188J900614
1307.4F66772068J493394J060903R55701Q78692P08341R02355J287937J367211J373649
1325.7F76800251J439393J124382M94361j9491m51803p76709m97281M5359J43647J78933
1346.1F78481042L58761K68280n1439k14457m25875q96037j369536j632988j747608
1364.5F72770143j930953k145469k368211k892256l419459l969669o355942j1073589
$$ plain form
1380.8 638614595 625608861 619290709 623878777 632174134 636359453 636856496 635693073 633770823
1397.1 633770823 631083667 627960265 624551952 620760381 617287338 614430428 611928761 609728158
1413.4 609728158 607822478 606109381 604887962 604351997 604170144 604129970 604051530 604190648 604832530
1431.8 604832530 605677068 607311547 610411406 613593459 616655171 619824827 622982681 626555026
1448.1 626555026 630654454 634647608 638445437 644339800 654051840 662255764 668410301 675128400
1464.4 675128400 682338655 688326657 694068670 701807439 710119784 716597378 721397281 724749029
1480.7 724749029 727006674 728161871 728049040 727044463 726126134 725020766 722579718 718812287 715174377
1499.1 715174377 711762786 707768977 701771736 693110943 686896503 682325542 677056015 671140373
$$ packed form
1380.8F38614595j3005734o318152M588068Q295357M185319M97043j163423j922250
1397.1F33770823k687156l123402l408313l791571l473043k856910k501667k200603
1413.4F09728158j905680j713097j221419n35965j81853m0174p8440J39118O41882
1431.8F04832530Q44538J634479L099859L182053L061712L169656L157854L572345
1448.1F26555026M099428L993154L797829N894363R712040Q203924O154537O718099
1464.4F75128400P210255N988002N742013P738769Q312345O477594M799903L351748
1480.7G24749029K257645J155197j12831j004577r18329j105368k441048l767431l637910
1499.1G15174377l411591l993809n997241q660793o214440m570961n269527n915642
$$ plain form
1515.4 671140373 665542603 661027014 656693280 652916670 649774194 646431327 643172085 639647007
1531.7 639647007 635792851 632684469 629574955 625466704 622722745 621949852 621595323 621193588 620812416
1550.1 620812416 620781660 620818079 620319486 619574904 620259047 620592356 619376779 617073119 613566577
1568.4 613566577 608972669 604465187 598904848 590958953 583510399 576740921 568880677 560243011
1584.7 560243011 551374018 542345822 533132195 523973882 514945686 506193757 497763991 489425331
1601.1 489425331 481126159 473021030 464958251 456693828 448612571 440933794 432545900 423203260
1617.4 423203260 415968060 409719408 402577370 395984977 390452296 385686219 381923616 378594249
1633.7 378594249 375670224 374641091 374828279 375373036 376086086 377642959 380649120 383244455 386410385
$$ packed form
1515.4F71140373n597770m515589m333734l776610l142476l342867l259242l525078
1531.7F39647007l854156l108382l109514m108251k743959p72893l54529m01735l81172
1550.1F20812416l0756L6419m98593p44582O84143L33309j215577k303660l506542
1568.4F13566577m593908m507482n560339p945895p448554o769478p860244q637666
1584.7E60243011q868993r028196r213627r158313r028196q751929q429766q338660
1601.1D89425331q299172q105129q062779q264423q081257p678777q387894r342640
1617.4D23203260p235200o248652p142038o592393n532681m766077l762603l329367
1633.7C78594249k924025j029133J87188N44757P13050J556873L006161K595335L165930
$$ plain form
1652 386410385 393142015 399247020 404142201 409876019 417503476 426213980 433825403 442285120 453259766
1670.4 453259766 463533610 474285424 486674815 497687727 507346809 518546879 535147667
1684.7 535147667 550434589 562478065 574822903 585820735 597356617 610665023 624218762
1699 624218762 639907300 652408004 662432909 672985017 682040274 689401448 695652962 701482832
1715.3 701482832 708700359 716279566 722076118 727053881 731917262 736194849 739965200 743294299
1731.6 743294299 747582555 752874613 756920218 760831475 765268505 769498706 773303628 776950121
1747.9 776950121 781142950 785799205 789540887 792506874 795243144 797656238 800192237 802582502
1764.2 802582502 804310381 805593073 806654871 808227360 810638785 812688529 814103961 815472126
$$ packed form
1652C86410385O731630O105005M895181N733818P627457Q710504P611423Q459717J0974646
1670.4D53259766J0273844J0751814J2389391J1012912R659082J1200070J6600788
1684.7E35147667J5286922J2043476J2344838J0997832J1535882J3308406J3553739
1699F24218762J5688538J2500704J0024905J0552108R055257P361174O251514N829870
1715.3G01482832P217527P579207N796552M977763M863381M277587L770351L329099
1731.6G43294299M288256N292058M045605L911257M437030M230201L804922L646493
1747.9G76950121M192829M656255L741682K965987K736270K413094K535999K390265
1764.2H02582502J727879J282692J061798J572489K411425K049744J415432J368165
$$ plain form
1780.5 815472126 817016304 818469167 819772780 820740998 821285367 822266698 823804140 824970305 825669825
1798.9 825669825 826592326 827821076 828778625 829442084 830024719 830656767 831404984 832177281 832779825
1817.2 832779825 833240569 833610117 833833575 834016025 834249437 834682465 835489750 836260259 836764216 837143600
1837.6 837143600 837336361 837273777 837243855 837699950 838437080 839098573 839487612 839713037 840008020 840210021
1858 840210021 840308785 840513527 840579093 840192974 839979827 840555608 841197193 841487229 841701925 841856718
1878.4 841856718 841897309 842007875 842112720 841982126 841840088 842032075 842221618 842255175 842427015 842565417
1898.8 842565417 842537582 842582166 842660785 842560709 842488468 842643738 842700541 842449665 842211246 842196941 842157185
1921.3 842157185 842158377 842299402 842306197 842206120 842157304 842072189 841925383 841812849 841582119 841168284 840970516
$$ packed form
1780.5H15472126J544178J452863J303613R68218N44369R81331J537442J166165O99520
1798.9H25669825R22501J228750R57549O63459N82635O32048P48217P72297O02544
1817.2H32779825M60744L69548K23458J82450K33412M33028Q07285P70509N03957L79384
1837.6H37143600J92761o2584k9922M56095P37130O61493L89039K25425K94983K02001
1858H40210021R8764K04742O5566l86119k13147N75781O41585K90036K14696J54793
1878.4H41856718M0591J10566J04845j30594j42038J91987J89543L3557J71840J38402
1898.8H42565417k7835M4584P8619j00076p2241J55270N6803k50876k38419j4305l9756
1921.3H42157185J192J41025O795j00077m8816q5115j46806j12534k30730m13835j97768
$$ plain form
1943.7 840970516 841027856 840975344 840827942 840691805 840454221 840157390 839940190 839729130 839447081 839146972
1964.1 839146972 838857472 838612676 838444948 838324308 838160992 837932408 837745488 837546527 837250173 836965561
1984.5 836965561 836732388 836399913 835988879 835752845 835645139 835440993 835204601 834993482 834692121 834362149
2004.9 834362149 834084690 833785534 833463967 833173811 832832813 832425117 832134485 831932485 831648767 831348062
2025.3 831348062 831126571 830843747 830479443 830196023 829934061 829578161 829250157 829019606 828747451 828446329
2045.7 828446329 828213155 827952385 827637434 827424765 827236354 826919317 826634347 826461077 826229870 825990558
2066.1 825990558 825902581 825787365 825539887 825380504 825323701 825165033 824999690 824936926 824797034 824585855
2086.5 824585855 824492753 824436843 824286044 824206889 824223399 824161947 824104011 824158907 824166358 824075997 824059725
$$ packed form
1943.7H40970516N7340n2512j47402j36137k37584k96831k17200k11060k82049l00109
1964.1H39146972k89500k44796j67728j20640j63316k28584j86920j98961k96354k84612
1984.5H36965561k33173l32475m11034k36034j07706k04146k36392k11119l01361l29972
2004.9H34362149k77459k99156l21567k90156l40998m07696k90632k02000k83718l00705
2025.3H31348062k21491k82824l64304k83420k61962l55900l28004k30551k72155l01122
2045.7H28446329k33174k60770l14951k12669j88411l17037k84970j73270k31207k39312
2066.1H25990558q7977j15216k47478j59383n6803j58668j65343o2764j39892k11179
2086.5H24585855r3102n5910j50799p9155J6510o1452n7936N4896P451r0361j6272
$$ plain form
2108.9 824059725 824071288 823998034 823988140 824089229 824119568 824123681 824220896 824283242 824300885 824422538 824539244
2131.3 824539244 824544907 824627399 824777007 824808836 824838459 825007796 825139165 825182080 825337291 825516224 825540245
2153.8 825540245 825584054 825728416 825802147 825871646 826048315 826169193 826184452 826291919 826469958 826568484
2174.2 826568484 826696336 826867282 826906025 826910794 827054501 827158809 827151895 827265263 827425361 827422917 827431917
2196.6 827431917 827552795 827574849 827544034 827638924 827707469 827658594 827684522 827770114 827750206 827753127 827840805
2219 827840805 827804983 827716172 827770352 827798128 827704251 827697158 827762842 827723444 827664137 827669203 827587426 827461720
2243.5 827461720 827473283 827452481 827269912 827155769 827124119 826987028 826882362 826901019 826856494 826789558 826821208
2265.9 826821208 826810360 826720774 826744139 826846063 826857030 826898813 827067733 827183485 827210307 827246666 827229023
$$ packed form
2108.9H24059725J1563p3254r894J01089L0339M113R7215O2346J7643J21653J16706
2131.3H24539244N663Q2492J49608L1829K9623J69337J31369M2915J55211J78933K4021
2153.8H25540245M3809J44362P3731O9499J76669J20878J5259J07467J78039R8526
2174.2H26568484J27852J70946L8743M769J43707J04308o914J13368J60098k444R000
2196.6H27431917J20878K2054l0815R4890O8545m8875K5928Q5592j9908K921Q7678
2219H27840805l5822q8811N4180K7776r3877p093O5684l9398n9307N066q1777j25706
2243.5H27461720J1563k0802j82569j14143l1650j37091j04666J8657m4525o6936L1650
2265.9H26821208j0848q9586K3365J01924J0967M1783J68920J15752K6822L6359j7643
$$ plain form
2288.4 827229023 827131569 827082157 827051580 826906383 826749384 826675653 826563120 826375306 826190829 825958371
2308.8 825958371 825691402 825554848 825462878 825168550 824684739 824235201 823904335 823641062 823406458 823147833
2329.2 823147833 822946608 822895586 822775185 822492659 822347581 822541058 823086381 824054122 824969828 825012803
2349.6 825012803 824044466 822665036 821576893 821002722 820937276 821309447 821965218 822811306 823926747
2367.9 823926747 825202584 826414824 827600896 828770697 829785943 830663979 831481576 832124352 832506955
2386.3 832506955 832765400 832943201 832997620 833068371 833238840 833348513 833351016 833392322 833444834 833434045 833481908
2408.7 833481908 833603024 833633184 833621144 833677173 833656251 833503962 833387792 833306432 833222091 833300948 833500087
2431.2 833500087 833591640 833614588 833678305 833667159 833577156 833586812 833625555 833566844 833533525 833550513 833483994 833403289
$$ packed form
2288.4H27229023r7454m9412l0577j45197j56999p3731j12533j87814j84477k32458
2308.8H25958371k66969j36554r1970k94328m83811m49538l30866k63273k34604k58625
2329.2H23147833k01225n1022j20401k82526j45078J93477N45323R67741R15706M2975
2349.6H25012803r68337j379430j088143n74171o5446L72171O55771Q46088J115441
2367.9H23926747J275837J212240J186072J169801J015246Q78036Q17597O42776L82603
2386.3H32506955K58445J77801N4419P0751J70469J09673K503M1306N2512j0789M7863
2408.7H33481908J21116L0160j2040N6029k0922j52289j16170q1360q4341P8857J99139
2431.2H33500087R1553K2948O3717j1146r0003R656L8743n8711l3319J6988o6519q0705
$$ plain form
2455.6 833403289 833415806 833387911 833280027 833241403 833212018 833074510 832977712 832987309 832923532 832780600 832724690
2478.1 832724690 832676172 832532227 832457721 832449496 832331538 832195461 832143188 832049429 831943393 831925452 831849635
2500.5 831849635 831667066 831541657 831476271 831361890 831258714 831209958 831072032 830865443 830778003 830710948
2520.9 830710948 830525756 830390096 830322981 830181658 830052376 829996467 829878271 829683602 829542100 829415739
2541.3 829415739 829226494 829091609 829025447 828869522 828672409 828557253 828431249 828257859 828129888 828001022
2561.7 828001022 827792645 827590525 827423334 827185929 826925516 826746643 826554298 826298118 826076210 825832784
2582.1 825832784 825476825 825153470 824926734 824637055 824301124 824013948 823670685 823264003 822930396 822613180
2602.5 822613180 822179973 821721911 821334839 820916593 820463955 820088387 819734156 819332540 818924725 818491757
$$ packed form
2455.6H33403289J2517k7895j07884l8624k9385j37508r6798R597o3777j42932n5910
2478.1H32724690m8518j43945p4506q225j17958j36077n2273r3759j06036j7941p5817
2500.5H31849635j82569j25409o5386j14381j03176m8756j37926k06589q7440o7055
2520.9H30710948j85192j35660o7115j41323j29282n5909j18196j94669j41502j26361
2541.3H29415739j89245j34885o6162j55925j97113j15156j26004j73390j27971j28866
2561.7H28001022k08377k02120j67191k37405k60413j78873j92345k56180k21908k43426
2582.1H25832784l55959l23355k26736k89679l35931k87176l43263m06682l33607l17216
2602.5H22613180m33207m58062l87072m18246m52638l75568l54231m01616m07815m32968
$$ plain form
2622.9 818491757 818021595 817600191 817216516 816753745 816257358 815832257 815390408 814887226 814446330 814061284
2643.3 814061284 813634336 813207507 812803924 812347710 811881304 811477900 811050773 810554087 810086131 809672952
2663.7 809672952 809236050 808785260 808378875 807945728 807450414 807000995 806579351 806079328 805550516 805050671
2684.1 805050671 804522574 803975284 803461969 802915215 802332282 801811159 801300764 800719142 800140083 799599349
2704.5 799599349 799020708 798402667 797782481 797127366 796455741 795849621 795254052 794591963 793972611 793424428
2724.8 793424428 792795360 792096674 791446030 790789127 790115595 789510190 788898349 788227618 787612736 787069678
2745.2 787069678 786468387 785805821 785183847 784568906 783882797 783157229 782402337 781595290 780842483 780183434
2765.6 780183434 779474080 778700709 777938485 777113855 776192904 775278568 774374723 773436904 772515714 771623790
$$ packed form
2622.9H18491757m70162m21404l83675m62771m96387m25101m41849n03182m40896l85046
2643.3H14061284m26948m26829m03583m56214m66406m03404m27127m96686m67956m13179
2663.7H09672952m36902m50790m06385m33147m95314m49419m21644n00023n28812m99845
2684.1H05050671n28097n47290n13315n46754n82933n21123n10395n81622n79059n40734
2704.5G99599349n78641o18041o20186o55115o71625o06120n95569o62089o19352n48183
2724.8G93424428o29068o98686o50644o56903o73532o05405o11841o70731o14882n43058
2745.2G87069678o01291o62566o21974o14941o86109p25568p54892q07047p52807o59049
2765.6G80183434p09354p73371p62224q24630r20951r14336r03845r37819r21190q91924
$$ plain form
2786 771623790 770692825 769691169 768647492 767562509 766449630 765382290 764287591 763048828 761785150
2804.4 761785150 760606587 759413064 758115470 756752014 755348623 753897667 752487123 751122534
2820.7 751122534 749655783 748093486 746502638 744806886 743024826 741190195 739149213 736819267
2837 736819267 734196126 731105506 727337182 722940683 718277395 713977158 710689902 708549142 707106292
2855.4 707106292 705948412 704925656 703752935 702106237 699990690 697583318 695030689 692505419
2871.7 692505419 690162003 688036263 686129332 684423506 682823718 681192636 679424345 677501738
2888 677501738 675419927 673204482 670965493 668662488 666183352 663636327 661059260 658263624 655187428
2906.4 655187428 651852608 648079216 643736124 639053643 634439886 630262196 626748800 623891115
$$ packed form
2786G71623790r30965j001656j043677j084983j112879j067340j094699j238763j263678
2804.4G61785150j178563j193523j297594j363456j403391j450956j410544j364589
2820.7G51122534j466751j562297j590848j695752j782060j834631k040982k329946
2837G36819267k623141l090620l768324m396499m663288m300237l287256k140760j442850
2855.4G07106292j157880j022756j172721j646698k115547k407372k552629k525270
2871.7F92505419k343416k125740j906931j705826j599788j631082j768291j922607
2888F77501738k081811k215445k238989k303005k479136k547025k577067k795636l076196
2906.4F55187428l334820l773392m343092m682481m613757m177690l513396k857685
$$ plain form
2922.7 623891115 621586025 619905472 618891239 618283451 617994726 618265986 619136393 620455742 622177899
2941 622177899 624161839 625989139 627305567 628080845 628356874 628115714 627546906 626978576 626573563
2959.4 626573563 626405835 626473546 626684844 627039671 627528369 627997339 628329337 628543794 628713965 628841639
2979.8 628841639 628844261 628751695 628681660 628648579 628619790 628384173 627705216 626745820 625592351 624124348
3000.2 624124348 622473359 620767415 618995011 617261708 615653872 613993466 612108171 610045731
3016.5 610045731 607868016 605619609 603410423 601249993 599014938 596714914 594469726 592248559
3032.8 592248559 589849472 587278903 584776103 582318187 579686880 576854348 573952496 571108580
3049.1 571108580 568300188 565379381 562352002 559347510 556417942 553560555 550777197 548074067
$$ packed form
2922.7F23891115k305090j680553j014233o07788k88725K71260Q70407J319349J722157
2941F22177899J983940J827300J316428P75278K76029k41160n68808n68330m05013
2959.4F26573563j67728O7711K11298L54827M88698M68970L31998K14457J70171J27674
2979.8F28841639K622r2566p0035l3081k8789k35617o78957r59396j153469j468003
3000.2F24124348j650989j705944j772404j733303j607836j660406j885295k062440
3016.5F10045731k177715k248407k209186k160430k235055k300024k245188k221167
3032.8E92248559k399087k570569k502800k457916k631307k832532k901852k843916
3049.1E71108580k808392k920807l027379l004492k929568k857387k783358k703130
$$ plain form
3065.5 548074067 545357823 542518377 539636254 536840022 534172654 531580091 528862715 525953233
3081.8 525953233 523015320 520139515 517284095 514360905 511341214 508315921 505349040 502421200
3098.1 502421200 499420375 496243387 493037105 489969879 486909539 483661145 480370134 477247030
3114.4 477247030 474126190 470793664 467221767 463482857 459770113 456195533 452656269 449044704
3130.7 449044704 445361316 441690594 438114643 434550822 430800110 426859885 422929972 419095218
3147 419095218 415346622 411638319 407798082 403756142 399677068 395679742 391716123 387720525 383707970
3165.4 383707970 379700363 375699967 371733636 367791414 363850057 359921515 356027663 352134824
3181.7 352134824 348196417 344276398 340465307 336706400 332908630 329104304 325341612 321621478
$$ packed form
3065.5E48074067k716244k839446k882123k796232k667368k592563k717376k909482
3081.8E25953233k937913k875805k855420k923190l019691l025293k966881k927840
3098.1E02421200l000825l176988l206282l067226l060340l248394l291011l123104
3114.4D77247030l120840l332526l571897l738910l712744l574580l539264l611565
3130.7D49044704l683388l670722l575951l563821l750712l940225l929913l834754
3147D19095218l748596l708303l840237m041940m079074l997326l963619l995598m012555
3165.4C83707970m007607m000396l966331l942222l941357l928542l893852l892839
3181.7C52134824l938407l920019l811091l758907l797770l804326l762692l720134
$$ plain form
3198 321621478 317945600 314341635 310816914 307363629 303963244 300580561 297205508 293872297 290632099
3216.4 290632099 287465751 284328580 281234652 278210729 275224060 272271901 269445151 266743451
3232.7 266743451 264000595 261191159 258464038 255847126 253325403 250915319 248542204 246096924
3249 246096924 243638143 241303846 239066839 236819193 234566987 232353434 230187446 228096604 226049379
3267.4 226049379 224008411 221956566 219855040 217710838 215565398 213492066 211489886 209450424
3283.7 209450424 207408264 205472216 203588486 201666847 199681059 197643101 195604965 193615004
3300 193615004 191701099 189853966 187979877 186004236 183943614 181850776 179809049 177872419 175998241
3318.4 175998241 174139321 172321692 170538902 168701112 166798517 164938390 163177252 161558092
$$ packed form
3198C21621478l675878l603965l524721l453285l400385l382683l375053l333211l240198
3216.4B90632099l166348l137171l093928l023923k986669k952159k826750k701700
3232.7B66743451k742856k809436k727121k616912k521723k410084k373115k445280
3249B46096924k458781k334297k237007k247646k252206k213553k165988k090842k047225
3267.4B26049379k040968k051845k101526k144202k145440k073332k002180k039462
3283.7B09450424k042160j936048j883730j921639j985788k037958k038136j989961
3300A93615004j913905j847133j874089j975641k060622k092838k041727j936630j874178
3318.4A75998241j858920j817629j782790j837790j902595j860127j761138j619160
$$ plain form
3334.7 161558092 160065696 158517718 156865150 155216038 153556332 151974007 150603831 149207845
3351 149207845 147593215 145991847 144623101 143424898 142236382 141066998 140117422 139303550 138283089
3369.3 138283089 137021825 135819495 134881377 134127498 133454368 132794872 132161558 131660223 131399468
3387.7 131399468 131378800 131293967 130893543 130478039 130505919 130806744 130771860 130368844 130186975 130354136
3408.1 130354136 130598366 130846530 131026432 131129414 131366789 131819785 132371619 133037969 133900717 134906083
3428.5 134906083 135855585 136818781 137956873 138948321 139560387 140191257 141177431 142404377 143751025
3446.8 143751025 145133972 146505818 147933826 149544016 151375890 153318986 155144364 156968743
3463.2 156968743 159204945 161679715 163764209 165349260 167038441 169154704 171572998 174013034
$$ packed form
3334.7A61558092j492396j547978j652568j649112j659706j582325j370176j395986
3351A49207845j614630j601368j368746j198203j188516j169384r49576q13872j020461
3369.3A38283089j261264j202330r38118p53879o73130o59496o33314n01335k60755
3387.7A31399468k0668q4833m00424m15504K7880L00825l4884m03016j81869J67161
3408.1A30354136K44230K48164J79902J02982K37375M52996N51834O66350Q62748J005366
3428.5A34906083R49502R63196J138092R91448O12066O30870R86174J226946J346648
3446.8A43751025J382947J371846J428008J610190J831874J943096J825378J824379
3463.2A56968743K236202K474770K084494J585051J689181K116263K418294K440036
$$ plain form
3479.5 174013034 176236719 178479612 181015313 183596238 186075807 188719392 191599175 194615439
3495.8 194615439 197548524 200389490 203388378 206367910 209080085 211934209 215305254 219006985
3512.1 219006985 222578719 225846812 229155049 232768297 236751586 240722597 244377822 248115599
3528.4 248115599 252200246 256478697 260954559 265551269 269935608 274304688 278970927 283888906
3544.7 283888906 288718075 293275505 297950536 303020686 308175802 313316077 318692654 324090898
3561.1 324090898 329034656 334056228 340577781 347688615 353803694 359564960 365737081 372272193
3577.4 372272193 379029542 385828793 392310351 398893803 406507969 414323121 421218723 428240061
3593.7 428240061 436006069 443933696 451939881 460044175 467655897 474889308 482887238 491422594
$$ packed form
3479.5A74013034K223685K242893K535701K580925K479569K643585K879783L016264
3495.8A94615439K933085K840966K998888K979532K712175K854124L371045L701731
3512.1B19006985L571734L268093L308237L613248L983289L971011L655225L737777
3528.4B48115599M084647M278451M475862M596710M384339M369080M666239M917979
3544.7B83888906M829169M557430M675031N070150N155116N140275N376577N398244
3561.1C24090898M943758N021572O521553P110834O115079N761266O172121O535112
3577.4C72272193O757349O799251O481558O583452P614166P815152O895602P021338
3593.7D28240061P766008P927627Q006185Q104294P611722P233411P997930Q535356
$$ plain form
3610 491422594 499760538 508005142 515841603 524375498 534316778 543088794 549837768 556203067 565176606
3628.4 565176606 576014340 584596157 592286229 600129128 607706428 615061998 621816516 627429664
3644.7 627429664 632902622 640959680 650433660 657126009 662548363 669173837 675663233 680912256
3661 680912256 685507119 689354122 692482233 696236610 700648189 703876734 707599640 712528765 716545641
3679.4 716545641 719818115 722532690 724551857 726719558 729943454 733299732 735874116 737894952
3695.7 737894952 739473283 740820706 742623627 744588614 745704949 746055543 746762812 748946071 751397133
3714 751397133 752734184 753383160 753969729 754710734 755653501 756732404 757475674 757488549 757299066 758086681
3734.4 758086681 760069370 761569083 761588097 761006892 761426508 762206733 762225866 763096452 765052676
$$ packed form
3610D91422594Q337944Q244604P836461Q533895R941280Q772016O748974O365299Q973539
3628.4E65176606J0837734Q581817P690072P842899P577300P355570O754518N613148
3644.7F27429664N472958Q057058R473980O692349N422354O625474O489396N249023
3661F80912256M594863L847003L128111L754377M411579L228545L722906M929125M016876
3679.4G16545641L272474K714575K019167K167701L223896L356278K574384K020836
3695.7G37894952J578331J347423J802921J964987J116335L50594P07269K183259K451062
3714G51397133J337051O48976N86569P41005R42767J078903P43270J2875j89483P87615
3734.4G58086681J982689J499713J9014n81205M19616P80225J9133Q70586J956224
$$ plain form
3752.8 765052676 766219854 766645491 767315865 768245041 768704414 768860400 769110918 769685209 770663738
3771.1 770663738 771399617 771548867 771572053 771953642 772468865 772765100 773101211 773567319 773939312 774033844
3791.5 774033844 773751140 773395896 773065150 772722125 773127198 773914635 774380863 775167406 775883257 775777578
3811.9 775777578 775123775 774689972 774454415 774392188 775255740 776077926 776321054 776405156 776277304 776020586
3832.3 776020586 775721908 775449574 775604010 776211858 777002752 777765572 777909279 777005196 775331259
3850.7 775331259 774607360 776316881 777792513 777968407 777498364 777110815 777161121 776997030 776706696
3869 776706696 777048528 777675390 778168738 778196573 777861953 777801394 777902722 778142929 778365195 778224587
3889.4 778224587 778354347 778770745 778625667 777947009 777321517 777247846 777893782 778830171 779305100 779236734
$$ packed form
3752.8G65052676J167178M25637O70374R29176M59373J55986K50518N74291R78529
3771.1G70663738P35879J49250K3186L81589N15223K96235L36111M66108L71993R4532
3791.5G74033844k82704l55244l30746l43025M05073P87437M66228P86543P15851j05679
3811.9G75777578o53803m33803k35557o2227Q63552Q22186K43128Q4102j27852k56718
3832.3G76020586k98678k72334J54436O07848P90894P62820J43707r04083j673937
3850.7G75331259p23899J709521J475632J75894m70043l87549N0306j64091k90334
3869G76706696L41832O26862M93348K7835l34620o0559J01328K40207K22266j40608
3889.4G78224587J29760M16398j45078o78658o25492p3671O45936R36389M74929o8366
$$ plain form
3909.8 779236734 778964818 778603673 778320611 778389990 778589070 778553843 778491914 778537154 778407216 778322399
3930.2 778322399 778677225 779096007 779185712 779051840 778837264 778781891 778922677 778993905 779067278 779246986
3950.6 779246986 779330373 779276669 779231369 779226899 779309750 779458642 779481888 779419601 779433727 779488325 779587209
3973.1 779587209 779776156 779870093 779821694 779892087 780076027 780185163 780232012 780239701 780194223 780162513 780231714
3995.5 780231714 780371487
3997.5 780371487
$$ packed form
3909.8G79236734k71916l61145k83062O9379J99080l5227o1929M5240j29938q4817
3930.2G78322399L54826M18782Q9705j33872k14576n5373J40786P1228P3373J79708
3950.6G79246986Q3387n3704m5300m470Q2851J48892K3246o2287J4126N4598R8884
3973.1G79587209J88947R3937m8399P0393J83940J09136M6849P689m5478l1710O9201
3995.5G80231714J39773
3997.5G80371487
##END=$$ End of the data block
