##TITLE=$$ Begin of the data block
##JCAMP-DX=5.00 $$ ACD/SpecManager v 10.08
##SPECTROMETER/DATA SYSTEM=Alpha
##DATE=10 Apr 2014 09:27:12
##DATA TYPE=INFRARED SPECTRUM
##DATA CLASS=XYDATA
##ORIGIN=
##OWNER=
##NPOINTS=1765
##FIRSTX=399.75695801
##LASTX=3997.56933594
##MAXX=3997.56933594
##MINX=399.75695801
##MAXY=0.84345531
##MINY=0.13023236
##XFACTOR=1.0000000000
##YFACTOR=1.000000000000000e-9
##FIRSTY=0.57538515
##DELTAX=2.03957629
##XUNITS=1/CM
##YUNITS=ARBITRARY UNITS
##XYDATA=(X++(Y..Y))
$$ plain form
399.8 575385153 573455155 570129871 567568421 566343844 564301252 562305570 561728060 560556769 558104038
418.1 558104038 556915879 556233346 555199742 555245459 554826260 552848935 551529586 550730824 548811615
436.5 548811615 547564805 547790647 547332525 546435058 546392798 545762002 544556320 544391453 544124305 542737305
456.9 542737305 541893780 541165352 539322495 538003922 537428916 535804093 534119964 533634961 532524407
475.2 532524407 530938923 530565619 529967308 528324962 527657807 527456999 526143014 525094271 524606109
493.6 524606109 522998273 521242321 520544291 519450903 517913938 517205000 516203701 514486551 513594806
511.9 513594806 512899995 510981441 509064496 507870138 506054580 503899276 502279460 500378013 498289168
530.3 498289168 496928751 495447665 493474931 492389560 491864949 490598559 489419490 488825411 487631202
$$ packed form
399.8E75385153j929998l325284k561450j224577k042592j995682n77510j171291k452731
418.1E58104038j188159o82533j033604M5717m19199j977325j319349p98762j919209
436.5E48811615j246810K25842m58122q97467m2260o30796j205682j64867k67148j387000
456.9E42737305q43525p28428j842857j318573n75006j624823j684129m85003j110554
475.2E32524407j585484l73304n98311j642346o67155k00808j313985j048743m88162
493.6E24606109j607836j755952o98030j093388j536965p08938j001299j717150q91745
511.9E13594806o94811j918554j916945j194358j815558k155304j619816j901447k088845
530.3D98289168j360417j481086j972734j085371n24611j266390j179069n94079j194209
$$ plain form
548.6 487631202 486213148 485503465 484460503 482791603 481616616 480382264 478193998 475954056 473845005
567 473845005 470949501 467902005 465503156 462875307 459851205 457352221 454899669 451884657 448878884
585.4 448878884 445750087 441919535 438010186 434521914 430944294 427519709 424716145 421724051
601.7 421724051 418243229 415625542 414257556 413169503 412143528 411304653 410802156 411923409 415256530
620 415256530 419254214 423143536 427529037 432025343 435938537 439848214 443887144 447226644 449844003
638.4 449844003 451826245 452287287 452055097 453791916 457303405 459677875 459521890 457852513 458036810
656.7 458036810 463226914 471307337 477706581 481237054 484041929 487939268 491288066 494153202
673.1 494153202 497021854 499383748 501711130 504211783 506134808 507731855 509633958 511262417
$$ packed form
548.6D87631202j418054p09683j042962j668900j174987j234352k188266k239942k109051
567D73845005k895504l047496k398849k627849l024102k498984k452552l015012l005773
585.4D48878884l128797l830552l909349l488272l577620l424585k803564k992094
601.7D21724051l480822k617687j367986j088053j025975q38875n02497J121253L333121
620D15256530L997684L889322M385501M496306L913194L909677M038930L339500K617359
638.4D49844003J982242M61042k32190J736819L511489K374470j55985j669377J84297
656.7D58036810N190104Q080423O399244L530473K804875L897339L348798K865136
673.1D94153202K868652K361894K327382K500653J923025J597047J902103J628459
$$ plain form
689.4 511262417 512346029 513594151 514819682 515443265 516182125 517487049 518824935 520379007 522591889
707.7 522591889 524836302 526785076 529093981 531610966 533710599 535952508 538705707 541151166
724 541151166 543284714 545684159 547977328 549894810 551918447 553877711 555361390 557009876 559082150
742.4 559082150 560973704 562831938 565076351 567244470 569234014 571595311 574070752 576269388
758.7 576269388 578731775 581535876 584022939 586364269 588898242 591071367 592659295 594175696
775 594175696 595370471 595699906 595616579 595450819 594986081 594698727 595344126 596793234 599102557 602964103
795.4 602964103 608202577 614114106 620718122 627716959 634115696 639841139 645253479 649893999
811.7 649893999 653549969 656751990 659382045 660893738 661525190 661436915 660160601 657883584 655194581
$$ packed form
689.4E11262417J083612J248122J225531O23583P38860J304924J337886J554072K212882
707.7E22591889K244413J948774K308905K516985K099633K241909K753199K445459
724E41151166K133548K399445K293169J917482K023637J959264J483679J648486K072274
742.4E59082150J891554J858234K244413K168119J989544K361297K475441K198636
758.7E76269388K462387K804101K487063K341330K533973K173125J587928J516401
775E94175696J194775L29435q3327j65760m64738k87354O45399J449108K309323L861546
795.4F02964103N238474N911529O604016O998837O398737N725443N412340M640520
811.7F49893999L655970L202021K630055J511693O31452q8275j276314k277017k689003
$$ plain form
830.1 655194581 651936829 648189306 644601166 641071558 637170315 633181036 629315019 625641584
846.4 625641584 623216927 623407960 626549721 632507503 641229212 651851177 662953317 673884153
862.7 673884153 684321105 693537474 701323450 707989097 713428855 717718005 721386790 724292457
879.1 724292457 725975215 726836681 727200329 726724982 725701451 724874854 724268794 723999143 724724770
897.4 724724770 726321340 728238285 730583370 733145118 735026419 736021996 736357391 735489368 733143628
915.8 733143628 730033100 726548135 722863078 720002890 718748689 718806326 720026433 722353160 724874735
934.1 724874735 726902843 728720665 730184555 730850041 731210709 731522739 731132984 730016649 728514135
952.5 728514135 726031303 722187519 717412651 711438179 703529596 693678439 681709349 667002797
$$ packed form
830.1F55194581l257752l747523l588140l529608l901243l989279l866017l673435
846.4F25641584k424657J91033L141761N957782Q721709J0621965J1102140J0930836
862.7F73884153J0436952R216369P785976O665647N439758M289150L668785K905667
879.1G24292457J682758Q61466L63648m75347j023531q26597o06060k69651P25627
897.4G24724770J596570J916945K345085K561748J881301R95577L35395q68023k345740
915.8G33143628l110528l484965l685057k860188j254201N7637J220107K326727K521575
934.1G24874735K028108J817822J463890O65486L60668L12030l89755j116335j502514
952.5G28514135k482832l843784m774868n974472p908583r851157j1969090j4706552
$$ plain form
968.8 667002797 650050700 632274508 614910603 599297762 586455643 576032400 567138255 559423745
985.1 559423745 552660346 546605170 541487694 537506700 534303844 531780183 530240595 529411674 528636336
1003.5 528636336 527427554 525043726 520792663 514904320 508068442 500610352 492822170 485145926
1019.8 485145926 477566540 469811946 462008327 454351813 446920812 440120101 434303433 429329515
1036.1 429329515 425025612 421358168 418019861 414606899 410976797 407032162 402797431 398888290
1052.4 398888290 396226764 395266682 395958334 397832006 399755120 400394678 399078429 395733714 390633851
1070.8 390633851 384506851 378105998 371662647 365149230 358627439 351892918 344556123 336447835
1087.1 336447835 327654928 318778723 311093450 305808961 303245932 302982360 304278225 306263477
$$ packed form
968.8F67002797j6952097j7776192j7363905j5612841j2842119j0423243q894145p714510
985.1E59423745o763399o055176n117476l980994l202856k523661j539588q28921p75338
1003.5E28636336j208782k383828m251063n888343o835878p458090p788182p676244
1019.8D85145926p579386p754594p803619p656514p431001o800711n816668m973918
1036.1D29329515m303903l667444l338307l412962l630102l944635m234731l909141
1052.4C98888290k661526r60082O91652J873672J923114O39558j316249l344715n099863
1070.8C90633851o127000o400853o443351o513417o521791o734521p336795q108288
1087.1C36447835q792907q876205p685273n284489k563029k63572J295865J985252
$$ plain form
1103.4 306263477 308255166 310007721 311316043 311836094 311308295 309304953 304881960 297299623 288098574
1121.8 288098574 281765431 281561106 285421252 288880140 289546967 288135737 287650645 290476501 296123952
1140.1 296123952 302645504 308637977 313495785 317305475 320490628 323373139 326281697 329642057
1156.4 329642057 333788753 339027852 345863521 354690224 365411937 377566278 390469670 403284580
1172.7 403284580 415476918 426920146 437485754 446948022 455147952 461800545 466336071 468411982
1189.1 468411982 468165368 465998828 462783903 459946811 458809525 460182428 464346141 470648527
1205.4 470648527 477585673 483861327 488946348 492701739 495346993 497489810 499502122 501379609
1221.7 501379609 503274381 505389035 507631242 509964883 512563586 515370488 518218279 521179855
$$ packed form
1103.4C06263477J991689J752555J308322N20051n27799k003342m422993p582337r201049
1121.8B88098574o333143k04325L860146L458888O66827j411230m85092K825856N647451
1140.1B96123952O521552N992473M857808L809690L185153K882511K908558L360360
1156.4C29642057M146696N239099O835669Q826703J0721713J2154341J2903392J2814910
1172.7D03284580J2192338J1443228J0565608R462268Q199930O652593M535526K075911
1189.1D68411982k46614k166540l214925k837092j137286J372903M163713O302386
1205.4D70648527O937146O275654N085021L755391K645254K142817K012312J877487
1221.7E01379609J894772K114654K242207K333641K598703K806902K847791K961576
$$ plain form
1238 521179855 524186850 526924253 529295981 531310678 532788277 533754408 534563541 535403728 536402822
1256.4 536402822 538012683 540586531 544083297 548558176 554081798 560318708 567030013 574206829
1272.7 574206829 581500471 588569522 595560431 602562964 609366596 616056919 622879028 629583716
1289 629583716 635874450 641827583 647321939 652096808 656291425 659978330 662890017 665127158 667039812
1307.4 667039812 668551564 669605672 670552313 671431303 672142506 673067987 674368382 675714195 677080214
1325.7 677080214 678524852 679636180 680135489 680135846 679676235 678892612 678404510 678455830 678604066 678777993
1346.1 678777993 679129899 679426432 679428935 679248452 678821266 677897096 676502705 674876034 673152447
1364.5 673152447 671247423 669115007 666728854 663811922 660387635 656416655 650042713 638943970
$$ packed form
1238E21179855L006995K737403K371728K014697J477599R66131Q09133Q40187R99094
1256.4E36402822J609861K573848L496766M474879N523622O236910O711305P176816
1272.7E74206829P293642P069051O990909P002533O803632O690323O822109O704688
1289F29583716O290734N953133N494356M774869M194617L686905K911687K237141J912654
1307.4F67039812J511752J054108R46641Q78990P11203R25481J300395J345813J366019
1325.7F77080214J444638J111328M99309L57m59611p83623m88102N1320J48236J73927
1346.1F78777993L51906K96533K503j80483m27186r24170j394391j626671j723587
1364.5F73152447j905024k132416k386153k916932l424287l970980o373942j1098743
$$ plain form
1380.8 638943970 625923991 619588792 624170721 632504642 636725843 637237012 636078537 634129763
1397.1 634129763 631399870 628266811 624880075 621102035 617628038 614776254 612286687 610100746
1413.4 610100746 608204246 606469691 605202913 604649901 604463816 604417264 604346097 604492366 605125129
1431.8 605125129 605942488 607533872 610619009 613804400 616843283 619974792 623089969 626655698
1448.1 626655698 630803168 634820282 638590097 644436657 654134750 662373722 668562174 675316691
1464.4 675316691 682588696 688616693 694341898 702040970 710368752 716878533 721674025 725037575
1480.7 725037575 727337360 728503644 728371024 727356791 726411700 725254595 722778916 719008029 715371251
1499.1 715371251 711945772 707947552 701961637 693308711 687122464 682585895 677310169 671370089
$$ packed form
1380.8F38943970j3019979o335199M581929Q333921M221201N11169j158475j948774
1397.1F34129763k729893l133059l386736l778040l473997k851784k489567k185941
1413.4F10100746j896500j734555j266778n53012j86085m6552p1167J46269O32763
1431.8F05125129Q17359J591384L085137L185391L038883L131509L115177L565729
1448.1F26655698M147470M017114L769815N846560R698093Q238972O188452O754517
1464.4F75316691P272005O027997N725205P699072Q327782O509781M795492L363550
1480.7G25037575K299785J166284j32620j014233r45091j157105k475679l770887l636778
1499.1G15371251l425479l998220n985915q652926o186247m536569n275726n940080
$$ plain form
1515.4 671370089 665797591 661323249 656981170 653189182 650037766 646697819 643490434 640056014
1531.7 640056014 636275232 633164048 630016446 625916898 623259544 622562408 622237802 621805847 621363401
1550.1 621363401 621302366 621345401 620846629 620070875 620792568 621189237 619986117 617675960 614150584
1568.4 614150584 609531879 605030954 599484682 591550827 584101796 577281773 569369912 560729921
1584.7 560729921 551877439 542855024 533613741 524387300 515283942 506482720 498027235 489674121
1601.1 489674121 481372952 473269194 465188742 456882685 448757350 441046566 432641119 423307806
1617.4 423307806 416088492 409828752 402675390 396086723 390525997 385706723 381902963 378540307
1633.7 378540307 375593841 374581397 374814600 375413209 376163602 377740473 380765200 383359790 386499971
$$ packed form
1515.4F71370089n572498m474342m342079l791988l151416l339947l207385l434420
1531.7F40056014l780782l111184l147602m099548k657354o97136l24606m31955m42446
1550.1F21363401o1035M3035m98772p75754P21693L96669j203120k310157l525376
1568.4F14150584m618705m500925n546272p933855p449031o820023p911861q639991
1584.7E60729921q852482r022415r241283r226441r103358q801222q455485q353114
1601.1D89674121q301169q103758q080452q306057q125335p710784q405447r333313
1617.4D23307806p219314o259740p153362o588667n560726m819274l803760l362656
1633.7C78540307k946466j012444K33203N98609P50393J576871L024727K594590L140181
$$ plain form
1652 386499971 393236071 399377555 404283613 410023749 417689651 426448971 434068590 442511886 453494579
1670.4 453494579 463791668 474576980 486996859 498000383 507657349 518897772 535545528
1684.7 535545528 550855517 562901914 575258315 586282551 597808421 611073971 624622226
1699 624622226 640367210 652927876 662989140 673590243 682684064 690042675 696280062 702100337
1715.3 702100337 709309042 716913402 722743750 727734745 732605636 736900389 740691185 744030118
1731.6 744030118 748310804 753577173 757603824 761521041 765971243 770213664 774060369 777758658
1747.9 777758658 781949461 786568284 790313482 793297112 796025872 798420727 800928414 803321779
1764.2 803321779 805095315 806389511 807392120 808910728 811337471 813422561 814860225 816230059
$$ packed form
1652C86499971O736100O141484M906058N740136P665902Q759320P619619Q443296J0982693
1670.4D53494579J0297089J0785312J2419879J1003524R656966J1240423J6647756
1684.7E35545528J5309989J2046397J2356401J1024236J1525870J3265550J3548255
1699F24622226J5744984J2560666J0061264J0601103R093821P358611O237387N820275
1715.3G02100337P208705P604360N830348M990995M870891M294753L790796L338933
1731.6G44030118M280686N266369M026651L917217M450202M242421L846705L698289
1747.9G77758658M190803M618823L745198K983630K728760K394855K507687K393365
1764.2H03321779J773536J294196J002609J518608K426743K085090J437664J369834
$$ plain form
1780.5 816230059 817763448 819212675 820517838 821477652 822005808 822996855 824555159 825726151 826428652
1798.9 826428652 827354014 828592479 829565346 830221355 830786049 831428230 832206130 833004177 833623290
1817.2 833623290 834084630 834452689 834672630 834823668 835025549 835452259 836260498 837035000 837559640 837979317
1837.6 837979317 838210166 838147044 838071883 838509202 839266717 839913845 840269506 840489626 840794265 841002464
1858 841002464 841106117 841319203 841383576 840980113 840760529 841347992 841996312 842290819 842511177 842668474
1878.4 842668474 842705131 842806220 842906833 842781544 842654109 842861295 843046963 843061328 843238115 843414187
1898.8 843414187 843396366 843404591 843455315 843349636 843262136 843394160 843433499 843194604 843000174 843005240 842951238
1921.3 842951238 842951655 843107939 843134224 843056858 843011856 842911541 842775643 842690527 842444837 841993332 841784477
$$ packed form
1780.5H16230059J533389J449227J305163R59814N28156R91047J558304J170992P02501
1798.9H26428652R25362J238465R72867O56009N64694O42181P77900P98047O19113
1817.2H33623290M61340L68059K19941J51038K01881M26710Q08239P74502N24640M19677
1837.6H37979317K30849o3122p5161M37319P57515O47128L55661K20120L04639K08199
1858H41002464J03653K13086O4373m03463k19584N87463O48320K94507K20358J57297
1878.4H42668474L6657J01089J00613j25289j27435K07186J85668J4365J76787J76072
1898.8H43414187j7821Q225N0724j05679q7500J32024L9339k38895j94430N066n4002
1921.3H42951238M17J56284K6285p7366m5002j00315j35898q5116k45690m51505k08855
$$ plain form
1943.7 841784477 841834426 841774106 841628492 841480136 841232836 840969682 840796053 840587080 840283990 839973807
1964.1 839973807 839685380 839443326 839273810 839142740 838961303 838713944 838524997 838338792 838055730 837785780
1984.5 837785780 837563574 837238669 836835027 836592197 836460114 836236417 836007416 835831225 835561633 835237503
2004.9 835237503 834954739 834649205 834320545 834029675 833688378 833281159 832989514 832772195 832471848 832160771
2025.3 832160771 831931829 831659675 831325471 831053019 830767274 830395103 830085993 829895556 829648077 829336345
2045.7 829336345 829082906 828816235 828498483 828285813 828104556 827786088 827496350 827326775 827103913 826857686
2066.1 826857686 826736748 826603413 826381981 826255322 826202571 826030672 825840235 825748384 825618923 825460255
2086.5 825460255 825392604 825321198 825165749 825098097 825115025 825057089 825023174 825085938 825071633 824987590 825006187
$$ packed form
1943.7H41784477M9949o0320j45614j48356k47300k63154j73629k08973l03090l10183
1964.1H39973807k88427k42054j69516j31070j81437k47359j88947j86205k83062k69950
1984.5H37785780k22206l24905m03642k42830j32083k23697k29001j76191k69592l24130
2004.9H35237503k82764l05534l28660k90870l41297m07219k91645k17319l00347l11077
2025.3H32160771k28942k72154l34204k72452k85745l72171l09110j90437k47479l11732
2045.7H29336345k53439k66671l17752k12670j81257l18468k89738j69575k22862k46227
2066.1H26857686j20938j33335k21432j26659n2751j71899j90437r1851j29461j58668
2086.5H25460255o7651p1406j55449o7652J6928n7936l3915O2764j4305q4043J8597
$$ plain form
2108.9 825006187 825012982 824906707 824877620 824970841 825002491 825015068 825118482 825186372 825205803 825327098 825447559
2131.3 825447559 825434566 825491190 825661600 825728059 825744152 825879276 826017916 826098979 826271474 826436460
2151.7 826436460 826453388 826518834 826688766 826755583 826799929 826955438 827059150 827097476 827244818 827415228
2172.1 827415228 827488184 827620864 827806234 827857316 827900589 828071237 828165472 828146517 828232169 828369498 828407109
2194.6 828407109 828467429 828579605 828557968 828500152 828597248 828680098 828651905 828694642 828769863 828720212 828697324
2217 828697324 828778863 828744650 828652859 828722656 828787267 828725755 828730881 828772545 828708351 828676999 828709364 828608155
2241.5 828608155 828461945 828465283 828452110 828302920 828205466 828173876 828061044 827971995 827978730 827935576 827864587
2263.9 827864587 827871919 827860832 827798545 827847540 827967048 827973068 827979386 828107953 828196824 828236997 828314960 828299224
$$ packed form
2108.9H25006187O795j06275k9087R3221L1650J2577J03414O7890J9431J21295J20461
2131.3H25447559j2993N6624J70410O6459J6093J35124J38640Q1063J72495J64986
2151.7H26436460J6928O5446J69932O6817M4346J55509J03712L8326J47342J70410
2172.1H27415228P2956J32680J85370N1082M3273J70648R4235j8955Q5652J37329L7611
2194.6H28407109O0320J12176k1637n7816R7096Q2850k8193M2737P5221m9651k2888
2217H28697324Q1539l4213r1791O9797O4611o1512N126M1664o4194l1352L2365j01209
2241.5H28608155j46210L338j3173j49190r7454l1590j12832q9049O735m3154p0989
2263.9H27864587P332j1087o2287M8995J19508O020O318J28567Q8871M0173P7963j5736
$$ plain form
2288.4 828299224 828190029 828183770 828221500 828111827 827957213 827879965 827770948 827607989 827483773 827335536
2308.8 827335536 827123165 826974273 826841235 826501191 825991631 825594425 825332582 825073719 824835837 824600577
2329.2 824600577 824409187 824357271 824316621 824181199 824079812 824178338 824613154 825544477 826482117 826555848
2349.6 826555848 825623512 824334681 823431432 822997034 822926998 823265493 823895752 824698925 825747848
2367.9 825747848 826916516 827999234 829099655 830241024 831239820 832080662 832831800 833401680 833717525
2386.3 833717525 833925247 834101796 834182978 834255338 834407985 834513307 834548533 834642768 834721208 834715843 834767759
2408.7 834767759 834857106 834836423 834816277 834889054 834880054 834731817 834602654 834508896 834416568 834480226 834669948
2431.2 834669948 834766030 834796011 834856868 834851623 834791183 834821820 834839225 834741414 834704638 834755957 834705412 834594429
$$ packed form
2288.4H28299224j09195o259L7730j09673j54614p7248j09017j62959j24216j48237
2308.8H27335536k12371j48892j33038l40044n09560l97206k61843k58863k37882k35260
2329.2H24600577j91390n1916m0650j35422j01387R8526M34816R31323R37640P3731
2349.6H26555848r32336j288831r03249m34398p0036L38495O30259Q03173J048923
2367.9H25747848J168668J082718J100421J141369R98796Q40842P51138N69880L15845
2386.3H33717525K07722J76549Q1182P2360J52647J05322L5226R4235P8440n365N1916
2408.7H34767759Q9347k0683k0146P2777r000j48237j29163r3758r2328O3658J89722
2431.2H34669948R6082K9981O0857n245o0440L0637J7405r7811l6776N1319n0545j10983
$$ plain form
2455.6 834594429 834577203 834552586 834455609 834425569 834415197 834301770 834214747 834214926 834145248 834011674 833947599
2478.1 833947599 833871245 833725035 833655238 833619475 833490312 833397508 833378494 833274901 833154142 833114386 833012581
2500.5 833012581 832846105 832768261 832726955 832618058 832511902 832435966 832289517 832091868 831972301 831888676
2520.9 831888676 831742883 831636190 831571817 831418395 831273377 831213951 831099987 830929935 830829263 830715239
2541.3 830715239 830496311 830341399 830290556 830164075 829986989 829865694 829731643 829555631 829410315 829266131
2561.7 829266131 829069853 828889728 828724265 828468621 828195155 828021646 827845275 827596366 827356458 827093601
2582.1 827093601 826740980 826424599 826187730 825894475 825585127 825319052 824954808 824507713 824158370 823836088
2602.5 823836088 823406160 822977841 822606862 822174847 821724832 821387589 821048677 820614040 820190668 819771707
$$ packed form
2455.6H34594429j7226k4617r6977l0040j0372j13427q7023J79o9678j33574o4075
2478.1H33947599p6354j46210o9797l5763j29163r2804j9014j03593j20759l9756j01805
2500.5H33012581j66476p7844m1306j08897j06156p5936j46449j97649j19567q3625
2520.9H31888676j45793j06693o4373j53422j45018n9426j13964j70052j00672j14024
2541.3H30715239k18928j54912n0843j26481j77086j21295j34051j76012j45316j44184
2561.7H29266131j96278j80125j65463k55644k73466j73509j76371k48909k39908k62857
2582.1H27093601l52621l16381k36869k93255l09348k66075l64244m47095l49343l22282
2602.5H23836088m29928m28319l70979m32015m50015l37243l38912m34637m23372m18961
$$ plain form
2622.9 819771707 819282711 818820238 818422914 817983389 817547679 817187607 816776812 816264868 815782905 815356612
2643.3 815356612 814902246 814459920 814074755 813633800 813115478 812657237 812254310 811816394 811381400 810958564
2663.7 810958564 810486615 810029745 809644282 809219718 808728039 808273494 807822347 807304800 806787968 806290567
2684.1 806290567 805774510 805279672 804800630 804246306 803661108 803135037 802580595 801951051 801366866 800841630
2704.5 800841630 800262034 799640298 799044669 798426390 797758281 797113121 796490371 795848668 795257747 794702590
2724.8 794702590 794036031 793318033 792699635 792091966 791429639 790813863 790222704 789574504 788947880 788382113
2745.2 788382113 787764013 787106931 786497653 785855234 785111666 784354866 783608496 782826841 782112002 781491697
2765.6 781491697 780795217 780036151 779297352 778443336 777455151 776513934 775631011 774707854 773772299 772866428
$$ packed form
2622.9H19771707m88996m62473l97324m39525m35710l60072m10795n11944m81963m26293
2643.3H15356612m54366m42326l85165m40955n18322m58241m02927m37916m34994m22836
2663.7H10958564m71949m56870l85463m24564m91679m54545m51147n17547n16832m97401
2684.1H06290567n16057m94838m79042n54324n85198n26071n54442o29544n84185n25236
2704.5H00841630n79596o21736n95629o18279o68109o45160o22750o41703n90921n55157
2724.8G94702590o66559p17998o18398o07669o62327o15776n91159o48200o26624n65767
2745.2G88382113o18100o57082o09278o42419p43568p56800p46370p81655p14839o20305
2765.6G81491697o96480p59066p38799q54016r88185r41217q82923r23157r35555r05871
$$ plain form
2786 772866428 771940827 770959437 769943118 768891871 767794549 766681731 765528500 764290154 763063371
2804.4 763063371 761919439 760744095 759455681 758101106 756702840 755276322 753882766 752485812
2820.7 752485812 750975430 749386489 747803330 746142745 744358659 742520452 740524113 738205075
2837 738205075 735534608 732399285 728618443 724243701 719597936 715276241 711972833 709846616 708412111
2855.4 708412111 707243145 706185937 704979956 703345776 701283455 698898017 696280003 693698168
2871.7 693698168 691375792 689265728 687347770 685654283 684074581 682422757 680616438 678704321
2888 678704321 676676571 674514174 672299802 669976175 667450488 664870560 662296772 659521163 656432688
2906.4 656432688 653050065 649239123 644891500 640232742 635655940 631471872 627896070 625013649
$$ packed form
2786G72866428r25601r81390j016319j051247j097322j112818j153231j238346j226783
2804.4G63063371j143932j175344j288414j354575j398266j426518j393556j396954
2820.7G52485812j510382j588941j583159j660585j784086j838207j996339k319038
2837G38205075k670467l135323l780842m374742m645765m321695l303408k126217j434505
2855.4G08412111j168966j057208j205981j634180k062321k385438k618014k581835
2871.7F93698168k322376k110064j917958j693487j579702j651824j806319j912117
2888F78704321k027750k162397k214372k323627k525687k579928k573788k775609l088475
2906.4F56432688l382623l810942m347623m658758m576802m184068l575802k882421
$$ plain form
2922.7 625013649 622753203 621126056 620151699 619573176 619279504 619510114 620340526 621654749 623428941
2941 623428941 625470042 627297938 628588676 629346967 629624009 629391730 628815413 628243446 627867818
2959.4 627867818 627731442 627801418 628023624 628400922 628875017 629322231 629669309 629886270 630025387 630139291
2979.8 630139291 630173504 630120754 630030990 629954636 629916430 629683971 629015565 628060281 626903534 625444233
3000.2 625444233 623793662 622074962 620298088 618563533 616941035 615269065 613390625 611358643
3016.5 611358643 609237969 607032657 604819000 602623820 600348115 598020017 595751822 593504012
3032.8 593504012 591099262 588543475 586056411 583599567 580975294 578149498 575189710 572277486
3049.1 572277486 569482565 566630602 563663006 560686052 557741702 554827809 552002728 549288213
$$ packed form
2922.7F25013649k260446j627147r74357n78523k93672K30610Q30412J314223J774192
2941F23428941K041101J827896J290738P58291K77042k32279n76317n71967l75628
2959.4F27867818j36376O9976K22206L77298M74095M47214L47078K16961J39117J13904
2979.8F30139291L4213n2750q9764p6354l8206k32459o68406r55284j156747j459301
3000.2F25444233j650571j718700j776874j734555j622498j671970j878440k031982
3016.5F11358643k120674k205312k213657k195180k275705k328098k268195k247810
3032.8E93504012k404750k555787k487064k456844k624273k825796k959788k912224
3049.1E72277486k794921k851963k967596k976954k944350k913893k825081k714515
$$ plain form
3065.5 549288213 546555817 543713629 540830135 537993312 535285473 532693207 529999614 527122736
3081.8 527122736 524216533 521326959 518411934 515471816 512484312 509454489 506448925 503516614
3098.1 503516614 500551462 497401446 494183600 491099060 488031685 484759867 481440365 478284329
3114.4 478284329 475139320 471826971 468271613 464522928 460805923 457221240 453702241 450129330
3130.7 450129330 446431488 442751765 439193338 435592890 431758612 427757710 423791498 419934303
3147 419934303 416201770 412520289 408677518 404607862 400496036 396467566 392489821 388505489 384504884
3165.4 384504884 380500466 376486599 372505277 368570030 364621252 360659212 356735855 352818012
3181.7 352818012 348877490 344960451 341103911 337297022 333484977 329673767 325900167 322171003
$$ packed form
3065.5E49288213k732396k842188k883494k836823k707839k592266k693593k876878
3081.8E27122736k906203k889574k915025k940118k987504l029823l005564k932311
3098.1E03516614k965152l150016l217846l084540l067375l271818l319502l156036
3114.4D78284329l145009l312349l555358l748685l717005l584683l518999l572911
3130.7D50129330l697842l679723l558427l600448l834278m000902l966212l857195
3147D19934303l732533l681481l842771m069656m111826m028470l977745l984332m000605
3165.4C84504884m004418m013867l981322l935247l948778l962040l923357l917843
3181.7C52818012l940522l917039l856540l806889l812045l811210l773600l729164
$$ plain form
3198 322171003 318523228 314965904 311432421 307911724 304430515 300998151 297633499 294320881 291056126
3216.4 291056126 287866712 284754366 281670541 278600425 275586635 272655129 269845605 267144889
3232.7 267144889 264404118 261585504 258826166 256179601 253625393 251175672 248794585 246387094
3249 246387094 243946806 241569683 239318147 237115711 234887347 232659757 230462447 228319228 226256773
3267.4 226256773 224262223 222225457 220099941 217955425 215837881 213786036 211785138 209768951
3283.7 209768951 207735538 205717772 203747675 201840773 199928209 197934434 195862606 193785563
3300 193785563 191802397 189945072 188118264 186169535 184055001 181902826 179865003 177947372 176073506
3318.4 176073506 174237698 172464147 170683101 168779492 166820198 164992839 163291365 161676586
$$ packed form
3198C22171003l647775l557324l533483l520697l481209l432364l364652l312618l264755
3216.4B91056126l189414l112346l083825l070116l013790k931506k809524k700716
3232.7B67144889k740771k818614k759338k646565k554208k449721k381087k407491
3249B46387094k440288k377123k251536k202436k228364k227590k197310k143219k062455
3267.4B26256773j994550k036766k125516k144516k117544k051845k000898k016187
3283.7B09768951k033413k017766j970097j906902j912564j993775k071828k077043
3300A93785563j983166j857325j826808j948729k114534k152175k037823j917631j873866
3318.4A76073506j835808j773551j781046j903609j959294j827359j701474j614779
$$ plain form
3334.7 161676586 160174951 158643618 156954855 155216381 153549284 152010858 150611401 149171770
3351 149171770 147593006 146067381 144752353 143549129 142296776 141062140 140078768 139283031 138312548
3369.3 138312548 137073770 135864049 134915814 134156808 133460820 132757768 132097870 131602481 131363794
3387.7 131363794 131361157 131282330 130899742 130517811 130549341 130831778 130821690 130452037 130232364 130366012
3408.1 130366012 130638555 130897462 131072536 131220445 131527826 131984070 132464185 133087769 133970425 134998992
3428.5 134998992 135961503 136939734 138077840 139072612 139699191 140328214 141325071 142587647 143928558
3446.8 143928558 145276815 146691918 148203880 149828166 151646420 153588891 155398488 157224312
3463.2 157224312 159491643 161973864 164032921 165585071 167224795 169304073 171745136 174244761
$$ packed form
3334.7A61676586j501635j531333j688763j738474j667097j538426j399457j439631
3351A49171770j578764j525625j315028j203224j252353j234636r83372p95737r70483
3369.3A38312548j238778j209721r48235p59006o95988p03052o59898m95389k38687
3387.7A31363794k637p8827l82588l81931L1530K82437j0088l69653k19673J33648
3408.1A30366012K72543K58907J75074J47909L07381M56244M80115O23584Q82656J028567
3428.5A34998992R62511R78231J138106R94772O26579O29023R96857J262576J340911
3446.8A43928558J348257J415103J511962J624286J818254J942471J809597J825824
3463.2A57224312K267331K482221K059057J552150J639724K079278K441063K499625
$$ plain form
3479.5 174244761 176533461 178815514 181337252 183901474 186402708 189067498 191971719 195040211
3495.8 195040211 198017731 200857252 203807980 206781745 209560797 212440595 215791538 219492823
3512.1 219492823 223083794 226372808 229685187 233295649 237283707 241257146 244921237 248700589
3528.4 248700589 252819449 257125407 261668891 266313434 270694166 275062740 279762894 284699887
3544.7 284699887 289516211 294115931 298856765 303940356 309081197 314231962 319658041 325096667
3561.1 325096667 330052048 335112244 341705918 348865628 354993194 360765368 366971910 373529255
3577.4 373529255 380300999 387142479 393662989 400248498 407865435 415776640 422805756 429895341
3593.7 429895341 437686831 445640773 453670233 461790621 469412565 476704895 484852821 493515581
$$ packed form
3479.5A74244761K288700K282053K521738K564222K501234K664790K904221L068492
3495.8A95040211K977520K839521K950728K973765K779052K879798L350943L701285
3512.1B19492823L590971L289014L312379L610462L988058L973439L664091L779352
3528.4B48700589M118860M305958M543484M644543M380732M368574M700154M936993
3544.7B84699887M816324M599720M740834N083591N140841N150765N426079N438626
3561.1C25096667M955381N060196O593674P159710O127566N772174O206542O557345
3577.4C73529255O771744O841480O520510O585509P616937P911205P029116P089585
3593.7D29895341P791490P953942Q029460Q120388P621944P292330Q147926Q662760
$$ plain form
3610 493515581 501868486 510112524 518002808 526557684 536441147 545181274 551953256 558355510 567372859
3628.4 567372859 578271091 586914659 594612241 602414250 610011280 617441535 624228477 629850924
3644.7 629850924 635346651 643409371 652891278 659631550 665098131 671751559 678257763 683496952
3661 683496952 688106358 692000568 695131421 698843122 703250408 706505716 710191429 715058148 719104052
3679.4 719104052 722457945 725224435 727259278 729393899 732527196 735887706 738535643 740559936
3695.7 740559936 742104769 743426502 745175242 747119367 748297870 748732030 749521434 751760840 754210234
3714 754210234 755503774 756098866 756688416 757447243 758324742 759378791 760203540 760262728 760049582 760795057
3734.4 760795057 762730122 764244974 764353991 763804018 764099896 764767110 764721334 765514076 767531514
$$ packed form
3610D93515581Q352905Q244038P890284Q554876R883463Q740127O771982O402254R017349
3628.4E67372859J0898232Q643568P697582P802009P597030P430255O786942N622447
3644.7F29850924N495727Q062720R481907O740272N466581O653428O506204N239189
3661F83496952M609406L894210L130853L711701M407286L255308L685713M866719M045904
3679.4G19104052L353893K766490K034843K134621L133297L360510K647937K024293
3695.7G40559936J544833J321733J748740J944125J178503M34160P89404K239406K449394
3714G54210234J293540N95092N89550P58827Q77499J054049Q24749N9188k13146P45475
3734.4G60795057J935065J514852J09017n49973K95878O67214m5776P92742K017438
$$ plain form
3752.8 767531514 768846273 769328117 769976258 770906687 771393657 771549225 771771789 772338986 773315012
3771.1 773315012 774053395 774252951 774319589 774666071 775125980 775433660 775838852 776377261 776777208 776845157
3791.5 776845157 776536405 776189208 775855541 775461078 775800049 776589453 777116120 777948678 778664768 778532088
3811.9 778532088 777840316 777367413 777149677 777154148 778058290 778920174 779209554 779319882 779178798 778866649
3832.3 778866649 778516948 778187811 778314888 778976083 779775918 780513525 780713677 779913962 778295517
3850.7 778295517 777509928 779066145 780420601 780550480 780091703 779738605 779891431 779874742 779640794
3869 779640794 779930711 780486524 780911505 780882001 780544698 780549824 780749440 781093895 781379700 781220138
3889.4 781220138 781252265 781564653 781374931 780696869 780088603 779963076 780445516 781280637 781876683 782049716
$$ packed form
3752.8G67531514J314759M81844O48141R30429M86970J55568K22564N67197R76026
3771.1G73315012P38383J99556O6638L46482M59909L07680M05192N38409L99947O7949
3791.5G76845157l08752l47197l33667l94463L38971P89404N26667Q32558P16090j32680
3811.9G78532088o91772m72903k17736M471R04142Q61884K89380J10328j41084l12149
3832.3G78866649l49701l29137J27077O61195P99835P37607K00152p99715j618445
3850.7G78295517p85589J556217J354456J29879m58777l53098J52826j6689k33948
3869G79640794K89917N55813M24981k9504l37303N126J99616L44455K85805j59562
3889.4G81220138L2127L12388j89722o78062o08266j25527M82440Q35121N96046J73033
$$ plain form
3909.8 782049716 781967223 781699717 781418324 781415880 781524062 781421959 781338990 781420827 781347573 781254649 781588733
3932.3 781588733 782054365 782124460 781895280 781655431 781603456 781724751 781777680 781812072 781958044 782067299
3952.7 782067299 782066047 782069564 782153726 782258391 782352805 782410145 782390237 782380164 782429934 782496214 782631814
3975.1 782631814 782784700 782806575 782845318 782992005 783060730 783026934 782992423 783033788 783193886 783365965 783449054
3997.5 783449054
$$ packed form
3909.8G82049716q2493k67506k81393k444J08182j02103q2969Q1837p3254r2924L34084
3932.3G81588733M65632P0095k29180k39849n1975J21295N2929L4392J45972J09255
3952.7G82067299j252L517Q4162J04665R4414N7340j9908j0073M9770O6280J35600
3975.1G82631814J52886K1875L8743J46687O8725l3796l4511M1365J60098J72079Q3089
3997.5G83449054
##END=$$ End of the data block
