##TITLE=$$ Begin of the data block
##JCAMP-DX=5.00 $$ ACD/SpecManager v 10.08
##SPECTROMETER/DATA SYSTEM=Alpha
##DATE=09 Apr 2014 11:14:46
##DATA TYPE=INFRARED SPECTRUM
##DATA CLASS=XYDATA
##ORIGIN=
##OWNER=
##NPOINTS=1765
##FIRSTX=399.75695801
##LASTX=3997.56933594
##MAXX=3997.56933594
##MINX=399.75695801
##MAXY=0.86630768
##MINY=0.36390889
##XFACTOR=1.0000000000
##YFACTOR=1.000000000000000e-9
##FIRSTY=0.67371589
##DELTAX=2.03957629
##XUNITS=1/CM
##YUNITS=ARBITRARY UNITS
##XYDATA=(X++(Y..Y))
399.8F73715889k445459k227664j389623j077473j258135j113832p63177k82884n42343
$$ 673715889 671270430 669042766 667653143 666575670 665317535 664203703 663440526 663157642 662615299
418.1F62615299j260102m44293k6881n35965o83487n04791o12557p88629o84202o41644
$$ 662615299 661355197 660910904 660884023 660348058 659664571 659159780 658547223 657758594 657074392 656432748
438.5F56432748n97298l26217k89440o95049p66337n1260M61220Q0228n99861q01861
$$ 656432748 655835450 655509233 655219793 654524744 653758407 653707147 654168367 654248595 653648734 652846873
458.9F52846873o95944j046002j102328l79086r2983p40349r00388j74642j13427n22971
$$ 652846873 652150929 651104927 650002599 649623513 649530530 648790181 647889793 647715151 647601724 647078753
479.3F47078753k93494m9948o83725j099825l64721J41501n43534r84908m75466l50892
$$ 647078753 646785259 646735311 646051586 644951761 644587040 644728541 644185007 643200099 642724633 642373741
499.7F42373741r69768q89718j62960l14712q94725o59287j29700l63708r89377q48413
$$ 642373741 641403973 640514255 640351295 640036583 639141858 638482571 638352871 637989163 636999786 636151373
520.1F36151373m29988q33332j357853r88722o35684j012206j113534m58836k16246
$$ 636151373 635721385 634888053 633530200 632541478 631905794 630893588 629780054 629321218 629104972
538.4F29104972q08001r45508l37660k08855o96242p06732k69771m14848r70483r94682
$$ 629104972 628296971 627351463 627013803 626804948 626108706 625401974 625132203 624717355 623746872 622752190
558.8F22752190o90222q38816j284719j322269j127541j423180j777828j447857r71078
$$ 622752190 622061968 621223152 619938433 618616164 617488623 616065443 614287615 612839758 611868680
577.2F11868680j080990j269400r65357q31545j185238j183331n44608k09570l08513
$$ 611868680 610787690 609518290 608552933 607721388 606536150 605352819 604808211 604598641 604290128
595.6F04290128J48713Q21174N72323q4519J51336Q44360O84797m2200o2167N10335
$$ 604290128 604438841 605260015 605832338 605747819 605899155 606743515 607428312 607386112 607323945 607834280
616F07834280R81450J556336K361596K805889K518296K325237K786100L021061K450705
$$ 607834280 608815730 610372066 612733662 615539551 618057847 620383084 623169184 626190245 628640950
634.3F28640950K112567K401114J986920O63698K77341J457989K205372J368701J88351
$$ 628640950 630753517 633154631 635141551 635805249 636082590 637540579 639745951 641114652 641303003
652.7F41303003k47002L77119K027511L587902L768563K668083J938105K631306K741933
$$ 641303003 641056001 641433120 643460631 647048533 650817096 653485179 655423284 658054590 660796523
671F60796523K082825J982331K500892K592683J893937J609326K047419J992464J243472
$$ 660796523 662879348 664861679 667362571 669955254 671849191 673458517 675505936 677498400 678741872
689.4F78741872J058519J398385J127600M72486O39558J323402J396835J162171J487494
$$ 678741872 679800391 681198776 682326376 682798862 683438420 684761822 686158657 687320828 688808322
707.7F88808322J963377J863241J669526J988471K252340J818955J482487J907766
$$ 688808322 690771699 692634940 694304466 696292937 698545277 700364232 701846719 703754485
724G03754485K177298J659393J258612J615643J751125J091838P74085J280010J480818
$$ 703754485 705931783 707591176 708849788 710465431 712216556 713308394 714082479 715362489 716843307
742.4G16843307J147449J237750J854003K031326J594007J536786J980186J945376
$$ 716843307 717990756 719228506 721082509 723113835 724707842 726244628 728224814 730170190
758.7G30170190J492083J503349J665175J147389L53992K15352K96890l17931j071810
$$ 730170190 731662273 733165622 734830797 735978186 736332178 736547530 736844420 736526489 735454679
777.1G35454679j096905j022458j524865j680196p98464J70231O25909J497566L120244
$$ 735454679 734357774 733335316 731810451 730130255 729331791 729502022 730127931 731625497 734745741
795.4G34745741M424631M896999N154133N372762M882098L772199L039121K760053
$$ 734745741 739170372 744067371 749221504 754594266 759476364 763248563 766287684 769047737
811.7G69047737K000451P81119J6213m00424j382292k686977l324747l589571m269182
$$ 769047737 771048188 771829307 771845520 771445096 770062804 767375827 764051080 760461509 756192327
830.1G56192327m784167m312218l515660l356159l426075k937138k245903j777411
$$ 756192327 751408160 747095942 743580282 740224123 736798048 733860910 731615007 729837596
846.4G29837596p93337J249432L490150N123735O578445Q016527Q612454Q139968P494807
$$ 729837596 729044259 730293691 733783841 738907576 745486021 753502548 762115002 770254970 777749777
864.8G77749777P044017O058633M501164L374219K809823J911521O40809j55210n36442
$$ 777749777 784793794 790852427 795353591 798727810 801537633 803449154 804089963 803934753 803398311
883.1H03398311j276493k101123k173305j820564j744151j488209m74811N93484Q81493
$$ 803398311 802121818 800020695 797847390 796026826 794282675 792794466 792319655 792913139 793794632
901.5G93794632Q33511J081348J086533K90871o27637j116217j743435k774358l374040
$$ 793794632 794628143 795709491 796796024 797086895 796459258 795343041 793599606 790825248 787451208
919.8G87451208l080488k524852j974583j010120J90556P29859M78446L26634M25041
$$ 787451208 784370720 781845868 779871285 778861165 779051721 779781580 780260026 780586660 781011701
938.2G81011701J20699m51505n96523n08309j006365j940906k541721l114581m296839
$$ 781011701 781132400 780680895 780084372 779576063 778569698 776628792 774087071 770972490 766675651
956.6G66675651n608857o506502p483423q910775j0152817j0695398j0766446j0452927
$$ 766675651 761066794 754560292 747076869 738166094 728013277 717317879 706551433 696098506
972.9F96098506r378910p634043o082952n128920m306674l476978l028452k854824
$$ 696098506 686719596 679085553 673002601 667873681 663567007 660090029 657061577 654206753
989.2F54206753k427638j812398j469851j359761j141428r18985j093566j654804k321780
$$ 654206753 651779115 649966717 648496866 647137105 645995677 645076692 643983126 642328322 640006542
1007.5F40006542l055870l888965m541457m734933m676521m647434m519701m145801
$$ 640006542 636950672 633061707 628520250 623785317 619108796 614461362 609941661 605795860
1023.9F05795860l758669l573298l340244k835811k296328j928568j615465j238823
$$ 605795860 602037191 598463893 595123649 592287838 589991510 588062942 586447477 585208654
1040.2E85208654j009047j130223j356244j379609j285315j128792o38307K54631J192809
$$ 585208654 584199607 583069384 581713140 580333531 579048216 577919424 577281117 577535748 578728557
1058.5E78728557J807153K052545J905501J270652L98040j96815l62098m17530n40138
$$ 578728557 580535710 582588255 584493756 585764408 586162448 585965633 585603535 585186005 584645867
1076.9E84645867n50449m57644o27756j123250j630067j919449j921832j467646m02689
$$ 584645867 584095418 583637774 583010018 581886768 580256701 578337252 576415420 574947774 574545085
1095.2E74545085Q96633J835942K327025K599418K646387K416909K105534J885176
$$ 574545085 575441718 577277660 579604685 582204103 584850490 587267399 589372933 591258109
1111.6E91258109J543820P86364m05908j818419k807319k418875p67529R52959K181768
$$ 591258109 592801929 593588293 593182385 591363966 588556647 586137772 585370243 586323202 588504970
1129.9E88504970K341986J421451J093984J943946K830982L128529K949357K375900
$$ 588504970 590846956 592268407 593362391 595306337 598137319 601265848 604215205 606591105
1146.2F06591105J672030J310825J353622J482963J689017K247811L116965M065752
$$ 606591105 608263135 609573960 610927582 612410545 614099562 616347373 619464338 623530090
1162.6F23530090N060136O124079P036448P503629P585525P524848P271469O691515
$$ 623530090 628590226 634714305 641750753 649254382 656839907 664364755 671636224 678327739
1178.9F78327739N923331N079031L912509K232968L53933j362086k822637l833950
$$ 678327739 684251070 689330101 693242610 695475578 695829511 694467425 691644788 687810838
1195.2F87810838m075706l525734k625763j843214j304925j102686j439273k159893
$$ 687810838 683735132 680209398 677583635 675740421 674435496 673332810 671893537 669733644
1211.5F69733644k736032k985538l141760l200114k941251k467036k066076j729190
$$ 669733644 666997612 664012074 660870314 657670200 654728949 652261913 650195837 648466647
1227.8F48466647j267255p26461l32177o1035K93493O42181P08997N64635M66347L47316
$$ 648466647 647199392 646472931 646140754 646079719 646373212 647015393 647724390 648289025 648755372 649102688
1248.2F49102688M1902k55525k71738j12176M8459L76940R79721J601875K119482K645909
$$ 649102688 649144590 648889065 648617327 648505151 648553610 648930550 649910271 651512146 653631628 656277537
1268.6F56277537L185690L561616L748834L972232M233301M323304M310965M439235
$$ 656277537 659463227 663024843 666773677 670745909 674979210 679302514 683613479 688052714
1284.9F88052714M678845M745007M569471M366457M111767L636897L102183K771914
$$ 688052714 692731559 697476566 702046037 706412494 710524261 714161158 717263341 720035255
1301.2G20035255K586722K348483K124906K062022J990915J758277J578391J575172
$$ 720035255 722621977 724970460 727095366 729157388 731148303 732906580 734484971 736060143
1317.6G36060143J541674J419127J340150J280249J119196Q55982N95034L65436J36911
$$ 736060143 737601817 739020944 740361094 741641343 742760539 743616521 744211555 744576991 744713902
1335.9G44713902j02877k27332o3002K15351M23253N86569O30915M94480K83599J26064
$$ 744713902 744611025 744383693 744320691 744536042 744959295 745545864 746176779 746671259 746954858 747080922
1356.3G47080922N8830j71900p28130j082599j049579j085937j000762r94145j388431
$$ 747080922 747139752 746967852 746239722 745157123 744107544 743021607 742020845 741026700 739638269
1374.7G39638269j556218j603365j996100k248644j961768j720488j640380j244664
$$ 739638269 738082051 736478686 734482586 732233942 730272174 728551686 726911306 725666642
1391G25666642j136541j496971j735449k090990k267659k249360k640128k633095k270460
$$ 725666642 724530101 723033130 721297681 719206691 716939032 714689672 712049544 709416449 707145989
1409.3G07145989k116621j744806j146555j140595j560211r54330l45647k04623R9182
$$ 707145989 705029368 703284562 702138007 700997412 699437201 698482871 698137224 697932601 698031783
1427.7F98031783K47955M25101Q64148J024127J044094J335383J653790J831592J927316
$$ 698031783 698279738 698704839 699568987 700593114 701637208 702972591 704626381 706457973 708385289
1446G08385289K005338K257646K664446L123939M109085N127609M578113M286230M711628
$$ 708385289 710390627 712648273 715312719 718436658 722545743 727673352 732251465 736537695 741249323
1464.4G41249323M882395M773140N337775O485939O064474M519046L526032K822101
$$ 741249323 746131718 750904858 756242633 762728572 768793046 773312092 776838124 779660225
1480.7G79660225K184749J459360O57916n94676j789689j745343j930773l207922l881038
$$ 779660225 781844974 783304334 783962250 783367574 781577885 779832542 777901769 774693847 770812809
1499.1G70812809l289938k541363l415405p227004o822884m582822m143000l974199
$$ 770812809 767522871 764981508 761566103 754339099 747516215 742933393 738790393 734816194
1515.4G34816194l716410k987086l173352l147900k497554k459049j830101j540422
$$ 734816194 731099784 728112698 724939346 721791446 719293892 716834843 715004742 713464320
1531.7G13464320k028168j207649j94669j069844j815975p59065R001O32882J099705
$$ 713464320 711436152 710228503 710033834 708963990 707148015 706388950 706397951 707030833 708130538
1550.1G08130538J536131J988233K252697J797796P39395P32184N96285J48832p22587
$$ 708130538 709666669 711654902 713907599 715705395 716444790 717176974 717773259 717922091 717199504
1568.4G17199504j913488j864314k339184m744232n144536m475355n150140n871355
$$ 717199504 715286016 713421702 711082518 706338286 701193750 696718395 691568255 685696900
1584.7F85696900o325960o645322o879747p069111p358432p322907p026375p036864
$$ 685696900 679370940 672725618 665845871 658776760 651418328 644095421 637069046 630032182
1601.1F30032182p095516o823540o698608o947100o633520n707145o203652p694244
$$ 630032182 622936666 616113126 609414518 602467418 595833898 590126753 583923101 576228857
1617.4E76228857n580842m091442n235314n350471m755735m085958k263427j022697
$$ 576228857 570648015 566556573 561321259 555970788 551215053 547129095 544865668 543842971
1633.7E43842971j075029k16186J165092K023876K705037L381789L873229L735900
$$ 543842971 542767942 542551756 543716848 545740724 548445761 551827550 555700779 559436679
1650E59436679M169643N311429M773319M615903N208194N895376O164015N844533O368160
$$ 559436679 563606322 568917751 573691070 578306973 583515167 589410543 595574558 601419091 607787251
1668.4F07787251P180691O599307O714940P310212O929338O754875P470250Q993328
$$ 607787251 614967942 621567249 628282189 635592401 642521739 649276614 656746864 665740192
1684.7F65740192P877886O811500P260144P006704P683099Q783996R100020J0229468
$$ 665740192 673618078 680429578 687689722 694696426 702379525 711163521 720263541 730493009
1701G30493009Q544028P348597P319093O202817N419135N067527M748881M342914L555893
$$ 730493009 739037037 746385634 753704727 759907544 765326679 770394206 775143087 779486001 783041894
1719.3G83041894L025830K842784K728045K624512K671003K470672K090752J892508
$$ 783041894 786067724 788910508 791638553 794263065 796934068 799404740 801495492 803388000
1735.7H03388000J916170K025365K178252K473295K726853K841413K884090K856791
$$ 803388000 805304170 807329535 809507787 811981082 814707935 817549348 820433438 823290229
1752H23290229K566218K341151K245188K047420J748144J471818J449823J501799J363516
$$ 823290229 825856447 828197598 830442786 832490206 834238350 835710168 837159991 838661790 840025306
1770.3H40025306R51707Q04484R48071R55880Q58009Q41498Q19922P65622Q80897R31263
$$ 840025306 840977013 841781497 842729568 843685448 844543457 845384955 846204877 846970499 847851396 848782659
1790.7H48782659O94871N05745O41704P40945N89251M10080N16057O58453N37217L45706
$$ 848782659 849477530 849983275 850624979 851365924 851955175 852365255 852881312 853539765 854076982 854422688
1811.1H54422688L81649N20289M42624L45767M66287N55694M26113L76940L92020K87771
$$ 854422688 854804337 855324626 855767250 856113017 856579304 857134998 857561111 857938051 858330071 858617842
1831.5H58617842K27094K43068L48031M28021L95596K73466K39909K22444J36853K11835
$$ 858617842 858844936 859088004 859436035 859864056 860259652 860533118 860773027 860995471 861132324 861344159
1851.9H61344159L54230L13580J74105K02835K96891L02851K44081J27613N3645P0273
$$ 861344159 861698389 862011969 862186074 862388909 862685800 862988651 863232732 863360345 863413990 863484263
1872.3H63484263Q1182J33157J83403J05560O4075J71185K32517N4777n8770J32561
$$ 863484263 863565445 863698602 863882005 863987565 864051640 864222825 864455342 864510119 864451349 864583910
1892.7H64583910J94549K5690l2604O6340R5427L1650L8087Q2732L8564p570L8028
$$ 864583910 864778459 864804149 864771545 864837885 864933312 864964962 865003049 865085781 865124345 865116775 865154803
1915.1H65154803O2465M948m8995l5763K1934k8729j42336j07467k4855p7725r9599
$$ 865154803 865217268 865222216 865173221 865137458 865159392 865130663 864988327 864880860 864856005 864778280 864678681
1937.6H64678681L6359M4346j83046k83540j70767q8513j36018j79410j43170j25825
$$ 864678681 864715040 864759386 864576340 864292800 864122033 864033520 863897502 863718092 863574922 863449097
1958H63449097j64092j74463j05560j12235k28465k12788r4712r8109j90735j85251
$$ 863449097 863285005 863110542 863004982 862892747 862664282 862451494 862356782 862258673 862067938 861882687
1978.4H61882687j06573j17183j67310j19985n4836j18136k44022k34246j44958j42575
$$ 861882687 861776114 861658931 861491621 861371636 861316800 861198664 860954642 860720396 860575438 860432863
1998.8H60432863j81257j75953j42396j50263j80006j70350j22309j40786k35796k15113
$$ 860432863 860251606 860075653 859933257 859782994 859602988 859432638 859310329 859169543 858933747 858718634
2019.2H58718634j28389j53839k12133j72913j09256j36554j89781j31190n7042j13904
$$ 858718634 858590245 858436406 858224273 858051360 857942104 857805550 857615769 857484579 857427537 857313633
2039.6H57313633j85490j24931m5538j00493j53423q2016k9444r8706j36018n6147
$$ 857313633 857128143 857003212 856957674 856857181 856703758 856621742 856592298 856493592 856357574 856301427
2060H56301427j6749q4400j01090o258K5630m1127n0247J6510M054n6208j967R8050
$$ 856301427 856284678 856200278 856099188 856092930 856118560 856077433 856027186 856043696 856047750 855991542 855989575 856087625
2084.4H56087625M6551r3996p0691M9233M7505j8299K9326J05679M7624k2173L9578
$$ 856087625 856134176 856040180 855969489 856018722 856066227 856047928 856077254 856182933 856230557 856208384 856247962
2106.9H56247962R4473K1934j4960Q2433J41799N5850N603R6678J39058N7936M9352
$$ 856247962 856342435 856364369 856349409 856431842 856573641 856629491 856635094 856731772 856870830 856928766 856978118
2129.3H56978118J30296J21474O6996J01447J66774J29223N6684J05560K09748J88947
$$ 856978118 857108414 857229888 857296884 857398331 857565105 857694328 857751012 857856572 858066320 858255267
2149.7H58255267Q7440P7427J37686J34945Q8752J36375J86741J20700Q4102J61767
$$ 858255267 858342707 858420134 858557820 858692765 858781517 858917892 859104633 859225333 859309435 859471202
2170.1H59471202J98305J33693J15871J77205J77145Q1241N1200J51575K05278J21177
$$ 859471202 859669507 859803200 859919071 860096276 860273421 860354662 860405862 860557437 860762715 860883892
2190.5H60883892N6386J02758J42574Q6904K3901M2022O8009O3300R9897J39415Q5116
$$ 860883892 860940278 861043036 861185610 861272514 861296415 861338437 861406446 861469746 861569643 861709058 861794174
2212.9H61794174m173j3411N8532R3579M5658K1219N4836O9320L5107K6226O0201O3837
$$ 861794174 861790001 861776590 861835122 861928701 861974359 861995578 862050414 862119734 862154841 862181067 862241268 862305105
2237.4H62305105K9206j311K6881P0393L1472m7326m2856Q523j6033j9491O7353Q0407
$$ 862305105 862334311 862333000 862359881 862430274 862461746 862414420 862371564 862380087 862364054 862344563 862411916 862492323
2261.9H62492323P510J5140O7949L3557l7491j0848P4625O7115J3411M3988J09494
$$ 862492323 862499833 862514973 862582922 862616479 862578988 862568140 862642765 862709880 862723291 862767279 862876773
2284.3H62876773O7413l2127P808J07944L7074o1214J7762O9976m1902r6142J8298
$$ 862876773 862944186 862912059 862919867 863027811 863064885 863003671 863021433 863091409 863049507 862953365 862971663
2306.7H62971663Q3983n304o8665p808L8564l1590q1182k6822j788q1659j04427j7345
$$ 862971663 863055646 863050342 862981677 862973869 863012433 862980843 862899661 862872839 862871051 862789392 862684965 862667620
2331.2H62667620j8954r6798n8949J3113l9518n8353K10226N15878L71277n7518l19541
$$ 862667620 862648666 862551868 862492919 862506032 862466514 862408161 862618387 863134265 863505542 863448024 863128483
2353.6H63128483k97129k73943j40548R0242J13308J29402L01182M96209N02646L05593
$$ 863128483 862831354 862557411 862416863 862507105 862620413 862749815 863050997 863547206 864049852 864355445
2374H64355445K50041L76106L58641K26259J94788K08438J48355M0889J7107P2539
$$ 864355445 864605486 864981592 865340233 865566492 865761280 865969718 866118073 866158962 866176069 866248608
2394.4H66248608N3823j3292p153K5690j1742p2718m2915M4048L2603n0485n7161j5616
$$ 866248608 866302431 866289139 866281986 866307676 866295934 866223216 866180301 866224349 866256952 866206467 866149306 866133690
2418.9H66133690n8711j09315l9160R716p5639j43408p7904j1146n9545j05500n1916
$$ 866133690 866074979 865965664 865926504 865936220 865860581 865717173 865639269 865628123 865568578 865463078 865411162
2441.3H65411162l3855j14858j22845j5736J5497q6069j26302q2195j08719j43409
$$ 865411162 865377307 865262449 865139604 865123868 865139365 865053296 864926994 864844799 864736080 864592671
2461.7H64592671q7738m9770j17957j64449r0063n6267j27434j30415p1347r0599j64628
$$ 864592671 864504933 864455163 864337206 864172757 864082694 864026427 863898993 863768578 863697231 863606632 863442004
2484.2H63442004j72317j00136o7651j42157j81914q1241l5524j07289j15990p9751
$$ 863442004 863269687 863169551 863101900 862959743 862777829 862696588 862661064 862553775 862437785 862358034
2504.6H62358034r1434j19626j10507p2658q8931j56402j44363p6592q7142j21891
$$ 862358034 862266600 862146974 862036467 861963809 861874878 861718476 861574113 861497521 861410379 861288488
2525H61288488r1374o3241j06811j42038j18315q7023q7142j38163j28150l2008m1127
$$ 861288488 861197114 861133873 861027062 860885024 860766709 860679686 860592544 860454381 860326231 860294223 860253096
2547.4H60253096j18554j28150j32859j64330j76489j30773q5175j37865j81258j04964
$$ 860253096 860134542 860006392 859873533 859709203 859532714 859401941 859316766 859178901 858997643 858892679
2567.8H58892679l3378j03057j95861j72019j60336k27690k46227j97410j79589k24471
$$ 858892679 858859301 858756244 858560383 858388364 858228028 858000338 857754111 857556701 857377112 857152641
2588.2H57152641k39432k27869k70545l09348k82049k38479k59995l19779l21150k97367
$$ 857152641 856913209 856685340 856414795 856105447 855823398 855584919 855324924 855005145 854683995 854386628
2608.6H54386628l17633l35992l07023k68519k95520l55601l42489l08215l16799l07381
$$ 854386628 854068995 853733003 853425980 853157461 852861941 852506340 852163851 851855636 851538837 851231456
2629H51231456k91348l27110l40521k79904k58565l29554l79920l35872k96295l13699
$$ 851231456 850940108 850612998 850272477 849992573 849734008 849404454 849024534 848688662 848392367 848078668
2649.4H48078668l17812k96652k92778l10421k98858k74718k76029l02315l35931l07381
$$ 848078668 847760856 847464204 847171426 846861005 846562147 846287429 846011400 845709085 845373154 845065773
2669.8H45065773k59102k66492k68698k61009k95698l29018l27826l49402l85940l70026
$$ 845065773 844806671 844540179 844271481 844010472 843714774 843385756 843057930 842708528 842322588 841952562
2690.2H41952562l26872l23057l44157l47793l67999m04894l96848l72827l93510m24087
$$ 841952562 841625690 841302633 840958476 840610683 840242684 839837790 839440942 839068115 838674605 838250518
2710.6H38250518l96431l38912l53098m31478m30882l41713l31938m44711m99069m25935
$$ 838250518 837854087 837515175 837162077 836730599 836299717 835958004 835626066 835181355 834682286 834256351
2731H34256351l76165l80456l53694l38137l86477l93689k98738k75612m04298m95553
$$ 834256351 833880186 833499730 833146036 832807899 832421422 832027733 831728995 831453383 831049085 830553532
2751.4H30553532m40002l86894m43697m85956m70579m77791m81844m54664m30345m49956
$$ 830553532 830113530 829726636 829282939 828796983 828326404 827848613 827366769 826912105 826481760 826031804
2771.8H26031804n06759n49256n64516n79953n94676n74052n46515n60045n94557o19232
$$ 826031804 825525045 824975789 824411273 823831320 823236644 822662592 822116077 821556032 820961475 820342243
2792.2H20342243o61135p11799p30037p35641p63059q18252q03709p23481p75218r27389
$$ 820342243 819681108 818969309 818239272 817503631 816740572 815922320 815118611 814395130 813619912 812692523
2812.5H12692523r44853q77678r29713j008571r98497j026332j118541j170695j189053
$$ 812692523 811747670 810869992 809940279 808931708 807933211 806906879 805788338 804617643 803428590
2830.9H03428590j262128j438618j655042j910329k310574k748847l047407l180325
$$ 803428590 802166462 800727844 799072802 797162473 794851899 792103052 789055645 785875320
2847.2G85875320l072142k576173j788973j105786p63654p57039j036644j396656j692653
$$ 785875320 782803178 780227005 778438032 777332246 776568592 775811553 774774909 773378253 771685600
2865.6G71685600j950860k004564j750171j483261j324773j080215q35836q16345r48072
$$ 771685600 769734740 767730176 765980005 764496744 763171971 762091756 761255920 760439575 759491503
2883.9G59491503j087367j228571j318574j318038j355648j501679j649439j659811
$$ 759491503 758404136 757175565 755856991 754538953 753183305 751681626 750032187 748372376
2900.2G48372376j630902j722813j867354k024531k219260k467215k737641k847255
$$ 748372376 746741474 745018661 743151307 741126776 738907516 736440301 733702660 730855405
2916.6G30855405k668857k273202j774192j236439o60658j47044J34468L76343Q06571
$$ 730855405 728186548 725913346 724139154 722902715 722242057 722095013 722229481 722605824 723412395
2934.9G23412395J291632J679480J973272K071619J788377J213372O63579K99990k1517
$$ 723412395 724704027 726383507 728356779 730428398 732216775 733430147 734093726 734393716 734372199
2953.3G34372199k85745k75135j2159L16202N33819O50823P84517R24051J045882J099229
$$ 734372199 734086454 733811319 733799160 734115362 734649181 735300004 736084521 737008572 738054454 739153683
2973.7G39153683J060188J122653J232923J128196R81331R87530J017153J024306R08792
$$ 739153683 740213871 741336524 742569447 743697643 744678974 745666504 746683657 747707963 748616755
2992G48616755N45561J76609p8499l08097m42624n64456o89030o04987m35650m87566
$$ 748616755 749162316 749338925 749260426 748952329 748509705 747945249 747256219 746651232 746215582 745728016
3012.4G45728016o85871q22544q89182r42051r76742j041889j145601j151085j092136
$$ 745728016 745042145 744219601 743330419 742388368 741411626 740369737 739224136 738073051 736980915
3030.8G36980915j086593j212596j397253j364946j222372j324236j591146j676262
$$ 736980915 735894322 734681726 733284473 731919527 730697155 729372919 727781773 726105511
3047.1G26105511j532435j426339j473785j553237j575768j536250j434982j293659
$$ 726105511 724573076 723146737 721672952 720119715 718543947 717007697 715572715 714279056
3063.4G14279056j217008j319289j455009j394391j246393j147747j090050j190603
$$ 714279056 713062048 711742759 710287750 708893359 707646966 706499219 705409169 704218566
3079.7G04218566j381397j435518j412809j399338j390398j465082j543760j486063
$$ 704218566 702837169 701401651 699988842 698589504 697199106 695734024 694190264 692704201
3096F92704201j366675j382530j559436j650572j577437j555741j685738j716316j592457
$$ 692704201 691337526 689954996 688395560 686744988 685167551 683611810 681926072 680209756 678617299
3114.4F78617299j622081j795829k000868k206743k232551k060890j950324k066612
$$ 678617299 676995218 675199389 673198521 670991778 668759227 666698337 664748013 662681401
3130.7F62681401k215564k178729k061784k063990k253115k433717k411783k340078
$$ 662681401 660465837 658287108 656225324 654161334 651908219 649474502 647062719 644722641
3147F44722641k269686k181291k321244k617061k690136k596975k571165k573788k567828
$$ 644722641 642452955 640271664 637950420 635333359 632643223 630046248 627475083 624901295 622333467
3165.4F22333467k588987k607644k620757k638399k640546k642154k616108k583623
$$ 622333467 619744480 617136836 614516079 611877680 609237134 606594980 603978872 601395249
3181.7F01395249k581596k591550k638638k684892k692282k646029k589941k608239
$$ 601395249 598813653 596222103 593583465 590898573 588206291 585560262 582970321 580362082
3198E80362082k617896k572179k536356k496422k507269k557397k516687k463639k470016
$$ 580362082 577744186 575172007 572635651 570139229 567631960 565074563 562557876 560094237 557624221
3216.4E57624221k481997k504349k530634k526880k494514k434134k304137k194702
$$ 557624221 555142224 552637875 550107241 547580361 545085847 542651713 540347576 538152874
3232.7E38152874k253652k329171k236664k065718j969934j944005j909256j942277
$$ 538152874 535899222 533570051 531333387 529267669 527297735 525353730 523444474 521502197
3249E21502197k003193j937211j828968j820445j872719j867532j843155j877486j811743
$$ 521502197 519499004 517561793 515732825 513912380 512039661 510172129 508328974 506451488 504639745
3267.4E04639745j630247j631021j814902j903117j874983j830310j781404j772195
$$ 504639745 503009498 501378477 499563575 497660458 495785475 493955165 492173761 490401566
3283.7D90401566j789480j787812j740307j711130j791089j893551j954525j972556
$$ 490401566 488612086 486824274 485083967 483372837 481581748 479688197 477733672 475761116
3300D75761116j933754j802683j735598j950413k222478k294242k246708k214253k207726
$$ 475761116 473827362 472024679 470289081 468338668 466116190 463821948 461575240 459360987 457153261
3318.4D57153261k204866k165138k137959k286375k451807k431005k382487k323628
$$ 457153261 454948395 452783257 450645298 448358923 445907116 443476111 441093624 438769996
3334.7D38769996k227306k286822k434581k524227k596766k508879k310306k401798
$$ 438769996 436542690 434255868 431821287 429297060 426700294 424191415 421881109 419479311
3351D19479311k689511k747655k573341k454311k480834k452344k273053k169073k310276
$$ 419479311 416789800 414042145 411468804 409014493 406533659 404081315 401808262 399639189 397328913
3369.3C97328913k567917k587348k276749k034485k005935k003342j899272j716613
$$ 397328913 394760996 392173648 389896899 387862414 385856479 383853137 381953865 380237252
3385.7C80237252j450718j138180j151979j479745j512349j096249q23497j097978
$$ 380237252 378786534 377648354 376496375 375016630 373504281 372408032 371584535 370486557
3402C70486557j398235j136392p28608o11156n86837n96106o08206m27783k26259j89632
$$ 370486557 369088322 367951930 367223322 366612166 366025329 365429223 364821017 364393234 364166975 363977343
3422.4C63977343o8456K37942N16265N60224O11157Q12172P51704M69745M84317Q47578
$$ 363977343 363908887 364146829 364663094 365223318 365834475 366646647 367398351 367868096 368352413 369199991
3442.8C69199991J191288J303792J309723J411229J536996J638442J825094K013803
$$ 369199991 370391279 371695071 373004794 374416023 375953019 377591461 379416555 381430358
3459.1C81430358J905948J860380K255350K473682K113581J649797J684636K075493
$$ 381430358 383336306 385196686 387452036 389925718 392039299 393689096 395373732 397449225
3475.4C97449225K438814K453953K107590K078831K407968K419740K294869K438098
$$ 397449225 399888039 402341992 404449582 406528413 408936381 411356121 413650990 416089088
3491.7D16089088K594322K674371K638817K581238K578348K409071K268463K409995
$$ 416089088 418683410 421357781 423996598 426577836 429156184 431565255 433833718 436243713
3508D36243713K675503K926350K898574K672166K735912K999008L215998L100932K752125
$$ 436243713 438919216 441845566 444744140 447416306 450152218 453151226 456367224 459468156 462220281
3526.4D62220281K740056L051072L336996L499836L443211L341317L604233L868521
$$ 462220281 464960337 468011409 471348405 474848241 478291452 481632769 485237002 489105523
3542.7D89105523L714233L358752L349423L592670L727794L805876L963768M176855
$$ 489105523 492819756 496178508 499527931 503120601 506848395 510654271 514618039 518794894
3559E18794894M278004M144252L913045M244804M816711M743755M512608M610658M857361
$$ 518794894 523072898 527217150 531130195 535374999 540191710 544935465 549448073 554058731 558916092
3577.4E58916092N087018N342483N437077N208313M998207N261839N369961N343199
$$ 558916092 564003110 569345593 574782670 579990983 584989190 590251029 595620990 600964189
3593.7F00964189N545914N755663N770981N746961N678773N487084N609512N853534
$$ 600964189 606510103 612265766 618036747 623783708 629462481 634949565 640559077 646412611
3610F46412611N825520N841374N728126N675792O007850N809188N291641M980028N278170
$$ 646412611 652238131 658079505 663807631 669483423 675491273 681300461 686592102 691572130 696850300
3628.4F96850300N906343N454243N077064M999578M856884M807174M729450M462838
$$ 696850300 702756643 708210886 713287950 718287528 723144412 727951586 732681036 737143874
3644.7G37143874M234672M414499M429638L795266L395021L670633L725648L178298
$$ 737143874 741378546 745793045 750222683 754017949 757412970 761083603 764809251 767987549
3661G67987549K807319K782941K596617K358019K575219K405167J898586J898766J994968
$$ 767987549 770794868 773577809 776174426 778532445 781107664 783512831 785411417 787310183 789305151
3679.4G89305151J964926J974225J966536J891613J526773J170338J263439J383722
$$ 789305151 791270077 793244302 795210838 797102451 798629224 799799562 801063001 802446723
3695.7H02446723J283824J041174R30071J120687J227379J027882O67095N35548Q30114
$$ 802446723 803730547 804771721 805701792 806822479 808049858 809077740 809744835 810280383 811110497
3714H11110497R08732P65920O68883N96464M85181M32730O07073P28429O06656M03345
$$ 811110497 812019229 812785149 813454032 814050496 814535677 814968407 815575480 816303909 816910565 817313910
3734.4H17313910N07950P50721N70357K920j32680N00918M41134O0975L24190O05643
$$ 817313910 817821860 818572581 819142938 819145858 819013178 819514096 819955230 820016205 820340395 820946038
3754.8H20946038M36961J67609K12490L24190K80023K16841J26839J70290L27826M24027
$$ 820946038 821382999 821550608 821763098 822087288 822367311 822584152 822710991 822881281 823209107 823633134
3775.2H23633134M21524K49803J04845Q4519J05799J43945K16246K75552J54078O9856
$$ 823633134 824054658 824304461 824409306 824493825 824599624 824743569 824959815 825235367 825389445 825459301
3795.6H25459301K66672K08318j0848J28746J7464k1934K75552L19004Q7797K2948
$$ 825459301 825725973 825934291 825923443 826052189 826069653 826047719 826323271 826642275 826730072 826753020
3816H26753020J92523r8824j66595J99437J78099J03652J35124K07126K82407N1319
$$ 826753020 826945543 826846719 826680124 826879561 827057660 827161312 827296436 827503562 827785969 827837288
3836.4H27837288k80618j53244L7849J44839K81573L10778N96p63595n16951M72725
$$ 827837288 827556670 827403426 827441275 827586114 827867687 828178465 828179061 827415466 826898515 827371240
3856.8H27371240M55737J08778j18196o1452P75k01464o9439J66475J18316J06513
$$ 827371240 827826977 827935755 827817559 827756107 827756882 827555418 827485979 827652454 827770770 827877283
3877.2H27877283r894j2398Q2612m4703l7253k4796j18613L6120K01464Q8394j24753
$$ 827877283 827867389 827854991 827937603 827892900 827855647 827830851 827712238 827748358 827949822 828038216 827913463
3899.6H27913463k55465k27273j4961J26362Q8155M2499J0311n6088l8981P7784K6226
$$ 827913463 827657998 827430725 827415764 827542126 827630281 827672780 827683091 827627003 827588022 827665806 827692032
3922.1H27692032j10984j4663J09971K0861n6445J7285L4452m7744q6069m4644O5148
$$ 827692032 827581048 827566385 827676356 827697217 827640772 827658057 827692509 827644765 827558696 827514052 827579200
3944.5H27579200J06633J9968j4842L8922O6519L7014n36j490p689P15Q5830J23263
$$ 827579200 827685833 827705801 827690959 827729881 827796400 827833414 827832878 827831388 827823699 827824414 827910244 828033507
3969H28033507N1141J9788O2347P3790K8372L9101J19865R2745j8895l6836P093K9028
$$ 828033507 828084648 828104436 828166783 828240573 828268945 828308046 828427911 828520656 828501761 828464925 828472018 828501046
3993.4H28501046N6088Q3148
$$ 828501046 828557134 828640282
3997.5H28640282
$$ 828640282
##END=$$ End of the data block
