##TITLE=$$ Begin of the data block
##JCAMP-DX=5.00 $$ ACD/SpecManager v 10.08
##SPECTROMETER/DATA SYSTEM=Alpha
##DATE=09 Apr 2014 11:14:46
##DATA TYPE=INFRARED SPECTRUM
##DATA CLASS=XYDATA
##ORIGIN=
##OWNER=
##NPOINTS=1765
##FIRSTX=399.75695801
##LASTX=3997.56933594
##MAXX=3997.56933594
##MINX=399.75695801
##MAXY=0.86671084
##MINY=0.36375549
##XFACTOR=1.0000000000
##YFACTOR=1.000000000000000e-9
##FIRSTY=0.67162293
##DELTAX=2.03957629
##XUNITS=1/CM
##YUNITS=ARBITRARY UNITS
##XYDATA=(X++(Y..Y))
399.8 671622932 670296729 668829501 667243361 665599465 663962662 662749529 662257195 662190437 661715150
418.1 661715150 660598993 659851134 659206569 658413887 658013523 658104956 657864690 656808794 655791640
436.5 655791640 655449808 655421972 655399382 655192494 654460609 653341830 652749240 652980685 653113961 652643919
456.9 652643919 652131617 651619911 650471032 649271488 648999095 649001837 648253918 647270262 647021890 646938622
477.3 646938622 646301746 645751834 645717084 645327270 644443333 644181013 644343555 643667459 642569780 642210603
497.7 642210603 642086804 641214669 640293181 640148401 639947116 639160156 638533950 638256252 637625396 636553347
518.1 636553347 635741830 635277450 634455860 633149028 632172108 631550789 630549848 629470289 629017413
536.4 629017413 628691137 627835691 627037168 626823187 626509726 625604689 624832332 624647439 624321461 623446405
556.8 623446405 622604191 621972322 620929897 619395852 618041158 617017090 615684927 613940358 612576067
575.2 612576067 611777782 610736370 609227121 607914746 606942594 605948389 605100989 604784966 604659438
593.5 604659438 604346395 604405940 605135739 605700254 605628669 605728805 606477141 607127190 607135653 607137263 607672215
616 607672215 608643234 610197842 612588882 615469694 618033469 620283306 622939050 625890017 628389239
634.3 628389239 630629122 633070767 634985805 635713518 636231005 637838006 639957190 641168773 641348422
652.7 641348422 641194344 641689420 643815458 647337973 650988758 653654754 655551672 658035696 660737813
671 660737813 662888527 664942682 667415142 670008242 671978831 673567533 675517082 677475452 678746581
689.4 678746581 679851353 681295753 682433188 682905674 683550119 684851110 686171770 687267721 688809872
707.7 688809872 690908194 692828357 694411516 696326435 698637128 700552166 702057362 703952193
724 703952193 706159830 707845211 709104717 710677505 712292731 713304400 714147329 715540171 717124820
742.4 717124820 718313873 719514608 721332610 723351777 724956810 726488948 728389859 730263174
758.7 730263174 731742501 733223975 734848320 735986829 736405790 736727417 737087071 736761510 735643327
777.1 735643327 734500170 733467698 731968582 730267763 729379714 729520619 730214477 731760085 734894991
795.4 734894991 739336729 744212627 749342263 754748940 759681821 763449550 766450942 769195080
811.7 769195080 771195590 771972477 771975994 771566391 770177007 767458618 764069200 760443032 756244600
830.1 756244600 751564562 747266471 743709981 740335286 736921549 734002411 731766641 729978025
846.4 729978025 729134738 730359852 733880460 739028335 745585799 753526032 762077868 770258844 777874887
864.8 777874887 785020590 791091323 795552909 798866451 801582396 803394973 803993165 803893566 803460717
883.1 803460717 802230239 800098538 797904193 796109676 794394076 792912245 792409122 792966723 793837607
901.5 793837607 794656217 795700550 796750188 797045290 796430409 795285225 793525815 790775418 787414193
919.8 787414193 784333467 781818867 779841065 778830886 779041529 779766858 780211627 780505180 780906916
938.2 780906916 780995607 780537069 780004740 779533982 778485656 776541471 774044275 770922720 766584873
956.6 766584873 760958731 754458606 746990979 738112926 727999508 717307389 706499696 695991814
972.9 695991814 686597466 679001153 672958732 667845905 663528383 660033405 657027245 654209971
989.2 654209971 651778340 649936676 648419738 647010505 645869732 644980550 643898845 642250538 639962494
1007.5 639962494 636948824 633059025 628465891 623667359 618981063 614390194 609922767 605782568
1023.9 605782568 601997912 598403275 595085859 592312694 590047598 588095725 586454034 585174680
1040.2 585174680 584121585 583018184 581739902 580417871 579148710 578015566 577393591 577684164 578877330
1058.5 578877330 580641210 582652211 584542513 585811853 586194396 585977733 585620344 585235059 584748268
1076.9 584748268 584220707 583728611 583068490 581919432 580263257 578344047 576419055 574943006 574565589
1095.2 574565589 575523794 577403367 579699457 582250476 584915400 587405920 589566171 591433525
1111.6 591433525 592936277 593696892 593248844 591396391 588589668 586170435 585377097 586290598 588452280
1129.9 588452280 590810418 592257977 593378484 595364928 598224819 601329088 604211152 606545269
1146.2 606545269 608244181 609593689 610944450 612411618 614095569 616348982 619486630 623570919
1162.6 623570919 628654301 634812117 641845345 649295568 656827509 664321005 671559155 678203106
1178.9 678203106 684081972 689158082 693113148 695375323 695723355 694370329 691578090 687751830
1195.2 687751830 683663964 680122197 677480698 675636828 674338639 673242569 671834350 669723213
1211.5 669723213 667005360 663994253 660828114 657633364 654693961 652230084 650197268 648498416
1227.8 648498416 647249401 646543443 646218359 646171570 646490037 647128046 647827089 648399532 648887575 649272382
1248.2 649272382 649326205 649046123 648741841 648598135 648630500 649002790 649990618 651627839 653771162 656392872
1268.6 656392872 659535527 663087368 666856468 670829475 675040662 679340482 683621705 688050985
1284.9 688050985 692755520 697524011 702097297 706445634 710516870 714126766 717256963 720097721
1301.2 720097721 722724676 725067437 727188408 729245126 731214285 732974589 734578669 736162663
1317.6 736162663 737695336 739103615 740440607 741737008 742875218 743712842 744266152 744610190 744751930
1335.9 744751930 744676650 744503260 744484067 744702399 745110750 745674014 746274829 746744156 747021317 747169375
1356.3 747169375 747240245 747053921 746332705 745282054 744239688 743125439 742082834 741071045 739698231
1374.7 739698231 738153934 736549199 734560430 732333899 730380297 728640437 727005839 725801826
1391 725801826 724669755 723127961 721356452 719266534 717020750 714771926 712122917 709495187 707231462
1409.3 707231462 705138147 703415751 702261746 701114118 699562907 698598504 698246539 698083341 698224962
1427.7 698224962 698474944 698891938 699725747 700692356 701729119 703108013 704789400 706607580 708484828
1446 708484828 710437238 712680399 715359271 718497932 722588539 727677524 732269526 736583471 741313875
1464.4 741313875 746226668 751007736 756292701 762710035 768771470 773337364 776906133 779732406
1480.7 779732406 781893253 783324361 783956170 783346951 781576455 779860377 777928174 774704099 770849466
1499.1 770849466 767601192 765051782 761540294 754184604 747402251 742924690 738826513 734828711
1515.4 734828711 731084228 728076518 724882185 721767843 719302654 716872036 715068758 713509798
1531.7 713509798 711472273 710281670 710061908 708979130 707277060 706621289 706657648 707273006 708339095
1550.1 708339095 709852457 711823761 714034021 715763330 716524541 717333198 717979670 718135536 717377722
1568.4 717377722 715452552 713617146 711294591 706572413 701461494 696981251 691797912 685895383
1584.7 685895383 679542065 672863185 665951788 658881068 651562929 644267380 637207866 630107105
1601.1 630107105 622968018 616139829 609445274 602486849 595828593 590078056 583819807 576119184
1617.4 576119184 570579946 566502810 561251640 555894673 551149607 547080278 544831216 543773413
1633.7 543773413 542599022 542378902 543624401 545689881 548361242 551679432 555566609 559352040
1650 559352040 563520730 568858683 573696077 578331828 583545208 589481115 595703840 601554215 607873440
1668.4 607873440 615006983 621608317 628382683 635778189 642732918 649432898 656787634 665691435
1684.7 665691435 673610985 680498183 687799037 694791079 702428341 711173236 720238030 730491698
1701 730491698 739105105 746486604 753815055 760020494 765437126 770488918 775196791 779544711 783179283
1719.3 783179283 786258638 789130688 791878045 794483304 797101498 799517989 801599264 803552568
1735.7 803552568 805508137 807535827 809698880 812156975 814887464 817726433 820602298 823485553
1752 823485553 826098323 828449011 830659211 832678676 834417045 835892439 837371230 838893175 840211332
1770.3 840211332 841129899 841987967 842980027 843923986 844753921 845595777 846447587 847239196 848085761 848947644
1790.7 848947644 849636555 850189745 850855291 851589322 852168202 852589846 853124559 853794515 854336560 854685664
1811.1 854685664 855072796 855574191 855985582 856336474 856822968 857379138 857783020 858109236 858480155 858824313
1831.5 858824313 859108925 859362900 859704673 860145748 860551476 860800147 861007452 861228943 861392856 861629903
1851.9 861629903 861982644 862279892 862455070 862678885 862984598 863258600 863458931 863568187 863621116 863690674
1872.3 863690674 863781929 863949180 864181042 864317060 864371657 864493251 864677668 864734948 864701331 864834666
1892.7 864834666 865018547 865040064 865028679 865140975 865265191 865279675 865271926 865335286 865385056 865362942 865375042
1915.1 865375042 865443170 865471065 865439773 865409493 865421116 865394235 865278661 865185440 865142763 865046978 864953756
1937.6 864953756 864989877 865005612 864803851 864537001 864397466 864325404 864181757 864013076 863920748 863811314
1958 863811314 863597333 863372386 863251448 863140583 862931788 862752318 862665653 862554431 862358630 862171888
1978.4 862171888 862056434 861927271 861756384 861639202 861578643 861447453 861198306 860964715 860820949 860690475
1998.8 860690475 860525489 860355854 860214651 860065758 859893084 859733701 859612644 859463871 859222412 859007120
2019.2 859007120 858876050 858706832 858469069 858283401 858178079 858065367 857923746 857819140 857738853 857602537
2039.6 857602537 857439935 857336104 857277155 857154369 856990814 856929243 856919348 856799483 856638134 856580079
2060 856580079 856566846 856490135 856393218 856388211 856428027 856395185 856341898 856355309 856351912 856285751 856271029 856349170
2084.4 856349170 856379807 856293678 856261969 856357217 856429636 856409431 856414378 856494427 856524408 856479943 856513143 856630087
2108.9 856630087 856669724 856667221 856768131 856927335 856998980 857003868 857080638 857200921 857238352 857284844 857459486
2131.3 857459486 857613087 857636869 857679307 857844353 857997894 858067513 858180583 858380914 858560205 858680904
2151.7 858680904 858814657 858960867 859046936 859098494 859235525 859436810 859570980 859656274 859815717 860024571
2172.1 860024571 860166192 860281765 860464513 860643327 860720694 860782206 860932529 861092687 861164868 861225963
2192.5 861225963 861362219 861512959 861604750 861657500 861729801 861819983 861897826 861980319 862083316 862163484 862169564
2215 862169564 862167120 862254620 862368941 862410605 862417698 862455010 862520516 862573087 862591684 862611771 862654269 862679601
2239.4 862679601 862677932 862720311 862796187 862802982 862760246 862750053 862749100 862716496 862709701 862774789 862833142 862823188 862829924
2265.9 862829924 862900853 862966239 862993360 863033593 863107622 863139451 863119781 863150358 863241851 863269091 863200426
2288.4 863200426 863194525 863320172 863399684 863367975 863392472 863471627 863471866 863429606 863451481 863505900 863473356 863404989
2312.9 863404989 863438547 863474488 863384366 863286555 863304257 863368511 863361478 863299131 863258302 863216877 863139808 863110244
2337.3 863110244 863144636 863090396 862992764 863187432 863706291 864071429 863980174 863619685 863324106 863088191
2357.7 863088191 862938404 862977326 863136232 863372624 863692820 864118159 864572883 864875078 865094960 865436137
2378.1 865436137 865808189 866049767 866230011 866429627 866555393 866548419 866554022 866650641 866710842 866676569 866653025
2400.6 866653025 866693377 866699755 866628110 866590858 866637468 866647720 866573334 866528332 866538763 866475999 866342962
2423 866342962 866297126 866325021 866275072 866156816 866101563 866108119 866069138 865981638 865931928 865899205 865792096 865653455
2447.5 865653455 865581930 865537286 865424275 865300715 865248621 865186393 865057707 864938080 864853680 864737213
2467.9 864737213 864602089 864543676 864520371 864408612 864257038 864163578 864065409 863895595 863708675 863598168
2488.3 863598168 863560259 863451421 863251567 863144338 863135874 863054276 862905979 862795532 862706721 862594664
2508.7 862594664 862490892 862428784 862355828 862216413 862073243 861975968 861884773 861798644 861726999 861634851 861485362
2531.1 861485362 861317456 861211956 861144423 861045122 860923827 860837281 860786974 860710859 860605896 860510767 860394955
2553.5 860394955 860231936 860063553 859925985 859802067 859644175 859473944 859375477 859326839 859207630 859007418
2573.9 859007418 858816624 858631730 858392537 858155549 858002484 857860565 857641697 857400715 857162595 856889844
2594.3 856889844 856609344 856353462 856118202 855850875 855501413 855133533 854807973 854492486 854180872 853896856
2614.7 853896856 853627384 853328466 853007674 852707446 852385521 852023602 851680040 851377249 851083815 850774407
2635.1 850774407 850484669 850217700 849894166 849511743 849170387 848894060 848608494 848279655 847955167 847668946
2655.5 847668946 847407877 847143888 846853614 846561551 846259892 845918596 845602214 845336676 845054567 844759464
2675.9 844759464 844483614 844178557 843833923 843509197 843192458 842836261 842481732 842166841 841842592 841484427
2696.3 841484427 841112971 840721667 840320647 839942753 839580834 839206755 838809192 838403285 838018537 837632596
2716.7 837632596 837207317 836805403 836479008 836150765 835725605 835240543 834799528 834396720 834008515 833673418
2737.1 833673418 833348751 832957923 832545757 832209110 831912696 831525564 831050813 830628932 830252707 829795599
2757.5 829795599 829305887 828877985 828431070 827910304 827402890 826942742 826495647 826048017 825553060 824979842
2777.9 824979842 824373484 823784471 823215127 822652936 822092533 821497560 820858598 820191503 819489062 818762779
2798.3 818762779 818017125 817244291 816454530 815683603 814947546 814141750 813184083 812210321 811319172 810398996
2818.7 810398996 809408069 808420002 807408094 806290984 805082798 803859234 802606106 801216424 799625933
2837 799625933 797749698 795448661 792694867 789609075 786382437 783282936 780706346 778931022 777832866
2855.4 777832866 777070463 776312292 775303423 773941994 772219658 770224035 768234313 766527057 765079558
2873.7 765079558 763776362 762695193 761837542 760994494 760038674 758969486 757767022 756450891 755097747
2892.1 755097747 753723085 752237678 750590980 748916686 747290671 745578706 743682742 741634309
2908.4 741634309 739430428 736995578 734289408 731432498 728721678 726413965 724656641 723480701
2924.7 723480701 722816825 722602904 722708464 723094404 723916352 725236356 726947665 728916407 730930269
2943.1 730930269 732661605 733862340 734551549 734912157 734959781 734684229 734371185 734352171 734683216 735204756
2963.5 735204756 735820830 736585081 737534583 738620877 739732981 740797758 741916835 743132710 744270742
2981.8 744270742 745294809 746325791 747355998 748357117 749230862 749748170 749941528 749941468 749703586 749234498
3002.2 749234498 748574495 747834504 747226655 746787846 746320248 745666385 744867623 744004667 743087888 742120504
3022.6 742120504 741051197 739848793 738660276 737579525 736525416 735323668 733914495 732533753
3038.9 732533753 731290340 729969800 728437901 726826310 725325465 723887086 722354710 720776081
3055.3 720776081 719236195 717712998 716262400 714957416 713730156 712433934 711011171 709582031
3071.6 709582031 708269775 707104743 706040025 704890907 703556478 702151835 700751483 699362636
3087.9 699362636 697972238 696491182 694938004 693455160 692077279 690640390 689019978 687368214
3104.2 687368214 685811222 684258938 682597399 680903077 679317832 677720129 675925732 673879981
3120.5 673879981 671635509 669423342 667409658 665479302 663431644 661225319 659024894 656965673
3136.8 656965673 654911339 652615845 650135100 647719085 645396054 643141448 640936971 638571739
3153.2 638571739 635952532 633270741 630657136 628080964 625512958 622948945 620376766 617780626
3169.5 617780626 615152299 612516582 609906137 607278407 604630113 602018654 599402010 596746325
3185.8 596746325 594110906 591509879 588898659 586265028 583590150 580891311 578248799 575656950
3202.1 575656950 573095024 570592165 568084240 565553188 563058257 560586929 558131516 555647075
3218.4 555647075 553107500 550584257 548120320 545689821 543273568 540931225 538690865 536400795
3234.7 536400795 534010947 531751573 529683352 527644157 525640249 523709357 521765232 519806266
3251.1 519806266 517907858 516081274 514233172 512316108 510442257 508623540 506763756 504963517
3267.4 504963517 503329873 501672029 499833435 497919917 496058911 494276285 492479324 490626067
3283.7 490626067 488813698 487037957 485270768 483538330 481755733 479850411 477877021 475929976
3300 475929976 474083602 472334921 470525116 468482494 466243654 463937551 461649418 459440023 457296938
3318.4 457296938 455149680 452968419 450755596 448471963 446088612 443669230 441261381 438906074
3334.7 438906074 436645627 434363395 431950033 429452389 426870733 424296200 421908200 419509113
3351 419509113 416833073 414038569 411436558 409047097 406625777 404146343 401839912 399676353 397324145
3369.3 397324145 394691944 392112821 389858902 387797564 385755807 383745581 381836653 380105019
3385.7 380105019 378666580 377541631 376385719 374894083 373365790 372284681 371530861 370467752
3402 370467752 369005889 367817611 367130518 366575271 365965992 365296870 364669204 364267170 364031166 363822222
3422.4 363822222 363755494 363996118 364516199 365081370 365698993 366504282 367212355 367634237 368145168 369062424
3442.8 369062424 370244652 371469021 372735381 374190599 375806779 377491474 379336447 381352514
3459.1 381352514 383243382 385080695 387319237 389813632 391954601 393585324 395249724 397315145
3475.4 397315145 399713814 402150452 404300392 406427175 408856720 411278516 413551331 416002959
3491.7 416002959 418658614 421335310 423942924 426529378 429122120 431537300 433797926 436216205
3508 436216205 438929796 441865623 444759190 447450608 450190276 453198880 456476629 459632665 462405473
3526.4 462405473 465169817 468226969 471534014 475004673 478452325 481793910 485378653 489285588
3542.7 489285588 493068099 496448278 499795020 503403723 507183194 511022627 514982402 519182563
3559 519182563 523489714 527585566 531428993 535689831 540556252 545306504 549837053 554495037 559381068
3577.4 559381068 564493418 569832683 575213611 580384195 585396707 590703309 596152067 601568699
3593.7 601568699 607128203 612885416 618684649 624449372 630133271 635645211 641285956 647167385
3610 647167385 653068542 659012616 664769292 670395434 676395893 682278335 687634766 692598820 697790265
3628.4 697790265 703642011 709123552 714293659 719366193 724207163 728979409 733695567 738122046
3644.7 738122046 742279828 746647418 751099288 754907548 758303165 761964142 765691221 768928111
3661 768928111 771796286 774585426 777158797 779493272 782023489 784303427 786086619 788055599 790132344
3679.4 790132344 792116523 794140577 796134591 798010349 799555063 800752103 802025259 803419888
3695.7 803419888 804696798 805704534 806612492 807752907 808986008 809949517 810547829 811084330 811929941
3714 811929941 812834859 813588858 814271510 814924657 815437794 815861106 816459239 817164660 817789614 818281412
3734.4 818281412 818838537 819564402 820070207 819966078 819671094 820084393 820584238 820773244 821209550 821830630
3754.8 821830630 822212517 822394550 822715461 823091328 823311687 823479176 823652983 823891461 824221671 824573278
3775.2 824573278 824954331 825241566 825371146 825447500 825551808 825703561 825862288 826063871 826269805 826448083
3795.6 826448083 826696694 826748669 826610565 826780379 826920271 826968551 827256143 827593327 827685833 827621520
3816 827621520 827700078 827609897 827505171 827714443 827904820 828038514 828177452 828395963 828733921 828787923
3836.4 828787923 828397572 828157604 828254342 828522027 828861296 829138100 829016447 828131378 827654243 828224003
3856.8 828224003 828748643 828885972 828748822 828689098 828747809 828592062 828497291 828627765 828756392 828853369
3877.2 828853369 828794241 828775585 828884959 828860104 828867555 828840971 828652024 828683197 828905940 828929424 828714311
3899.6 828714311 828452229 828274071 828281939 828427792 828581810 828717530 828755975 828612208 828445852 828478336
3920 828478336 828580976 828555286 828530252 828579366 828540027 828471422 828558385 828673899 828660786 828565836 828506112
3942.5 828506112 828592241 828695595 828661084 828623235 828672886 828776240 828878403 828871489 828789413 828784227 828865767
3964.9 828865767 828932166 828979731 829059541 829156518 829251349 829325795 829342306 829378426 829510391 829606116 829569876
3987.3 829569876 829501510 829504192 829569697 829638958 829689145
3997.5 829689145
##END=$$ End of the data block
