##TITLE=$$ Begin of the data block
##JCAMP-DX=5.00 $$ ACD/SpecManager v 10.08
##SPECTROMETER/DATA SYSTEM=Alpha
##DATE=09 Apr 2014 11:14:46
##DATA TYPE=INFRARED SPECTRUM
##DATA CLASS=XYDATA
##ORIGIN=
##OWNER=
##NPOINTS=1765
##FIRSTX=399.75695801
##LASTX=3997.56933594
##MAXX=3997.56933594
##MINX=399.75695801
##MAXY=0.86709535
##MINY=0.36352921
##XFACTOR=1.0000000000
##YFACTOR=1.000000000000000e-9
##FIRSTY=0.67173719
##DELTAX=2.03957629
##XUNITS=1/CM
##YUNITS=ARBITRARY UNITS
##XYDATA=(X++(Y..Y))
399.8F71737194j628220j384437j130164j278817j363337r37224o15835n36621q59916
418.1F62002623j270235q21053n86689o57141l16799J4067m23789j085460r39548l48926
438.5F55567050j68145k86042l60728n23388o85394k56240K25484j03533o02246m81367
458.9F52325451n15878j312256j385212k26020K11417p03752j056790k93434j79529
477.3F46863997o68407m32193J49966j37568o62267l15905j48654r16362j124501m73916
497.7F42134190l17395p83682q20279k79665k90990p88808o44564j85133m24027j037478
518.1F36562169r04441m68970q33690j344740r82821o38068r75549j020730m64201
536.4F28928959l41773q10980p86126k35200k28107p72476q36015l64482l83437q54790
$$ y = [671737194, 670108974, 668724537, 667594373, 666315556, 664952219, 664014995, 663399160, 662862539, 662002623, 660732388, 659911335, 659324646, 658667505, 658350706, 658364773, 657940984, 656855524, 655915976, 655567050, 655398905, 655112863, 654752135, 654228747, 653543353, 653287113, 653512597, 653409064, 652806818, 652325451, 651809573, 650497317, 649112105, 648886085, 649097502, 648393750, 647336960, 647043526, 646863997, 646195590, 645763397, 645913363, 645775795, 645113528, 644797623, 644648969, 643732607, 642608106, 642134190, 641816795, 641033113, 640212834, 639933169, 639642179, 638853371, 638208807, 638023674, 637599647, 636562169, 635657728, 635188758, 634355068, 633010328, 632027507, 631389439, 630413890, 629393160, 628928959, 628587186, 627776206, 626990080, 626754880, 626526773, 625754297, 624918282, 624553800, 624170363, 623315573]
556.8F23315573q57294o52611j004398j466274j289130j018881j409412j679718j210571
575.2F12727284r20295j299203j494229j074433q23259j074434j054406m68790j70768
593.5F04347467k68459J97589Q82686O13689o9201J69277Q14379O49273j3113m1187
613.9F07282400M97162R38118J498222K383471K915025K609253K368152K798080K988994
632.3F26278877K432704K113581K345383J927078P18772M42148J598358K185523J242697
650.6F41285121J86325j07527M83691K040029L530920L748178K711833J932203K572716
669F58383489K730131K118468K060115K538741K578676J888692J603484K055765K022504
687.3F77980065J219094R79483J355112J117051M56810O18875J343905J458526J181245
$$ y = [623315573, 622458279, 621805668, 620801270, 619334996, 618045866, 617026985, 615617573, 613937855, 612727284, 611806989, 610507786, 609013557, 607939124, 607115865, 606041431, 604987025, 604518235, 604347467, 604079008, 604276597, 605159283, 605772972, 605703771, 605873048, 606687427, 607336700, 607323587, 607282400, 607779562, 608717680, 610215902, 612599373, 615514398, 618123651, 620491803, 623289883, 626278877, 628711581, 630825162, 633170545, 635097623, 635816395, 636258543, 637856901, 640042424, 641285121, 641471446, 641363919, 641847610, 643887639, 647418559, 651166737, 653878570, 655810773, 658383489, 661113620, 663232088, 665292203, 667830944, 670409620, 672298312, 673901796, 675957561, 677980065, 679199159, 680178642, 681533754, 682650805, 683107615, 683726490, 685070395, 686528921, 687710166]
705.7F87710166J514912K065658J920343J583695J862228K205491J864314J577556
722G02304363J962841K162337J592577J210987J652897J765549J060664Q24035J400530
740.4G15936780J582563J150012J142800J766920J995504J618147J591801J991272
756.7G28775799J925290J462936J454771J595676J057684K98202K43843L88205k13027
775G36989379j037002j158118j059771j501500j691401q39412J77622O97255J548409
793.4G32125461L094792M360199M804433N094588N419433M954636L771365L011941
809.7G66636848K778888K008379P20441l8862m28200j446426k728701l291547l547311
828.1G60663509m225611m723907m280507l522098l378749l426433k902687k231121
$$ y = [687710166, 689225078, 691290736, 693211079, 694794774, 696657002, 698862493, 700726807, 702304363, 704267204, 706429541, 708022118, 709233105, 710886002, 712651551, 713712215, 714536250, 715936780, 717519343, 718669355, 719812155, 721579075, 723574579, 725192726, 726784527, 728775799, 730701089, 732164025, 733618796, 735214472, 736272156, 736570358, 736814201, 737202406, 736989379, 735952377, 734794259, 733734488, 732232988, 730541587, 729702175, 729879797, 730577052, 732125461, 735220253, 739580452, 744384885, 749479473, 754898906, 759853542, 763624907, 766636848, 769415736, 771424115, 772144556, 772105694, 771677494, 770231068, 767502367, 764210820, 760663509, 756437898, 751713991, 747433484, 743911386, 740532637, 737106204, 734203517, 731972396]
844.4G31972396j762032p49111J256048L459216N132138O594360P948578Q516013Q140266
862.7G70507872P579506P110893O055594M446208L318787K767682J860321N95092j67668
881.1H04074287n11467j213551k031028k157569j848936j750111j489759n22852N43058
899.4G93092072Q60572Q17537J034916J017749L09050n34236j077712j757622k787113
917.8G90975213l399730l112495k531826j974464j015901J53363O38842L95715L18051
936.2G80446768M64201J26838m48763n25653m84109j094699j982689k491474l072679
954.5G70937741m287482n608737o502330p482291q922338j0165870j0684312j0750532
970.8G06533849j0453462r361148p618010o090105n113661m287362l501177l042638
$$ y = [731972396, 730210364, 729461253, 730717301, 734176517, 739308655, 745903015, 753851593, 762367606, 770507872, 778087378, 785198271, 791253865, 795700073, 799018860, 801786542, 803646863, 804241955, 804074287, 803562820, 802349269, 800318241, 798160672, 796311736, 794561625, 793071866, 792549014, 793092072, 793952644, 794770181, 795805097, 796822846, 797131896, 796597660, 795519948, 793762326, 790975213, 787575483, 784462988, 781931162, 779956698, 778940797, 779094160, 779733002, 780128717, 780446768, 780910969, 781037807, 780589044, 780063391, 779579282, 778484583, 776501894, 774010420, 770937741, 766650259, 761041522, 754539192, 747056901, 738134563, 727968693, 717284381, 706533849, 696080387, 686719239, 679101229, 673011124, 667897463, 663610101, 660108924, 657066286]
987.1F57066286k826333k427638j861036j522958j391232j166523r46700j085222j622021
1005.5F42216623k284110l023445l891707m563689m759550m660785m584015m481494
1021.8F09967828m152656l781199l577829l322959k796590k242327j899361j603723
1038.1E86591184j236260j046359j162291j307785j296044j251280j152873o60658
1054.5E77477634K69711J197994J790166K021432J855552J251578M09901j98602l64542
1072.8E85710824l84808m68850n10931m87924o62565j137257j636803j899898j894712
1091.2E76627076j456380l72291R45330J851857K300620K574682K647400K434134K130866
1109.5E89683294J885951J500964P55787m02033j833737k847135k461076q38816Q55028
$$ y = [657066286, 654239953, 651812315, 649951279, 648428321, 647037089, 645870566, 644923866, 643838644, 642216623, 639932513, 636909068, 633017361, 628453672, 623694122, 619033337, 614449322, 609967828, 605815172, 602033973, 598456144, 595133185, 592336595, 590094268, 588194907, 586591184, 585354924, 584308565, 583146274, 581838489, 580542445, 579291165, 578138292, 577477634, 577747345, 578945339, 580735505, 582756937, 584612489, 585864067, 586273968, 586075366, 585710824, 585326016, 584857166, 584346235, 583858311, 583195746, 582058489, 580421686, 578521788, 576627076, 575170696, 574798405, 575743735, 577595592, 579896212, 582470894, 585118294, 587552428, 589683294, 591569245, 593070209, 593825996, 593423963, 591590226, 588743091, 586282015, 585443199, 586298227]
1127.9E86298227K150178K428651J544953J170635J961648K812445L098727K916455
1144.2F04381919K361476J675427J288951J318156J492799J736223K270163L093957
1160.5F19619071M018307N016208O111562P046759P496298P537841P470966P254839
1176.8F71571851O688654N907417N062043L905297K236306L53098j369834k814948
1193.1F91539884l824473m082680l527879k618134j832843j273096j057148j421213
1209.5F71902418k156675k724528k996862l158569l164769k882659k448738k086281
1225.8F50283337j745403j253605o92546k95043k6286L08335O14106O73712N74946
1244.1F48441553N19991L99292M9233k64108k58804j06871L1174L65972R86874J591683
$$ y = [586298227, 588448405, 590877056, 592422009, 593592644, 595554292, 598366737, 601465464, 604381919, 606743395, 608418822, 609707773, 611025929, 612518728, 614254951, 616525114, 619619071, 623637378, 628653586, 634765148, 641811907, 649308205, 656846046, 664317012, 671571851, 678260505, 684167922, 689229965, 693135262, 695371568, 695724666, 694354832, 691539884, 687715411, 683632731, 680104852, 677486718, 675653875, 674380779, 673323631, 671902418, 669745743, 667021215, 664024353, 660865784, 657701015, 654818356, 652369618, 650283337, 648537934, 647284329, 646591783, 646296740, 646270454, 646578789, 647192895, 647866607, 648441553, 648961544, 649360836, 649410069, 649145961, 648887157, 648780286, 648811460, 649177432, 650164306, 651755989]
1264.5F51755989K066969K591253L161728L561855L751635L960252M211664M299045
1280.8F79360390M305064M458309M687845M739702M562497M343093M083156L644347
1297.2G14184403L149987K825379K618194K377569K160967K062320J959742J750528
1313.5G33089089J595736J578271J538754J424372J329005J272559J145244Q84175
1329.8G43857205O03795L62098J16110j36971k31207j3411K50399L98517N51283O28650
1350.2G46386468N02766K83479J20104L8743j92106p23660j062334j033246j084089
1368.5G43236125j020134j023710j387238j519501j584292k002776k260685j974225
1384.9G30463564j710951j588881j218140j201153j586377j758636k068102k233684
$$ y = [651755989, 653822958, 656414211, 659575939, 663137794, 666889429, 670849681, 675061345, 679360390, 683665454, 688123763, 692811608, 697551310, 702113807, 706456900, 710540056, 714184403, 717334390, 720159769, 722777963, 725155532, 727316499, 729378819, 731338561, 733089089, 734684825, 736263096, 737801850, 739226222, 740555227, 741827786, 742973030, 743857205, 744461000, 744823098, 744939208, 744802237, 744571030, 744557619, 744808018, 745206535, 745757818, 746386468, 746889234, 747172713, 747292817, 747331560, 747139454, 746415794, 745353460, 744320214, 743236125, 742215991, 741192281, 739805043, 738285542, 736701250, 734698474, 732437789, 730463564, 728752613, 727163732, 725945592, 724744439, 723158062, 721399426, 719331324, 717097640]
1401.2G17097640k234638k609610k575577k253770k128303j756549j180351j176179
1417.5G01182663j534760r06765l28004j79887J16467K35737M08113Q17716R44018
1435.9G00755298J035333J404524J684129J788676J874387J996040K272010K663553
1452.2G15473950L082812L997504N070150M655958M346311M737019M928529M791916
1468.5G51084149N272508O391048O051898M569054L582716K860069K200425J441121
1484.8G83452988N87225o51479j738906j703858j994551l285288l851057l234863k569139
1503.2G65011072l553092p350564o722987m435122m089952m020690l773213l025174
1519.5G28040278l188670l089130k415418k362252j761853j558900k050102j190781
$$ y = [717097640, 714863002, 712253392, 709677815, 707424045, 705295742, 703539193, 702358842, 701182663, 699647903, 698741138, 698413134, 698233247, 698349714, 698585451, 698993564, 699811280, 700755298, 701790631, 703195155, 704879284, 706667960, 708542347, 710538387, 712810397, 715473950, 718556762, 722554266, 727624416, 732280374, 736626685, 741363704, 746292233, 751084149, 756356657, 762747705, 768799603, 773368657, 776951373, 779811442, 782011867, 783452988, 784040213, 783388734, 781649828, 779945970, 777951419, 774666131, 770815074, 767580211, 765011072, 761457980, 754107416, 747384429, 742949307, 738859355, 734838665, 731065452, 728040278, 724851608, 721762478, 719347060, 716984808, 715222955, 713664055, 711613953, 710423172]
1535.8G10423172k40505j127899j687944o00457O5327O15120J079082J544654J974345
1554.1G12044895K161443J655161Q14438R04739O77824J48833p87318j938224j823663
1572.5G13858128k357901m777669n078376m411936n137622n887806o387651o743014
1588.8F73076153o945551p077217p345736p332265p067859p100404p153868o844759
1605.1F16208494o714881o989717o661713n713046o228566p727862n610823m161120
1621.4E66400766n312323n360425m697680m007578k249718j115203j202464j96338
1637.8E42259037J272262K083480K653599L262102L878892L818333M177392N388796
1654.1E68793893M938662M701853N240917N937517O208956N841672O331623P167458
$$ y = [710423172, 710182667, 709054768, 707366824, 706766367, 706831694, 707446814, 708525896, 710070550, 712044895, 714206338, 715861499, 716675937, 717580676, 718258500, 718407333, 717620015, 715681791, 713858128, 711500227, 706722558, 701644182, 697232246, 692094624, 686206818, 679819167, 673076153, 666130602, 659053385, 651707649, 644375384, 637307525, 630207121, 623053253, 616208494, 609493613, 602503896, 595842183, 590129137, 583900571, 576172709, 570561886, 566400766, 561088443, 555728018, 551030338, 547022760, 544773042, 543657839, 542455375, 542259037, 543531299, 545614779, 548268378, 551530480, 555409372, 559227705, 563405097, 568793893, 573732555, 578434408, 583675325, 589612842, 595821798, 601663470, 607995093, 615162551]
1670.4F15162551O614983O764412P391096O946325O683648P332265Q915841P988692
1686.7F73799813O924748P294059O964028P569134Q683264R085119J0286033Q597672
1703G39203870P363439P356644O250739N432963N017102M644692M362643L715872L101766
1721.4G86449730K856732K759218K632678K623558K396404K033532J922488J948357
1737.7H05622697K019048K195060K502441K718270K802670K873004K923667K661169
1754H26318026K378881K208709J992166J734317J495897J467228J486004J286924R09507
1772.4H41277659Q73804R91464R19938Q26895Q82745Q89420Q06988Q59916Q49306O53446
1792.8H49831581N45204O62148P16269N78582M43220N42581O67155N48601L66032M20094
$$ y = [615162551, 621777534, 628541946, 635933042, 642879367, 649563015, 656895280, 665811121, 673799813, 680724561, 688018620, 694982648, 702551782, 711235046, 720320165, 730606198, 739203870, 746567309, 753923953, 760174692, 765607655, 770624757, 775269449, 779632092, 783347964, 786449730, 789306462, 792065680, 794698358, 797321916, 799718320, 801751852, 803674340, 805622697, 807641745, 809836805, 812339246, 815057516, 817860186, 820733190, 823656857, 826318026, 828696907, 830905616, 832897782, 834632099, 836127996, 837595224, 839081228, 840368152, 841277659, 842151463, 843142927, 844062865, 844889760, 845772505, 846661925, 847468913, 848328829, 849178135, 849831581, 850376785, 851038933, 851755202, 852333784, 852777004, 853319585, 853986740, 854535341, 854901373, 855321467]
1813.2H55321467N31793M00483L09467M56632N31912L86416L37542L83019L54350L04043
1833.6H59317124K57909L18408M08530L71993K31206K53261K89321J94609K34544L42607
1854H62219512K93911J73926K14994K98202K69175J68443P9155R4592J29163R7394
1874.4H64038467J38522K15530J32740N3525J45435K11835M3928o6399J15096J90378
1894.7H65219057M7266q583Q7380J13309K9445L2126R8944M7922l4511k742L8147J8001
1919.2H65685761j9074l2722P808k9326j17302p5578k1696r5070r8884L6716N365k14219
1943.7H65031779k65360j38223o9678j34587j83642j23918j04606j89662k11478j12295
1964.1H63498330j01328k01821j87099r8944j09374j77503j74820j22488j37389j81794
$$ y = [855321467, 855853260, 856253743, 856563210, 857019842, 857551754, 857938170, 858275712, 858658731, 859013081, 859317124, 859575033, 859893441, 860301971, 860673964, 860905170, 861158431, 861447752, 861642361, 861876905, 862219512, 862513423, 862687349, 862902343, 863200545, 863469720, 863638163, 863717318, 863811910, 863941073, 864038467, 864176989, 864392519, 864525259, 864578784, 864724219, 864936054, 864979982, 864913583, 865028679, 865219057, 865266323, 865257740, 865345120, 865458429, 865487874, 865520000, 865618944, 865666866, 865632355, 865629613, 865667760, 865685761, 865666687, 865633965, 865641773, 865612447, 865495145, 865419567, 865397871, 865302801, 865203917, 865240633, 865245998, 865031779, 864766419, 864628196, 864558518, 864423931, 864240289, 864116371, 864011765, 863822103, 863610625, 863498330, 863397002, 863195181, 863008082, 862909138, 862799764, 862622261, 862447441, 862324953, 862187564, 862005770]
1984.5H62005770j38163o8903j05381k09928k09033j36376j54197k00212j75655j33097
2004.9H60474825j54734j99556j75297j18137j48833k24471j87873j30237j76847k13444
2025.3H58745396j51098q7916j19567j95682j66357q2076r6798j45793j33335r9182
2045.7H57467592j17123j23382n3644k1100j04606j47999o6995k2352p8857r4414m649
2068.1H56632471K7895m5836o2823P868J0848n1976j4603Q3447M9710n8532k1636Q0585
2092.6H56637418N2572k8253J967O4075K9862k3902M4227J26958M8518l58J01388J32263
2117.1H57186735K9742P034J15335J37746L3498M7386J71542J40667L3855Q4520J82032
2139.5H58170092J13070J2219J07884K48313K00451P9632P4148J51574J63436J14084
$$ y = [862005770, 861867607, 861798704, 861693323, 861483395, 861274362, 861137986, 860983789, 860783577, 860607922, 860474825, 860320091, 860120535, 859945238, 859827101, 859678268, 859453797, 859265924, 859135687, 858958840, 858745396, 858594298, 858506382, 858386815, 858191133, 858024776, 857942700, 857845902, 857700109, 857566774, 857467592, 857350469, 857227087, 857173443, 857152343, 857047737, 856899738, 856832743, 856810391, 856731534, 856637120, 856632471, 856660366, 856614530, 856551707, 856559575, 856570423, 856518447, 856503844, 856587291, 856637001, 856578469, 856556833, 856637418, 856689990, 856661737, 856663704, 856727779, 856757641, 856733739, 856777966, 856904924, 856953442, 856953084, 857054472, 857186735, 857216477, 857223511, 857338846, 857476592, 857510090, 857557476, 857729018, 857869685, 857903540, 857988060, 858170092, 858283162, 858295381, 858403265, 858651578, 858852029, 858931661, 859005809, 859157383, 859320819, 859434903]
2159.9H59434903J43289J75953J15216P8618J53244J98483J32084J24038K05338K00390
2180.3H60961556Q1838L4868J26839J75297R9182O0797J26302J60993Q8155K8431O3837
2202.7H62008095P3373N5254J03771J40310R1791J5139Q047O2883O0677K4260N2809
2225.2H62696409Q7917O9976M2796M6194N0425K3961n841q404K9206M3988q642l4154
2249.6H63033831J3113L0697k1399j6272N8115N1618j9372P153Q6724P2241J908R298
2274.1H63307655O6757L3259j490P3493J29223N2213m8637J073J01387M5598m4584
2296.5H63715947P152O5446K8908j728K1517K2590l4749l6895O2584O8248q6367j46330
2321H63686323k9206J8120o8665n4836O1571K7895j07884r7811J3590k0743q6546K23697
$$ y = [859434903, 859578192, 859754145, 859869361, 859947979, 860101223, 860299706, 860431790, 860555828, 860761166, 860961556, 861043394, 861078262, 861205101, 861380398, 861479580, 861540377, 861666679, 861827672, 861915827, 861944258, 862008095, 862081468, 862136722, 862240493, 862380803, 862472594, 862487733, 862495780, 862558663, 862619340, 862643600, 862696409, 862784326, 862854302, 862897098, 862943292, 862993717, 863017678, 863011837, 863003433, 863032639, 863076627, 863067985, 863033831, 863046944, 863077641, 863056242, 863039970, 863098085, 863149703, 863130331, 863137484, 863224208, 863296449, 863298357, 863307655, 863374412, 863407671, 863406181, 863479674, 863608897, 863661110, 863612473, 863613546, 863714933, 863760531, 863715947, 863723099, 863788545, 863817453, 863815725, 863837242, 863859832, 863825083, 863788188, 863850772, 863919020, 863832653, 863686323, 863657117, 863675237, 863606572, 863551736, 863613307, 863641202, 863533318, 863435507, 863449097, 863428354, 863341808, 863565505]
2345.5H63565505N81324L83198r5010l40462k47419k06351j96397n007J32322K27929
2365.9H63799632L84986M78029L94821K03729K12550L78132L44217J82569J69873K27094
2386.3H66775632J54853j371j2517J04546P4208o0439n0783M6253M6373j2279j7941
2408.7H67046535N424m828l6597k8074J252o8784j38760m9591J4007p9155j36613o1036
2433.2H66463780j6272p2360r1672l0458j9073q6129r8705m0829n6982j44482j30475
2455.6H65676343o4849j08064j53601q3923k0802o4135j10209q2671p5579j37270j58488
2478.1H64616752r5070o9737j35422j86622j41263p4446j25587j87397r1851j9670
2498.5H63489687j06275j59979r8526n6624q1182q1301m9114r6619j88947j74284r1195
$$ y = [863565505, 864146829, 864530027, 864435017, 864094555, 863847136, 863640785, 863444388, 863439381, 863571703, 863799632, 864184618, 864662647, 865057468, 865261197, 865473747, 865851879, 866196096, 866378665, 866548538, 866775632, 866930485, 866929114, 866916597, 867021143, 867095351, 867034912, 866984129, 867030382, 867076755, 867064476, 867046535, 867051959, 867047131, 867010534, 866982460, 866983712, 866914928, 866776168, 866726577, 866740584, 866661429, 866524816, 866463780, 866447508, 866375148, 866283476, 866253018, 866233945, 866147816, 866049111, 866008282, 865951300, 865806818, 865676343, 865611494, 865503430, 865349829, 865265906, 865245104, 865180969, 865070760, 864988089, 864912510, 864775240, 864616752, 864521682, 864451945, 864316523, 864129901, 863988638, 863914192, 863788605, 863601208, 863509357, 863489687, 863383412, 863223433, 863124907, 863068283, 862987101, 862905800, 862856686, 862760067, 862571120, 862396836, 862305641]
2520.9H62305641p2539j03712r9182p6353j09137j31130r7811r4295j23858j28269
2541.3H61269355q5533m6789q1540j27911j27018j24752j30177j25706j18196j19746
2561.7H60181987j52111j61826r5308n7996j38998k13444j76072j42753k05338k48611
2582.1H58589530j94371j64032k15173k36213k34961k75076l05771k88070k55584k69413
2602.5H56150866l03448l01957k95698l17574l43144l23892k79426k85328l18586l15249
2622.9H53066564l18647l46243l38614l10362l21447l24786k79248k59519l16977l71039
2643.3H49879682l33726k79665k87056l24488l25859k97844l00646k98619k73526k70068
2663.7H46888185l13163l50356l06428k46823k54690k72572k62082l00229l58879l47674
$$ y = [862305641, 862233102, 862129390, 862030208, 861953855, 861844718, 861713588, 861615777, 861521482, 861397624, 861269355, 861183822, 861137033, 861055493, 860927582, 860800564, 860675812, 860545635, 860419929, 860301733, 860181987, 860029876, 859868050, 859772742, 859714746, 859575748, 859362304, 859186232, 859043479, 858838141, 858589530, 858395159, 858231127, 858015954, 857779741, 857544780, 857269704, 856963933, 856675863, 856420279, 856150866, 855847418, 855545461, 855249763, 854932189, 854589045, 854265153, 853985727, 853700399, 853381813, 853066564, 852747917, 852401674, 852063060, 851752698, 851431251, 851106465, 850827217, 850567698, 850250721, 849879682, 849545956, 849266291, 848979235, 848654747, 848328888, 848031044, 847730398, 847431779, 847158253, 846888185, 846575022, 846224666, 845918238, 845671415, 845416725, 845144153, 844882071, 844581842, 844222963, 843875289]
2684.1H43875289l19719l40402l61622l35038l31401l69132l58403l41713l84867m05371
2704.5H40327621l68894l57031l92676m05371l79264l98875m62413m35888l27230k95818
2724.8H36504161m01497m87387m26769l76046l84569l35634l29136m09961m15147l25322
2745.2H32612693l09765m05133m57525m00603l84211m73440n00620m32074m14252m71651
2765.6H28363419n01633m80771m66407m78208n08070n47826n94854n90444n35369n18083
2786H23141754n52833o26922o80864o79850o70076o89566p62224q25763q26597p72417
2806.4H16054642p25150q14974r48727r27925q80063r44495r97663r89020j017451
2824.8H07809174j109719j185715j207769j261473j407385j586139j844049k284228
$$ y = [843875289, 843555570, 843215168, 842853546, 842518508, 842187107, 841817975, 841459572, 841117859, 840732992, 840327621, 839958727, 839601696, 839209020, 838803649, 838424385, 838025510, 837563097, 837127209, 836799979, 836504161, 836102664, 835615277, 835188508, 834812462, 834427893, 834092259, 833763123, 833353162, 832938015, 832612693, 832302928, 831897795, 831440270, 831039667, 830655456, 830182016, 829681396, 829249322, 828835070, 828363419, 827861786, 827381015, 826914608, 826436400, 825928330, 825380504, 824785650, 824195206, 823659837, 823141754, 822588921, 821961999, 821281135, 820601285, 819931209, 819241643, 818479419, 817653656, 816827059, 816054642, 815329492, 814514518, 813565791, 812637866, 811757803, 810813308, 809815645, 808826625, 807809174, 806699455, 805513740, 804305971, 803044498, 801637113, 800050974, 798206925, 795922697]
2841.1G95922697k777338l112138l222108l082037k563059j777112j132191p93993
2857.4G77462721p53462j003862j372099j689017j935958j984776j761972j508832
2873.7G65452743j319111j070499q41737p97212r10044j063049j215040j312912j342773
2892.1G55580366j401246j537502j656472j648903j645983j757800j881778k015174
2908.4G42035508k209961k431572k657473k827167k738774k316892j760245j233279
2924.7G23860145o89686j66356J52230M29749Q79467J340628J676857J923919K016127
2943.1G31423080J759410J186669O45399L36468M4704k66731l00527k0087L38018N42045
2963.5G35688448O28412P63535R36508J072586J128376J132011J167536J185417J081943
$$ y = [795922697, 793145359, 790033221, 786811113, 783729076, 781166017, 779388905, 778256714, 777462721, 776709259, 775705397, 774333298, 772644281, 770708323, 768723547, 766961575, 765452743, 764133632, 763063133, 762221396, 761424184, 760514140, 759451091, 758236051, 756923139, 755580366, 754179120, 752641618, 750985146, 749336243, 747690260, 745932460, 744050682, 742035508, 739825547, 737393975, 734736502, 731909335, 729170561, 726853669, 725093424, 723860145, 723170459, 723004103, 723156333, 723586082, 724465549, 725806177, 727483034, 729406953, 731423080, 733182490, 734369159, 735014558, 735351026, 735395730, 735128999, 734828472, 734808385, 735146403, 735688448, 736316860, 737080395, 738016903, 739089489, 740217865, 741349876, 742517412, 743702829, 744784772]
2981.8G44784772J002551J040995J065135J066506R24944N09322J40131m5479k42173
3000.2G50246704m46201o12318o80208n98193n05626n37693o49870p67767q88467r74476
3020.6G43585885r90630j052975j168251j143396j040340j045048j233935j450062
3036.9G34461248j360059j179814j274407j502514j644731j609563j504779j494527
3053.2G22890854j511276j490176j486301j470685j381755j265287j269937j390099
3069.5G11625338j411260j298368j135051j019299j128435j354575j435101j442611
3085.8G01400638j476348j467526j461863j512647j498222j372755j375198j553655
3102.2F89682424j647592j583993j532972j643419j703501j602888j647949j826286
$$ y = [744784772, 745787323, 746828318, 747893453, 748959959, 749884903, 750394225, 750534356, 750488877, 750246704, 749800503, 749188185, 748507977, 747909784, 747404158, 746866465, 746216595, 745448828, 744560361, 743585885, 742595255, 741542280, 740374029, 739230633, 738190293, 737145245, 735911310, 734461248, 733101189, 731921375, 730646968, 729144454, 727499723, 725890160, 724385381, 722890854, 721379578, 719889402, 718403101, 716932416, 715550661, 714285374, 713015437, 711625338, 710214078, 708915710, 707780659, 706761360, 705632925, 704278350, 702843249, 701400638, 699924290, 698456764, 696994901, 695482254, 693984032, 692611277, 691236079, 689682424, 688034832, 686450839, 684917867, 683274448, 681570947, 679968059, 678320110, 676493824]
3118.5F76493824k009750k212763k223313k027273j919329k032459k228141k253651
3134.8F59587145k100349k067625k279282k428055k389013k356291k295911k215624
3151.1F41454995k336026k569437k642989k581179k551377k602935k621889k579748
3167.4F20969415k573550k612352k656222k641678k624988k634347k622246k635241
3183.7E99968791k672970k634406k581716k649009k695561k644598k627730k665282
3200.1E78797519k643823k549470k480864k496362k553046k562880k503276k442539
3216.4E58565259k503991k594948k544343k439440k416610k419413k330780k217710
3232.7E39098024k260744k361059k285421k142489k049923j943350j895010j956940
$$ y = [676493824, 674484074, 672271311, 670047998, 668020725, 666101396, 664068937, 661840796, 659587145, 657486796, 655419171, 653139889, 650711834, 648322821, 645966530, 643670619, 641454995, 639118969, 636549532, 633906543, 631325364, 628773987, 626171052, 623549163, 620969415, 618395865, 615783513, 613127291, 610485613, 607860625, 605226278, 602604032, 599968791, 597295821, 594661415, 592079699, 589430690, 586735129, 584090531, 581462801, 578797519, 576153696, 573604226, 571123362, 568627000, 566073954, 563511074, 561007798, 558565259, 556061268, 553466320, 550921977, 548482537, 546065927, 543646514, 541315734, 539098024, 536837280, 534476221, 532190800, 530048311, 527998388, 526055038, 524160028, 522203088]
3249E22203088j988411j936436j864910j861751j909912j860737j798630j824916j786410
3267.4E05370975j685381j722992j830578j849085j848846j855076j848996j830935
3283.7D90899086j802593j791418j774162j768857j796604j837909j943856k007455
3300D76176232j891464j745790j774579j986653k232820k380282k338796k188802k147645
3318.4D57489401k208322k219647k190709k292902k444565k418011k363295k360344
3334.7D38991606k274364k275884k449513k562582k621383k602487k416045k397865
3351D19391483k643078k764792k615183k437711k446920k469003k289414k180547k382964
3369.3C97161871k624839k583534k317756k103329j985401j942754j940131j791119
$$ y = [522203088, 520214677, 518278241, 516413331, 514551580, 512641668, 510780931, 508982301, 507157385, 505370975, 503685594, 501962602, 500132024, 498282939, 496434093, 494579017, 492730021, 490899086, 489096493, 487305075, 485530913, 483762056, 481965452, 480127543, 478183687, 476176232, 474284768, 472538978, 470764399, 468777746, 466544926, 464164644, 461825848, 459637046, 457489401, 455281079, 453061432, 450870723, 448577821, 446133256, 443715245, 441351950, 438991606, 436717242, 434441358, 431991845, 429429263, 426807880, 424205393, 421789348, 419391483, 416748405, 413983613, 411368430, 408930719, 406483799, 404014796, 401725382, 399544835, 397161871, 394537032, 391953498, 389635742, 387532413, 385547012, 383604258, 381664127, 379873008]
3385.7C79873008j418919j094758j190484j529306j528114j098007q21561j081317
3402C70110542j379967j148015p47294o12974o05941o17742n91338m20332k65032j92702
3422.4C63529205J0938L08454N10305N04047N67436Q25167P73191M38571M48734Q54343
3442.8C68770391J196503J300782J326859J439542J573563J659035J816720K019584
3459.1C81102979J926214J868188K268344K516270K158403J643926J637280K019376
3475.4C97140980K408594K494901K185047K091795K377272K442658K326488K437234
3491.7D15904969K600580K672077K649545K620221K581805K401977K299220K430915
3508D36161309K687365K950788K928048K702922K740323L016174L284872L143161K737701
$$ y = [379873008, 378454089, 377359331, 376168847, 374639541, 373111427, 372013420, 371191859, 370110542, 368730575, 367582560, 366835266, 366222292, 365616351, 364998609, 364407271, 363986939, 363721907, 363529205, 363540143, 363848597, 364358902, 364862949, 365430385, 366255552, 367028743, 367467314, 367916048, 368770391, 369966894, 371267676, 372594535, 374034077, 375607640, 377266675, 379083395, 381102979, 383029193, 384897381, 387165725, 389681995, 391840398, 393484324, 395121604, 397140980, 399549574, 402044475, 404229522, 406321317, 408698589, 411141247, 413467735, 415904969, 418505549, 421177626, 423827171, 426447392, 429029197, 431431174, 433730394, 436161309, 438848674, 441799462, 444727510, 447430432, 450170755, 453186929, 456471801, 459614962, 462352663]
3526.4D62352663K729833L066093L349632L516585L500014L405482L622353L871053
3542.7D89413708L758371L440440L409177L589213L712714L861248M041910M206717
3559E19433498M275144M123330L868281M212142M868149M821122M557848M670978M941880
3577.4E59772372N148053N333662N387247N195141N024314N317330N469561N436897
3593.7F02084577N588830N794286N839825N833149N734801N461693N552769N877077
3610F47767007N939067N970359N786061N654812O046772N935669N358576M911662N137384
3628.4F98507369N899190N556465N161285N052328M872084M794419M705846M420757
3644.7G38969743M112244M254937M466057L932178L461897L694833L761887L216326
$$ y = [462352663, 465082496, 468148589, 471498221, 475014806, 478514820, 481920302, 485542655, 489413708, 493172079, 496612519, 500021696, 503610909, 507323623, 511184871, 515226781, 519433498, 523708642, 527831972, 531700253, 535912395, 540780544, 545601666, 550159514, 554830492, 559772372, 564920425, 570254087, 575641334, 580836475, 585860789, 591178119, 596647680, 602084577, 607673407, 613467693, 619307518, 625140667, 630875468, 636337161, 641889930, 647767007, 653706074, 659676433, 665462494, 671117306, 677164078, 683099747, 688458323, 693369985, 698507369, 704406559, 709963024, 715124309, 720176637, 725048721, 729843140, 734548986, 738969743, 743081987, 747336924, 751802981, 755735159, 759197056, 762891889, 766653776, 769870102]
3661G69870102K815068K760530K540767K285421K566218K338350J710892J894712K134442
3679.4G90916502K020419J953304J899779J816153J537860J260102J351892J447738
3695.7H04203749J296639R83477Q90434J155257J198947Q89361N17249N14567R69827
3714H12619507J060427Q48650P14779O02603L97802L54945O03795O67334M67181L32475
3734.4H18669498N81920Q89242O15120j54376l33965N37634N19454q881L32773P56264
3754.8H22404683N26905K07483L19064M11213K51233J57535J12653J99676L78668M10676
3775.2H25379789L44455K28107J52350J05381J48594K35379K24471K13325J27256J3411
3795.6H27172518J24514M0233j09136K08080J34527M9115L52740L44396M2378k6822
$$ y = [769870102, 772685170, 775445700, 777986467, 780271888, 782838106, 785176456, 786887348, 788782060, 790916502, 792936921, 794890225, 796790004, 798606157, 800144017, 801404119, 802756011, 804203749, 805500388, 806483865, 807374299, 808529556, 809728503, 810617864, 811135113, 811649680, 812619507, 813679934, 814528584, 815243363, 815845966, 816243768, 816598713, 817202508, 817869842, 818337023, 818669498, 819251418, 820140660, 820755780, 820601404, 820267439, 820805073, 821324527, 821315646, 821648419, 822404683, 822931588, 823139071, 823458135, 823869348, 824120581, 824278116, 824390769, 824590445, 824969113, 825379789, 825724244, 825952351, 826104701, 826210082, 826358676, 826594055, 826818526, 827031851, 827159107, 827172518, 827297032, 827337265, 827228129, 827436209, 827570736, 827619851, 827972591, 828316987, 828359365, 828332543]
3816H28332543K00272r2924j99079K04265K16186J57177J52529J71065K58386J8835
3836.4H29419255l39865j51992J09672K13206L34025L04758j73509j022518m85360
3854.8H28207672O89923N59092P0989j81436k4140P1108j99020j12176J46210J97709
3875.2H29425931J93059k6941k38J40428o5028q4937r4831j69754J37865K78652j2815
3897.6H29721391k73406l12031k01046L8326J73807J49488J28389M3809r0480n7697
3918H29320550O1989J9133p7784J9908J16467K563l7491L0637k2233m9233l6061k1041
3942.5H29327404J00077J30057O5804O3479K9444j0013J013j0550k1637L8088Q6784
3964.9H29799950N2214N245j431N5552J16825J09434P7367R2268J15514L7253o6638
$$ y = [828332543, 828532815, 828439891, 828240812, 828445077, 828661263, 828818440, 828970969, 829142034, 829400420, 829419255, 829079390, 828927398, 829037070, 829250276, 829584301, 829889059, 829715550, 828693032, 828207672, 828897595, 829456687, 829527676, 829346240, 829322100, 829393208, 829194188, 829082012, 829228222, 829425931, 829618990, 829592049, 829591811, 829732239, 829667211, 829582274, 829487443, 829317689, 829455554, 829734206, 829721391, 829447985, 829135954, 828934908, 828973234, 829147041, 829296529, 829424918, 829468727, 829378247, 829320550, 829382539, 829401672, 829323888, 829343796, 829460263, 829462826, 829425335, 829455972, 829433739, 829384506, 829348445, 829327404, 829427481, 829557538, 829623342, 829686821, 829716265, 829706252, 829707265, 829696715, 829675078, 829713166, 829799950, 829852164, 829857409, 829855978, 829911530, 830028355, 830137789, 830215156, 830307424, 830422938, 830460191, 830393553]
3987.3H30393553n0962K5332O6221R7930J02162
3997.5H30634236
$$ y = [830393553, 830342591, 830367923, 830434144, 830532074, 830634236]
##END=$$ End of the data block
