##TITLE=$$ Begin of the data block
##JCAMP-DX=5.00 $$ ACD/SpecManager v 10.08
##SPECTROMETER/DATA SYSTEM=Alpha
##DATE=09 Apr 2014 11:14:46
##DATA TYPE=INFRARED SPECTRUM
##DATA CLASS=XYDATA
##ORIGIN=
##OWNER=
##NPOINTS=1765
##FIRSTX=399.75695801
##LASTX=3997.56933594
##MAXX=3997.56933594
##MINX=399.75695801
##MAXY=0.86754024
##MINY=0.36365396
##XFACTOR=1.0000000000
##YFACTOR=1.000000000000000e-9
##FIRSTY=0.67042404
##DELTAX=2.03957629
##XUNITS=1/CM
##YUNITS=ARBITRARY UNITS
##XYDATA=(X++(Y..Y))
399.8F70424044k095044j768052p75576l46124j061320j211763p48515q56459j266837
$$ 670424044 668329000 666560948 665785372 665439248 664377928 663166165 662417650 661561191 660294354
418.1F60294354r59635j78933j97947o53565o81639m00602n46337r98318p64251k02775
$$ 660294354 659334719 659155786 658957839 658304274 657622635 657222033 656675696 655677378 654913127 654710352
438.5F54710352k99990l64184j12355m33504q36850k90990M38333J76787o00993o95944
$$ 654710352 654410362 654046178 653933823 653500319 652663469 652372479 652810812 652987599 652386606 651690662
458.9F51690662m28379r53972j209855m58658j18732p41542r68635k65002j59502p48038
$$ 651690662 651262283 650308311 649098456 648639798 648521066 647779524 646810889 646545887 646386385 645638347
479.3F45638347n92769j0311l39389p80463k24948L6776p45773r80556l63470l66091
$$ 645638347 645045578 645035267 644695878 643915415 643690467 643727243 642981470 642000914 641637444 641271353
499.7F41271353j034320r84847j93954j09911p21335p03216j93417l49700r37343q31008
$$ 641271353 640237033 639252186 639058232 638948321 638226986 637523770 637330353 636980653 636043310 635212302
520.1F35212302m61280p71761j244545r85980o48975j006365j159728n57661l61502
$$ 635212302 634751022 633979261 632734716 631748736 631099761 630093396 628933668 628376007 628014505
538.4F28014505q77142q85427l44336l06845p15017o79314k77996m18365r29714q51571
$$ 628014505 627137363 626251936 625907600 625600755 624885738 624206424 623928428 623510063 622580349 621728778
558.8F21728778n24402q85725j459002j346231j093745j427770j570165j069546q09967
$$ 621728778 621204376 620318651 618859649 617513418 616419673 614991903 613421738 612352192 611542225
577.2F11542225j236498j519859j100838q98302j236260j040578k39015m4941l37124
$$ 611542225 610305727 608785868 607685030 606786728 605550468 604509890 604270875 604225934 603888810
595.6F03888810J00434Q38220O99818M3034M6611O53923P48276J77741L9399M58181
$$ 603888810 603989244 604827464 605527282 605570316 605616927 606270850 607019126 607196867 607236266 607694447
616F07694447Q26120J438082K446770L014267K629936K277314K722204L023446K531647
$$ 607694447 608520567 609958649 612405419 615419686 618049622 620326936 623049140 626072586 628604233
634.3F28604233K261997K444922J885534O18756L71754J545846K143741J291394K97785
$$ 628604233 630866230 633311152 635196686 635815442 636187196 637733042 639876783 641168177 641465962
652.7F41465962k4855N46872K058745L496468L792465K829432J924336K363741K634228
$$ 641465962 641441107 641987979 644046724 647543192 651335657 654165089 656089425 658453166 661087394
671F61087394K175033K048850K437174K608478J989842J578986J952947K008080J363516
$$ 661087394 663262427 665311277 667748451 670356929 672346771 673925757 675878704 677886784 679250300
689.4F79250300J165450J446723J114727M27842O23882J337528J384258J125395J511813
$$ 679250300 680415750 681862473 682977200 683405042 684028924 685366452 686750710 687876105 689387918
707.7F89387918K079546J958728J642823J902699K213598J883447J583815J911819
$$ 689387918 691467464 693426192 695069015 696971714 699185312 701068759 702652574 704564393
724G04564393K068936J531363J220882J629531J726091J094103Q43287J347839J525164
$$ 704564393 706633329 708164692 709385574 711015105 712741196 713835299 714678586 716026425 717551589
742.4G17551589J178563J250565J810610J948297J588881J556456J911879J887202
$$ 717551589 718730152 719980717 721791327 723739624 725328505 726884961 728796840 730684042
758.7G30684042J476765J458645J613318J108826L46839K53677L27409l02375j071393
$$ 730684042 732160807 733619452 735232770 736341596 736688435 736942112 737269521 736967146 735895753
777.1G35895753j123726j009703j485348j706779q44538J86741O74486J530409L137768
$$ 735895753 734772027 733762324 732276976 730570197 729725659 729912400 730586886 732117295 735255063
795.4G35255063M425048M870415N133331N356550M846573L754556L079176K766311
$$ 735255063 739680111 744550526 749683857 755040407 759886980 763641536 766720712 769487023
811.7G69487023J883746O98268O8665l58582j424074k736092l330409l564239m207969
$$ 769487023 771370769 772069037 772137702 771779120 770355046 767618954 764288545 760724306 756516337
830.1G56516337m698217m277825l551185l418267l452658k861739k120256j688421
$$ 756516337 751818120 747540295 743989110 740570843 737118185 734256446 732136190 730447769
846.4G30447769p42614J259446L449261N077601O533444P912576Q511305Q181393P634044
$$ 730447769 729705155 730964601 734413862 739491463 746024907 753937483 762448788 770630181 778264225
864.8G78264225P113635N997062M367709L268778K757073J875043O39677j28270n44130
$$ 778264225 785377860 791374922 795742631 799011409 801768482 803643525 804283202 804154932 803610802
883.1H03610802j309455k104342k156198j813113j741171j470387m70102N63621Q72851
$$ 803610802 802301347 800197005 798040807 796227694 794486523 793016136 792546034 793109655 793982506
901.5G93982506Q69870J089036J007498K14278o28411j108647j756668k776086l368497
$$ 793982506 794852376 795941412 796948910 797163188 796534777 795426130 793669462 790893376 787524879
919.8G87524879l054023k485573j999259j080811J28507O75738M38631L16441M47094
$$ 787524879 784470856 781985283 779986024 778905213 779033720 779709458 780148089 780464530 780911624
938.2G80911624J12951m84168n79179n20110j089871j946687k456010l071487m314780
$$ 780911624 781024575 780540407 779961228 779441118 778351247 776404560 773948550 770877063 766562283
956.6G66562283n649805o549776p499516q901775j0134637j0648847j0713875j0421753
$$ 766562283 760912478 754362702 746863186 737961411 727826774 717177927 706464052 696042299
972.9F96042299r308517p566809o103754n152882m298090l504694l064811k864123
$$ 696042299 686733782 679166973 673063219 667910337 663612247 660107553 657042742 654178619
989.2F54178619k452552j861691j523436j406490j154960r09805j103580j683652k313614
$$ 654178619 651726067 649864376 648340940 646934450 645779490 644869685 643766105 642082453 639768839
1007.5F39768839k999723l853858m559934m788339m684865m557550m413188m082143
$$ 639768839 636769116 632915258 628355324 623566985 618882120 614324570 609911382 605829239
1023.9F05829239l733933l571391l321111k777934k232016j913607j648903j270115
$$ 605829239 602095306 598523915 595202804 592424870 590192854 588279247 586630344 585360229
1040.2E85360229j014411j111091j322627j357495j267851j101017o14822K69652J193344
$$ 585360229 584345818 583234727 581912100 580554605 579286754 578185737 577570915 577840567 579033911
1058.5E79033911J772106J975179J828253J235425L87550j90318l15070l43025m70638
$$ 579033911 580806017 582781196 584609449 585844874 586232424 586042106 585727036 585384011 584913373
1076.9E84913373n01692m44472o54996j166641j643002j894057j883447j432956l80218
$$ 584913373 584411681 583967209 583312213 582145572 580502570 578608513 576725066 575292110 574911892
1095.2E74911892R30131J858473K307892K591013K662778K436161K117932J868665
$$ 574911892 575842023 577700496 580008388 582599401 585262179 587698340 589816272 591684937
1111.6E91684937J519144P85053l96490j831055k855837k487958q78393Q04424K124846
$$ 591684937 593204081 593989134 593592644 591761589 588905752 586417794 585539401 586343825 588468671
1129.9E88468671K437830J541436J138329J944244K835095L134489K933979K351224
$$ 588468671 590906501 592447937 593586266 595530510 598365605 601500094 604434073 606785297
1146.2F06785297J663685J312435J342654J464665J708210K297043L116668L992378
$$ 606785297 608448982 609761417 611104071 612568736 614276946 616573989 619690657 623683035
1162.6F23683035M985989O111562P037282P450104P508695P471382P239521O660223
$$ 623683035 628669024 634780586 641817868 649267972 656776667 664248049 671487570 678147793
1178.9F78147793N887687N060494L918767K241194L48747j353443k783417l799677
$$ 678147793 684035480 689095974 693014741 695255935 695604682 694251239 691467822 687668145
1195.2F87668145m055500l503859k605617j810015j276552j121521j466930k148569
$$ 687668145 683612645 680108786 677503169 675693154 674416602 673295081 671828151 669679582
1211.5F69679582k707362k978325l149390l180146k893150k425194k048016j729846
$$ 669679582 666972220 663993895 660844505 657664359 654771209 652346015 650297999 648568153
1227.8F48568153j251697o81460k87294k2948L28123O55234P06494N69046M75287L54469
$$ 648568153 647316456 646634996 646347702 646324754 646652877 647308111 648014605 648583651 649058938 649413407
1248.2F49413407N7459k25425k55823j55509k4676L55542J015067J627147K088904
$$ 649413407 649470866 649245441 648989618 648834109 648809433 649164975 650180042 651807189 653896093
1266.6F53896093K579451L139436L556848L742754L928960M187524M299045M297018
$$ 653896093 656475544 659614980 663171828 666914582 670843542 675031066 679330111 683627129
1282.9F83627129M444241M690111M750967M587173M380465M111051L661991L168582
$$ 683627129 688071370 692761481 697512448 702099621 706480086 710591137 714253128 717421710
1299.2G17421710K822757K585113K344907K156615K087653J989364J768351J595795
$$ 717421710 720244467 722829580 725174487 727331102 729418755 731408119 733176470 734772265
1315.5G34772265J556516J509666J418173J363457J316785J159609Q58486N59508L59953
$$ 734772265 736328781 737838447 739256620 740620077 741936862 743096471 743954957 744514465 744874418
1333.9G44874418J50502j34349k45452o140K76864M37856N65290O03855M74512K64585
$$ 744874418 745024920 744890571 744645119 744638979 744915843 745353699 745918989 746522844 746997356 747261941
1354.3G47261941J18912N5074k05278p55131j033724r87768j088321j050293j046062
$$ 747261941 747380853 747435927 747230649 746475518 745441794 744454026 743365705 742315412 741269350
1372.6G41269350j388788j502216j574099k003253k255261j988351j754820j597524
$$ 741269350 739880562 738378346 736804247 734800994 732545733 730557382 728802562 727205038
1388.9G27205038j178741j170874j587868j770913k078534k217292k188266k592921
$$ 727205038 726026297 724855423 723267555 721496642 719418108 717200816 715012550 712419629
1405.3G12419629k608597k274513k103925j720727j186788j225173j551569q79526
$$ 712419629 709811032 707536519 705432594 703711867 702525079 701299906 699748337 698868811
1421.6F98868811l06010j64330J12116K17736M06563P96795Q91864J032949J447797
$$ 698868811 698562801 698398471 698510587 698728323 699134886 699931681 700823545 701856494 703304291
1439.9G03304291J714051J791656J840770J944005K241969K647639L055989L964484
$$ 703304291 705018342 706809998 708650768 710594773 712836742 715484381 718540370 722504854
1456.2G22504854N081058M690647M350662M729390M949332M816710N255998O350517
$$ 722504854 727585912 732276559 736627221 741356611 746305943 751122653 756378651 762729168
1472.6G62729168O063223M627287L623247K863527K190292J422762N45681o98864j738906
$$ 762729168 768792391 773419678 777042925 779906452 782096744 783519506 784065187 783366323 781627417
1490.9G81627417j664699j973867l298104l837168l187060k565384l643453p421792
$$ 781627417 779962718 777988851 774690747 770853579 767666519 765101135 761457682 754035890
1507.2G54035890o654322m392862m090906m008531l726900k995431l185928l059387
$$ 754035890 747381568 742988706 738897800 734889269 731162369 728166938 724981010 721921623
1523.6G21921623k397418k379477j765967j531958k023757j204014l12328j217484
$$ 721921623 719524205 717144728 715378761 713846803 711823046 710619032 710306704 709089220
1539.9G09089220j671076n13315J64568O75619J102388J560628J952887K082824J558006
$$ 709089220 707418144 706904829 707069397 707745016 708847404 710408032 712360919 714443743 716001749
1558.2G16001749Q50439R97722P28667J82092p60376j934052j856684k413750m798293
$$ 716001749 716852188 717849910 718578577 718760669 718000293 716066241 714209557 711795807 706997514
1576.6G06997514n043149m394710n159200n913496o376326o717682o967604p141113
$$ 706997514 701954365 697559655 692400455 686486959 680110633 673392951 666425347 659284234
1592.9F59284234p397532p350922p071853p113278p183849o887198o744981o993472
$$ 659284234 651886702 644535780 637463927 630350649 623166800 616279602 609534621 602541149
1609.2F02541149o666363n736410o272376p775009n614757m131854n273342n335688
$$ 602541149 595874786 590138376 583866000 576090991 570476234 566344380 561071038 555735350
1625.5E55735350m713297m033923k258718j152754j261831j87754J302123K087355
$$ 555735350 551022053 546988130 544729412 543576658 542314827 542127073 543429196 545516551
1641.8E45516551K633392L235817L912807L893614M227101N397678M940986M728616
$$ 545516551 548149943 551385760 555298567 559192181 563419282 568816960 573757946 578486562
1658.2E78486562N291581N996704O252289N833328O265163P131219O651819O780326
$$ 578486562 583778143 589774847 596027136 601860464 608125627 615256846 621908665 628688991
1674.5F28688991P386208O957113O665647P265747Q876324Q005023O936311P313788
$$ 628688991 636075199 643032312 649697959 656963706 665840030 673845053 680781364 688095152
1690.8F88095152O976247P549942Q647024R054244J0310173Q655548P407248P402122
$$ 688095152 695071399 702621341 711268365 720322609 730632782 739288330 746695578 754097700
1707.1G54097700O279349N419136M987716M615605M331112L760397L193498K903700
$$ 754097700 760377049 765796185 770783901 775399506 779730618 783491015 786684513 789588213
1723.4G89588213K765238K644420K617717K344966K003073J964391J985371K020836
$$ 789588213 792353451 794997871 797615588 799960554 801963627 803928018 805913389 807934225
1739.7H07934225K162695K454936K679408K780735K888858K961576K654136K340972
$$ 807934225 810096920 812551856 815231264 818011999 820900857 823862433 826516569 828857541
1756.1H28857541K195954J999736J754403J527608J487076J485884J262129Q91268
$$ 828857541 831053495 833053231 834807634 836335242 837822318 839308202 840570331 841461599
1772.4H41461599R00626J037240R63986Q57890Q83281Q62002P77841Q27849Q14914
$$ 841461599 842362225 843399465 844363451 845221341 846104622 846966624 847744465 848572314 849387228
1790.7H49387228O45161N56410O89566P47502N77032M35352N47827O48856N13315L61025
$$ 849387228 850032389 850588799 851278365 852025867 852602899 853038251 853586078 854234934 854748249 855109274
1811.1H55109274M37618N53786M41969L43621M42564M87626L56614L25322L90947L88861
$$ 855109274 855546892 856100678 856542647 856886268 857328832 857816458 858173072 858498394 858889341 859278202
1831.5H59278202L26097K68519L37780M11570L39925J92881K47061L00765K07484K48491
$$ 859278202 859604299 859872818 860210598 860622168 860962093 861154974 861402035 861702800 861910284 862158775
1851.9H62158775L41893K82287J72496K02894K72632K73764J86801P2837Q0406J34826
$$ 862158775 862500668 862782955 862955451 863158345 863430977 863704741 863891542 863964379 864044785 864179611
1872.3H64179611J41561J87636K24054J26004M9829J26302J80960L4452l3319J41263
$$ 864179611 864321172 864508808 864732862 864858866 864908695 865034997 865215957 865250409 865217090 865358353
1892.7H65358353J72019K3782r954Q8155J11997L6836L1888Q3447K6047m9114l040
$$ 865358353 865530372 865554154 865544200 865632355 865744352 865781188 865813076 865896523 865922570 865873456 865870416
1915.1H65870416L2485J2815j3411j8359K7121j5021j14739q5652k8550q4758q9407
$$ 865870416 865902901 865915716 865902305 865883946 865911067 865896046 865781307 865695655 865667105 865582347 865492940
1937.6H65492940K6822j0550k24233k62081j25468o9141j42456j78813j15395j04487
$$ 865492940 865519762 865509212 865284979 865022898 864897430 864828289 864685833 864507020 864391625 864287138
1958H64287138j69933j93655j43648j52945k22385j76132q9764j14262j97530j80304
$$ 864287138 864117205 863923550 863779902 863626957 863404572 863228440 863138676 863024414 862826884 862646580
1978.4H62646580r0778j06871j68860j35541q1837j35243k30611k02059j25647j49429
$$ 862646580 862555802 862448931 862280071 862144530 862062693 861927450 861696839 861494780 861369133 861219704
1998.8H61219704j84059j48237j20520j60396k11478j96218j35124j57714k32816j87933
$$ 861219704 861035645 860887408 860766888 860606492 860395014 860198796 860063672 859905958 859673142 859485209
2019.2H59485209j12116j45793k01583j65105j05500j40429j86086j17301p0990j36554
$$ 859485209 859373093 859227300 859025717 858860612 858755112 858614683 858428597 858311296 858240306 858103752
2039.6H58103752j63853j02282p2717j32799j42754m1723k324r9123j41919n7101k1934
$$ 858103752 857939899 857837617 857764900 857632101 857489347 857447624 857445300 857346177 857204258 857147157 857125223
2062H57125223j02878j24156m292L9458m7922m2498M2319q94q0406o795J05202M1604
$$ 857125223 857022345 856898189 856893897 856933355 856885433 856842935 856885254 856884360 856803954 856797159 856902361 856943965
2086.5H56943965q4519j4127J10209O0559l0041K6166J06037L8922m5240L2067J25587
$$ 856943965 856859446 856845319 856955528 857016087 856986046 857012212 857118249 857157171 857111931 857143998 857269585
2108.9H57269585M9532j9789O5505J27912M7684M589J03176J51396O8128O2644J51873
$$ 857269585 857319117 857299328 857364833 857492745 857540429 857545018 857648194 857799590 857867718 857930362 858082235
2131.3H58082235J17063J7703O8307J97351J75476O1572Q3267J82510J66297J06990
$$ 858082235 858199298 858217001 858285308 858482659 858658135 858719707 858802974 858985484 859151781 859258771
2151.7H59258771J34110J70172J29759P8022J28448J98007J54734J02043J58191J88052
$$ 859258771 859392881 859563053 859692812 859770834 859899282 860097289 860252023 860354066 860512257 860700309
2172.1H60700309J19746J17719J99318J91391P9214N7638J43528J54555R7930R4950
$$ 860700309 860820055 860937774 861137092 861328483 861407697 861465335 861608863 861763418 861861348 861956298
2192.5H61956298J27256J33395Q4877L2664O4552R7990P5280R5010J11699M2200j2099
$$ 861956298 862083554 862216949 862301826 862334490 862399042 862497032 862572312 862667322 862779021 862821221 862809122
2215H62809122K7120J04367J13011M0233O974M8280P0452M8340L7133L9757L5286R715
$$ 862809122 862836242 862940609 863053620 863093853 863100827 863149107 863219559 863267899 863305032 863344789 863380075 863389790
2239.4H63389790r179M5121Q7261K5928k9802j0670L457k4855j4066O2763Q4341J7822
$$ 863389790 863380611 863425732 863512993 863538921 863509119 863498449 863501906 863477051 863462985 863525748 863610089 863627911
2263.9H63627911M768N4300M4763R54K5212O1214J4007n185Q1658J31250M6312m5716
$$ 863627911 863632679 863686979 863731742 863732696 863757908 863819122 863833129 863827944 863909602 864040852 864087164 864041448
2288.4H64041448P212J12772P5936k1279n305K7538r775j1802M7624N0366k7418l6538
$$ 864041448 864048660 864161432 864237368 864216089 864210784 864238322 864228547 864216745 864264369 864314735 864287317 864250779
2312.9H64250779O7949P6712m0830p5340l2425l2544j09017r4712P0036Q6784n9664
$$ 864250779 864318728 864395440 864354610 864279270 864246845 864214301 864105284 864010572 864080608 864167392 864107728
2335.3H64107728r1493p0572j33634l8743L22342N83411L75866j14560l89218k87473
$$ 864107728 864016235 863945663 863812029 863773286 864095628 864679039 865054905 864940345 864551127 864263654
2355.7H64263654k32756j40369J09672J98186J94668K73169L94821M00662K49326K24710
$$ 864263654 864030898 863890529 864000201 864198387 864393055 864666224 865061045 865461707 865711033 865935743
2376.1H65935743L64482L48151J95444J73032K23458J50442P570q94Q5890M7028n2869
$$ 865935743 866300225 866648376 866843820 867016852 867240310 867390752 867398322 867397428 867483318 867530346 867477477
2398.5H67477477k3425M0710R894k4259J4067M5776k145n6625l6657j2278q3387j34349
$$ 867477477 867454052 867494762 867504656 867480397 867494464 867540240 867538095 867481470 867444813 867432535 867349148 867214799
2423H67214799n1141o974p9691j12295m4227n007p3433j21176o3538j5974n6684r5010
$$ 867214799 867163658 867156684 867076993 866964698 866920471 866915464 866842031 866720855 866657317 866641343 866584659 866489649
2447.5H66489649p3195q1777j40488j13905m3094q4937j44004r6858m1664q8632j33812
$$ 866489649 866416454 866334677 866194189 866080284 866037190 865952253 865808249 865711391 865669727 865581095 865447283
2469.9H65447283p0155n3882j44184j48594o6579p8976j76013j96039j07944n3823
$$ 865447283 865377128 865323246 865179062 865030468 864963889 864884913 864708900 864512861 864404917 864351094
2490.3H64351094j26064j82867q2851j8179j14679j50800n9486k6047r9539j31786
$$ 864351094 864225030 864042163 863959312 863941133 863826454 863675654 863616168 863590121 863490582 863358796
2510.7H63358796p8261q4043j61171j52588p9214q7261j24991j00315p5996j10567
$$ 863358796 863280535 863196492 863035321 862882733 862803519 862716258 862591267 862490952 862414956 862304389
2531.1H62304389j36137j11579r1374j03236j22070q8811l2186n2274j10089j14680
$$ 862304389 862168252 862056673 861965299 861862063 861739993 861651182 861618996 861566722 861456633 861341953
2551.5H61341953j14798j67609j98304j37747p6770j24157j74165j21831p0692j17719
$$ 861341953 861227155 861059546 860861242 860723495 860646725 860522568 860348403 860226572 860155880 860038161
2571.9H60038161j87576j87873j82748k19226k20001j87218j95444k32935k21610j91033
$$ 860038161 859850585 859662712 859479964 859260738 859040737 858853519 858658075 858425140 858203530 858012497
2592.3H58012497k32935k99334l03149k77102k88368l14950l04401k89500l18110l25382
$$ 858012497 857779562 857480228 857177079 856899977 856611609 856296659 855992258 855702758 855384648 855059266
2612.7H55059266k68280k37763l02196l71694l53098l30329l44515l29971l17514l28958
$$ 855059266 854790986 854553223 854251027 853879333 853526235 853195906 852851391 852521420 852203906 851874948
2633.1H51874948l08633k84911k97069l07620l02016k91944k99215l19958l26574l10004
$$ 851874948 851566315 851281404 850984335 850676715 850374699 850082755 849783540 849463582 849137008 848827004
2653.5H48827004k94685k85029k64645k75731k97070l30209l71576l15129k50459k87175
$$ 848827004 848532319 848247290 847982645 847706914 847409844 847079635 846708059 846392930 846142471 845855296
2673.9H45855296k99394k46883k68280l49403l51846l34203l52919l16143k85387l29018
$$ 845855296 845555902 845309019 845040739 844691336 844339490 844005287 843652368 843336225 843050838 842721820
2694.3H42721820l53933l51607l90053m16279l55422l11017l75629m43578m18663l71694
$$ 842721820 842367887 842016280 841626227 841209948 840854526 840543509 840167880 839724302 839305639 838933945
2714.6H38933945m03107m46736l98159l14892l10719l99768m66049m48406m38630m17531
$$ 838933945 838530838 838084102 837685943 837371051 837060332 836660564 836194515 835746109 835307479 834889948
2735H34889948l35574l02911l56078l86059l20971k97725m13299m90963m34161l92615
$$ 834889948 834554374 834251463 833895385 833509326 833188355 832890630 832477331 831986368 831552207 831159592
2755.4H31159592m31538m33624m17948m78625n35488n08904m59075m46141m58837n02348
$$ 831159592 830728054 830294430 829876482 829397857 828862369 828353465 827894390 827448249 826989412 826487064
2775.8H26487064n67495o02365n84960n44965n37336n66006n96762o27696o68645p01070
$$ 826487064 825919569 825317204 824732244 824187279 823649943 823083937 822487175 821859479 821190834 820489764
2796.2H20489764p21633p62046q07464q07762p43449p04109q04544r50217r61483q89897
$$ 820489764 819768131 819006085 818198621 817390859 816647410 815943301 815138757 814188540 813227057 812337160
2816.6H12337160r03845r79066j004040j034379j128018j213372j231074j250744j373470
$$ 812337160 811433315 810454249 809450209 808415830 807287812 806074440 804843366 803592622 802219152
2835H02219152j571059j856863k304197k784311l096402l209770l083944k570868j788199
$$ 802219152 800648093 798791230 796487033 793702722 790606320 787396550 784312606 781741738 779953539
2853.3G79953539j109421p58052p45833j005470j373530j706779j972556k012551j750767
$$ 779953539 778844118 778086066 777340233 776334763 774961233 773254454 771281898 769269347 767518580
2871.7G67518580j480460j317919j083910q61168q34763r22859j028597j180172j306355
$$ 767518580 766038120 764720201 763636291 762775123 761940360 761017501 759988904 758808732 757502377
2890.1G57502377j343369j394749j521289j652897j679122j661539j727522j858949
$$ 757502377 756159008 754764259 753242970 751590073 749910951 748249412 746521890 744662941
2906.4G44662941k039075k233744k433062k678513k848149k727568k312481j741588
$$ 744662941 742623866 740390122 737957060 735278547 732430398 729702830 727390349 725648761
2922.7G25648761j165867o45101j91987J03414M06802Q61287J310826J687288J980066
$$ 725648761 724482894 723837793 723645806 723749220 724156022 725017309 726328135 728015423 729995489
2941G29995489K042949J737595J187861P07030L92497K8848l04877k76924M2797L51548
$$ 729995489 732038438 733776033 734963894 735670924 736063421 736092269 735787392 735510468 735553265 735904813
2961.4G35904813M99785O11126Q01981R70304J057863J074016J077354J178741J234770
$$ 735904813 736404598 737015724 737817705 738788009 739845872 740919888 741997242 743175983 744410753
2979.8G44410753J095474R91642J019717J031756J057029R61184N62728J74522m6193
$$ 744410753 745506227 746497869 747517586 748549342 749606371 750567555 751130283 751304805 751258612
2998.1G51258612k62857m50134n95272o88135o33598n00261m93825o45280q26597r29654
$$ 751258612 750995755 750545621 749950349 749262214 748628616 748128355 747634530 746989250 746162653 745232999
3018.5G45232999r18567q75056r75847j192152j233995j109958j049638j185477j376748
$$ 745232999 744314432 743439376 742463529 741271377 740037382 738927424 737877786 736692309 735315561
3036.9G35315561j306772j188874j332164j548409j643241j575291j479030j493633
$$ 735315561 734008789 732819915 731487751 729939342 728296101 726720810 725241780 723748147
3053.2G23748147j521348j547635j566649j467168j316965j234114j280427j383960
$$ 723748147 722226799 720679164 719112515 717645347 716328382 715094268 713813841 712429881
3069.5G12429881j379788j324653j199842j018345j116574j374424j402974j352489
$$ 712429881 711050093 709725440 708525598 707507253 706390679 705016255 703613281 702260792
3085.8G02260792j385271j429260j496673j520455j449406j366019j416028j601159
$$ 702260792 700875521 699446261 697949588 696429133 694979727 693613708 692197680 690596521
3102.2F90596521j650035j553298j544594j681328j745939j627148j603066j761318
$$ 690596521 688946486 687393188 685848594 684167266 682421327 680794179 679191113 677429795
3118.5F77429795k012670k245903k242923k041280j932502k043545k193987k196789
$$ 677429795 675417125 673171222 670928299 668887019 666954517 664910972 662716985 660520196
3134.8F60520196k092660k089560k301514k473473k397716k290368k243102k230227
$$ 660520196 658427536 656337976 654036462 651562989 649165273 646874905 644631803 642401576
3151.1F42401576k398372k631187k684116k620697k583027k563477k528965k540648
$$ 642401576 640003204 637372017 634687901 632067204 629484177 626920700 624391735 621851087
3167.4F21851087k602935k632141k626360k628267k673506k709806k671421k640962
$$ 621851087 619248152 616616011 613989651 611361384 608687878 605978072 603306651 600665689
3183.7F00665689k635181k595902k603292k673626k700091k667486k630532k634824
$$ 600665689 598030508 595434606 592831314 590157688 587457597 584790111 582159579 579524755
3200.1E79524755k631783k547205k470493k519429k581238k550662k520263k503991
$$ 579524755 576892972 574345767 571875274 569355845 566774607 564223945 561703682 559199691
3216.4E59199691k500773k543389k535522k449096k419471k430618k335429k246321
$$ 559199691 556698918 554155529 551620007 549170911 546751440 544320822 541985393 539739072
3232.7E39739072k341807k404868k256751k117694k069354j961231j883984j993179
$$ 539739072 537397265 534992397 532735646 530617952 528548598 526587367 524703383 522710204
3249E22710204k058625j931131j814127j854181j927555j884639j840294j863062j796901
$$ 522710204 520651579 518720448 516906321 515052140 513124585 511239946 509399652 507536590 505739689
3267.4E05739689j650095j668394j838624j910448j860321j812160j808822j817703
$$ 505739689 504089594 502421200 500582576 498672128 496811807 494999647 493190825 491373122
3283.7D91373122j808584j788259j728445j674950j754731j930654k056837k006292
$$ 491373122 489564538 487776279 486047834 484372884 482618153 480687499 478630662 476624370
3300D76624370j827449j725227j835554k092064k279073k339542k298385k195865k159983
$$ 476624370 474796921 473071694 471236140 469144076 466865003 464525461 462227076 460031211 457871228
3318.4D57871228k210885k226442k193093k276838k432287k462506k430856k363056
$$ 457871228 455660343 453433901 451240808 448963970 446531683 444069177 441638321 439275265
3334.7D39275265k246470k301961k486914k566129k610505k583027k414673k434313
$$ 439275265 437028795 434726834 432239920 429673791 427063286 424480259 422065586 419631273
3351D19631273k690852k791882k602279k397120k441436k507389k324283k186417k348125
$$ 419631273 416940421 414148539 411546260 409149140 406707704 404200315 401876032 399689615 397341490
3369.3C97341490k613157k620608k337545k125323k053797j989216j884252j699030
$$ 397341490 394728333 392107725 389770180 387644857 385591060 383601844 381717592 380018562
3385.7C80018562j404196j120031j197815j540959j557648j121849p85082j017034
$$ 380018562 378614366 377494335 376296520 374755561 373197913 372076064 371290982 370273948
3402C70273948j374394j195997p79420n94437n88119o48231o28054l92258k00003j83314
$$ 370273948 368899554 367703557 366924137 366329700 365741581 365093350 364465296 364073038 363873035 363689721
3422.4C63689721l5763K80946N04166M83603N66095Q28981P55280M43578M93020Q99732
$$ 363689721 363653958 363934904 364439070 364922673 365488768 366317749 367073029 367516607 368009627 368909359
3442.8C68909359J210093J275719J279771J414418J594454J725525J877457K003997
$$ 368909359 370119452 371395171 372674942 374089360 375683814 377409339 379286796 381290793
3459.1C81290793J871616J842648K275944K505511K112776J629680J648307K041340
$$ 381290793 383162409 385005057 387281001 389786512 391899288 393528968 395177275 397218615
3475.4C97218615K487540K546519K120495K010405K357155K428264K312153K487332
$$ 397218615 399706155 402252674 404373169 406383574 408740729 411168993 413481146 415968478
3491.7D15968478K701789K736062K648949K624810K617449K396315K243638K423346
$$ 415968478 418670267 421406329 424055278 426680088 429297537 431693852 433937490 436360836
3508D36360836K736181K986163K962440K746403K756983K983779L210932L117949K807230
$$ 436360836 439097017 442083180 445045620 447792023 450549006 453532785 456743717 459861666 462668896
3526.4D62668896K803534L099799L369570L540128L505350L359586L587901L895283
$$ 462668896 465472430 468572229 471941799 475481927 478987277 482346863 485934764 489830047
3542.7D89830047L780126L438563L413677L594756L709137L850401M029929M203558
$$ 489830047 493610173 497048736 500462413 504057169 507766306 511616707 515646636 519850194
3559E19850194M307449M182816L912449M232049M859805M821062M591346M703164M959106
$$ 519850194 524157643 528340459 532252908 536484957 541344762 546165824 550757170 555460334 560419440
3577.4E60419440N185664N406558N420387N148292N008638N394399N523384N444347
$$ 560419440 565605104 571011662 576432049 581580341 586588979 591983378 597506762 602951109
3593.7F02951109N634726N852937N850375N838573N748153N466044N614340N993724
$$ 602951109 608585835 614438772 620289147 626127720 631875873 637341917 642956257 648949981
3610F48949981N964517N871296N705536N699873O096065N904972N360484M960955N165934
$$ 648949981 654914498 660785794 666491330 672191203 678287268 684192240 689552724 694513679 699679613
3628.4F99679613N906582N578279N178452N044520M855156M812837M735946M390359
$$ 699679613 705586195 711164474 716342926 721387446 726242602 731055439 735791385 740181744
3644.7G40181744M058004M233300M459381L935457L446817L682792L793657L257275
$$ 740181744 744239748 748473048 752932429 756867886 760314703 763997495 767791152 771048427
3661G71048427K844989K754807K506495K247751K470255K219736J712322K038360K222955
$$ 771048427 773893416 776648223 779154718 781402469 783872724 786092460 787804782 789843142 792066097
3679.4G92066097K018988J956165J923025J781881J446962J271010J462280J529396
$$ 792066097 794085085 796041250 797964275 799746156 801193118 802464128 803926408 805455804
3695.7H05455804J288414R28163Q25763J133144J269519R73761N26906M27603Q91924
$$ 805455804 806744218 807672381 808498144 809631288 810900807 811874568 812401474 812829077 813721001
3714H13721001J054466Q50618O72459N49019M24325M52638O80327P06554N01811L13998
$$ 813721001 814775467 815626085 816298544 816847563 817271888 817724526 818404853 819111407 819613218 819927216
3734.4H19927216M69386Q08776O14583j47819l48270N13553M50790l4392L91543P78854
$$ 819927216 820396602 821205378 821819961 821672142 821323872 821837425 822288215 822253823 822645366 823424220
3754.8H23424220N39184K67684L98219M68194K57790J22548J04367K08259L74138M07219
$$ 823424220 823963404 824231088 824629307 825097501 825355291 825477839 825582206 825790465 826164603 826571822
3775.2H26571822L18468J70052J21891J06693J08838J92344K56538K85864J62542n782
$$ 826571822 826890290 827060342 827182233 827288926 827397764 827590108 827846646 828132510 828295052 828289270
3795.6H28289270R3818K2888p7426K61307J49011M4108L23951K99334k4735j09673
$$ 828289270 828383088 828405976 828328550 828589857 828738868 828782976 829106927 829406261 829381526 829271853
3816H29271853J91033m3631j45972K54035K28525J45256J80066K27392K37464j33574
$$ 829271853 829462886 829419255 829273283 829527318 829755843 829901099 830081165 830308557 830546021 830412447
3836.4H30412447m63485q8036K29597K70843L17931K44618k65002j102269m15862P76410
$$ 830412447 829948962 829860926 830090523 830361366 830679297 830923915 830658913 829556644 829140782 829917192
3856.8H29917192N97120J38223j47343p7843L5464k12133j35958J56284K21550K33770
$$ 829917192 830514312 830652535 830505192 830427349 830462813 830250680 830114722 830271006 830492556 830726326
3877.2H30726326M708m2379J12057k7478m4345o7473j95682O0260K72990M2915k99573
$$ 830726326 830731034 830688655 830800712 830773234 830728889 830661416 830465734 830525994 830798984 830841899 830542326
3899.6H30542326m28200k55167Q4579K61187K28465J54555L6835j04904j08063J8537
$$ 830542326 830114126 829858959 829943538 830204725 830433190 830587745 830624580 830519676 830411613 830430150
3920H30430150K861j03414J013J16885L0160K325O7412K6107L278L696k3246O6102
$$ 830430150 830433011 830329597 830330610 830447495 830477655 830479980 830547392 830573499 830576777 830580473 830557227 830623329
3944.5H30623329Q5175r120j2815J1504N1260Q2791J8596l6895o616M2975Q3506P2658
$$ 830623329 830708504 830699384 830686569 830698073 830749333 830832124 830850720 830813825 830807209 830850184 830933690 831006348
3969H31006348O914J7584J03652J22666N6506O9260J56999O1333j09255p7665L4690
$$ 831006348 831013262 831030846 831134498 831257164 831313670 831382930 831539929 831601262 831492007 831414342 831449032
3991.4H31449032P0989R0063J09076
$$ 831449032 831520021 831610084 831719160
3997.5H31719160
$$ 831719160
##END=$$ End of the data block
