##TITLE=$$ Begin of the data block
##JCAMP-DX=5.00 $$ ACD/SpecManager v 10.08
##SPECTROMETER/DATA SYSTEM=Alpha
##DATE=09 Apr 2014 11:14:46
##DATA TYPE=INFRARED SPECTRUM
##DATA CLASS=XYDATA
##ORIGIN=
##OWNER=
##NPOINTS=1765
##FIRSTX=399.75695801
##LASTX=3997.56933594
##MAXX=3997.56933594
##MINX=399.75695801
##MAXY=0.86824399
##MINY=0.36393890
##XFACTOR=1.0000000000
##YFACTOR=1.000000000000000e-9
##FIRSTY=0.67150748
##DELTAX=2.03957629
##XUNITS=1/CM
##YUNITS=ARBITRARY UNITS
##XYDATA=(X++(Y..Y))
399.8F71507478j488149j480580j356125j307010j206994q47459m82679m41432j146137
418.1F61750913j165629j073l84926j150609p27295k68340n87166q33034m95136l55959
438.5F55781746n61476m76718k36988n72443q61704k04206L66450j13607o77347l59476
458.9F52084231k85804j094520j249313m14908j90854r57072j093924k08080R5606
477.3F46685362k90156l58045j29461l74973p22944l53516j56104q92043j182556m91441
497.7F41734123k44975p77423q31187k64525k85924q01921p11739k45154l89337r70066
518.1F36211872r60827n39005p15017j169443r08434o31214r97424j064896n90206
536.4F28635406n12421q31425o41823j66773k97547q22604q08477l42548m34220r43005
$$ y = [671507478, 670019329, 668538749, 667182624, 665875614, 664668620, 663821161, 663338482, 662897050, 661750913, 660585284, 660584211, 660199285, 659048676, 658321381, 658053041, 657465875, 656632841, 656137705, 655781746, 655220270, 654743552, 654506564, 653934121, 653072417, 652868211, 653234661, 653121054, 652443707, 652084231, 651798427, 650703907, 649454594, 649039686, 648848832, 647891760, 646797836, 646589756, 646685362, 646395206, 646037161, 645907700, 645532727, 644809783, 644456267, 644300163, 643408120, 642225564, 641734123, 641489148, 640711725, 639880538, 639616013, 639330089, 638528168, 637816429, 637571275, 637181938, 636211872, 635251045, 634712040, 633997023, 632827580, 631919146, 631287932, 630290508, 629225612, 628635406, 628122985, 627291560, 626649737, 626482964, 626185417, 625362813, 624554336, 624211788, 623777568, 622834563]
556.8F22834563q35716m31836q16345j476109j403988j090526j343370j668334j332819
575.2F12435520r37879j212776j484513j092971p40945r58502j057804m96686j35898
593.5F04317546k32935K36511Q94964O71327j3053J06990P94649O81758J9491O6399
613.9F07543647N51820Q67069J436651K415716L041029K694845K342105K760530K982259
632.3F26635671K455949K177597K400577J908838O70433M65095J652599K157152J202583
650.6F41726494K48790K5391N56588K004385L510714L786683K768397J982630K527117
669F59137189K663672K142251K119601K565026K539039J832842J645148K143264K030790
687.3F78818822J196206J051008J425624J056254M13775O85275J376212J418292J185417
$$ y = [622834563, 621998847, 621567011, 620750666, 619274557, 617870569, 616780043, 615436673, 613768339, 612435520, 611497641, 610284865, 608800352, 607707381, 606966436, 606007934, 604950130, 604453444, 604317546, 604084611, 604321122, 605216086, 605887413, 605874360, 605981350, 606775999, 607457757, 607477248, 607543647, 608095467, 608962536, 610399187, 612814903, 615855932, 618550777, 620892882, 623653412, 626635671, 629091620, 631269217, 633669794, 635578632, 636249065, 636714160, 638366759, 640523911, 641726494, 641975284, 642000675, 642557263, 644561648, 648072362, 651859045, 654627442, 656610072, 659137189, 661800861, 663943112, 666062713, 668627739, 671166778, 672999620, 674644768, 676788032, 678818822, 680015028, 681066036, 682491660, 683547914, 683961689, 684646964, 686023176, 687441468, 688626885]
705.7F88626885J538217K019644J861275J624941J953721K172351J781345J605868
722G03184247K051532K200723J583278J197636J563669J650333J063287Q67188J346827
740.4G16708720J481354J138627J229108J819014J937032J557052J605094K014696
756.7G29490697J931072J431048J396834J591921J072586L09944K82586L34739l36766
775G37504661j011908r99153r91702j590788j796901q54135K23100P32422J577318
793.4G32792914L152430M414499M813254N082547N414069M958391L783286L003716
809.7G67415106K679944J840592O87837R0480l20434j410783k761006l383219l638804
828.1G61199713m259765m693330m246413l533662l407240l411829k853394k216041
$$ y = [688626885, 690165102, 692184746, 694046021, 695670962, 697624683, 699797034, 701578379, 703184247, 705235779, 707436502, 709019780, 710217416, 711781085, 713431418, 714494705, 715361893, 716708720, 718190074, 719328701, 720557809, 722376823, 724313855, 725870907, 727476001, 729490697, 731421769, 732852817, 734249651, 735841572, 736914158, 737224102, 737506688, 737841427, 737504661, 736492753, 735493600, 734501898, 732911110, 731114209, 730260074, 730483174, 731215596, 732792914, 735945344, 740359843, 745173097, 750255644, 755669713, 760628104, 764411390, 767415106, 770095050, 771935642, 772623479, 772713959, 772393525, 770982742, 768221736, 764838517, 761199713, 756939948, 752246618, 748000205, 744466543, 741059303, 737647474, 734794080, 732578039]
844.4G32578039j786709p30872J345515L519178N084574O531537P936716Q486509Q105397
862.7G71069884P579983P086575N994439M405915L311694K767205J846970N94258j31846
881.1H04525077m96447j263082k062261k120614j845002j827061j535356m85063N81741
899.4G93471932Q90315Q67188J077831J012087K20358o24657j088440j753807k808511
917.8G91264296l373743l027915k509356k052903j090586J37210O43432L90470K88784
936.2G80669689M27544J15574m65751n67794n02944j066267j940966k495766l142535
954.5G71030784m329443n580306o481767p483125q931458j0168552j0657191j0732115
970.8G06666827j0444701r299874p524371o054044n132794m300296l497243l064037
$$ y = [732578039, 730791330, 730060458, 731405973, 734925151, 740009725, 746541262, 754477978, 762964487, 771069884, 778649867, 785736442, 791730881, 796136796, 799448490, 802215695, 804062665, 804656923, 804525077, 804028630, 802765548, 800703287, 798582673, 796737671, 794910610, 793375254, 792890191, 793471932, 794362247, 795229435, 796307266, 797319353, 797539711, 796915054, 795826614, 794072807, 791264296, 787890553, 784862638, 782353282, 780300379, 779209793, 779347003, 779990435, 780380905, 780669689, 781097233, 781212807, 780747056, 780179262, 779676318, 778610051, 776669085, 774173319, 771030784, 766701341, 761121035, 754639268, 747156143, 738224685, 728056133, 717398942, 706666827, 696222126, 686922252, 679397881, 673343837, 668211043, 663910747, 660413504, 657349467]
987.1F57349467k895713k483964j860201j513779j404941j165807r51052j147151j701295
1005.5F42225564k342999l049434l857016m492939m705846m647374m568398m415870
1021.8F10145688m079938l758430l581226l289759k742470k236366j944840j652837
1038.1E86859822j250207j009584j093030j258969j295328j249254j086950n66304
1054.5E78050196L11792J168549J691342J909554J803338J242697M45783j23739l29494
1072.8E86170018m15027m93050m73261m22060o33359j143933j607775j862526j926720
1091.2E77192307j482487l53158R52542J857519K314627K590478K677739K449512K096176
1109.5E90295255J843810J498699P41005m28021j812636k836585k512634r46760P36475
$$ y = [657349467, 654453754, 651969790, 650109589, 648595810, 647190869, 646025062, 645074010, 643926859, 642225564, 639882565, 636833131, 632976115, 628483176, 623777330, 619129956, 614561558, 610145688, 606065750, 602307320, 598726094, 595436335, 592693865, 590457499, 588512659, 586859822, 585609615, 584600031, 583507001, 582248032, 580952704, 579703450, 578616500, 578050196, 578361988, 579530537, 581221879, 583131433, 584934771, 586177468, 586623251, 586499512, 586170018, 585754991, 585261941, 584788680, 584366620, 583733261, 582589328, 580981553, 579119027, 577192307, 575709820, 575356662, 576309204, 578166723, 580481350, 583071828, 585749567, 588199079, 590295255, 592139065, 593637764, 594378769, 593950748, 592138112, 589301527, 586788893, 585842133, 586578608]
1127.9E86578608K126455K502680J611292J194179J973927K813757L088712K915860
1144.2F04805470K357304J660049J302599J340151J458168J685679K273679L130198
1160.5F20013297M023611M980207O071925O998718P440149P522524P468641P208883
1176.8F71727955O624520N865216N049646L896475K216101L51369j328289k765119
1193.1F91637874l800750m055083l492594k604663j833022j285791j088739j439929
1209.5F72037303k150118k710223k963007l117561l167212k904534k432287k045691
1225.8F50546670j720130j258910p00653k78234J1801L59774O45936O67095N67674
1244.1F48841023N28217M05311O7592k44319k78294j47701k026L51965J013219J642704
$$ y = [586578608, 588705063, 591207743, 592819035, 594013214, 595987141, 598800898, 601889610, 604805470, 607162774, 608822823, 610125422, 611465573, 612923741, 614609420, 616883099, 620013297, 624036908, 629017115, 635089040, 642087758, 649527907, 657050431, 664519072, 671727955, 678352475, 684217691, 689267337, 693163812, 695379913, 695731282, 694402993, 691637874, 687837124, 683782041, 680289447, 677684784, 675851762, 674565971, 673477232, 672037303, 669887185, 667176962, 664213955, 661096394, 657929182, 655024648, 652592361, 650546670, 648826540, 647567630, 646866977, 646588743, 646600544, 646960318, 647606254, 648273349, 648841023, 649369240, 649774551, 649842143, 649597824, 649319530, 649171829, 649169803, 649521768, 650534987, 652177691]
1264.5F52177691K084613K547920L097117L506541L697694L933668M234194M305065
1280.8F79584503M242897M392147M672230M763782M622876M406631M115165L645241
1297.2G14445472L130615K828955K659798K417326K186298K088964J977265J751304
1313.5G33485997J596927J581014J516044J395940J361132J334906J159787Q53300
1329.8G44285047N70297L60728J25229j43886k28524q583K61664M39883N77509O19650
1350.2G46859014N09501L17335J46508K2054k52724p56264j025796j003504j092612
1368.5G43723512j037836j034856j386106j506150j560330j973510k246976k007783
1384.9G30969965j771330j593233j181960j189828j589119j742184k049744k219022
$$ y = [652177691, 654262304, 656810224, 659907341, 663413882, 667111576, 671045244, 675279438, 679584503, 683827400, 688219547, 692891777, 697655559, 702278435, 706685066, 710800231, 714445472, 717576087, 720405042, 723064840, 725482166, 727668464, 729757428, 731734693, 733485997, 735082924, 736663938, 738179982, 739575922, 740937054, 742271960, 743431747, 744285047, 744855344, 745216072, 745341301, 745197415, 744968891, 744960308, 745221972, 745661855, 746239364, 746859014, 747368515, 747685850, 747832358, 747854412, 747601688, 746845424, 745819628, 744816124, 743723512, 742685676, 741650820, 740264714, 738758564, 737198234, 735224724, 732977748, 730969965, 729198635, 727605402, 726423442, 725233614, 723644495, 721902311, 719852567, 717633545]
1401.2G17633545k217888k608180k602935k267897k088070j710058j186847j230538
1417.5G01721132j578748q96454k90990j54853R7811J95861M02212Q14498Q82446R80735
1437.9G02173650J402140J676917J767755J843035J967966K266884K655506L047645
1454.2G18801498L951550N088568M727244M375815M720092M950106M847527N275845
1470.5G56738245O343425O059110M630923L612280K830506K156615J425028N76019
1486.8G84372151o73294j734138j679182k000272l317297l836631l188610k567590
1503.2G65375137l625691p411003o679535m389345m061044m005491l759623l011525
1519.5G28431880l182590l049671k357245k309799j709938j517475k034187j199841
$$ y = [717633545, 715415657, 712807477, 710204542, 707936645, 705848575, 704138517, 702951670, 701721132, 700142384, 699245930, 698954940, 698800087, 698897898, 699093759, 699495971, 700310469, 701192915, 702173650, 703575790, 705252707, 707020462, 708863497, 710831463, 713098347, 715753853, 718801498, 722753048, 727841616, 732568860, 736944675, 741664767, 746614873, 751462400, 756738245, 763081670, 769140780, 773771703, 777383983, 780214489, 782371104, 783796132, 784372151, 783698857, 781964719, 780285537, 778285265, 774967968, 771131337, 767942727, 765375137, 761749446, 754338443, 747658908, 743269563, 739208519, 735203028, 731443405, 728431880, 725249290, 722199619, 719842374, 717532575, 715822637, 714305162, 712270975, 711071134]
1535.8G11071134k77341j181066j660943m82380J93298O89029J097024J526356J951515
1554.1G12926626K161741J648367Q24630R46820O97851J53780p81536j937151j827002
1572.5G14814126k361774m771709n062759m414320n170048n923926o394446o732107
1588.8F73983037o957888p133484p422328p408500p139921p153332p206381o921291
1605.1F16639912o778359p000625o664515n762756o314337p789612n595744m120409
1621.4E66613555n293906n361616m707277m016698k259552j152814j261234k19941
1637.8E42340517J277089K109170K697170L295720L907084L884315M282177N422235
1654.1E69215477M911780M749596N315542N970299O254375N903900O329656P137060
$$ y = [711071134, 710793793, 709612727, 707951784, 707469404, 707662702, 708351731, 709448755, 710975111, 712926626, 715088367, 716736734, 717561364, 718508184, 719206035, 719359815, 718578279, 716641128, 714814126, 712452352, 707680643, 702617884, 698203564, 693033516, 687109590, 680715144, 673983037, 667025149, 659891665, 652469337, 645060837, 637920916, 630767584, 623561203, 616639912, 609861553, 602860928, 596196413, 590433657, 584119320, 576329708, 570733964, 566613555, 561319649, 555958033, 551250756, 547234058, 544974506, 543821692, 542560458, 542340517, 543617606, 545726776, 548423946, 551719666, 555626750, 559511065, 563793242, 569215477, 574127257, 578876853, 584192395, 590162694, 596417069, 602320969, 608650625, 615787685]
1670.4F15787685O638944O791651P405043O966412O677628P277548Q866191P995665
1686.7F74406767O937325P308245O977975P549524Q630872R049416J0281980Q612156
1703G39754260P388949P409036O300390N438566N001009M611492M325568L775955L208220
1721.4G87213445K903282K729655K593696K597987K370120K048194J982331J971722
1737.7H06410432J996457K151728K475917K715409K802372K891124K956628K647579
1754H27047646K333343K207279K034247J771927J528919J486122J466752J228690Q58366
1772.4H41963291Q96871J066506R91523Q59321Q63790Q44002P80403Q53837Q33213
1790.7H49952757O37889N53727O80209P22110N72145M46737N47588O44683N19455L89635
$$ y = [615787685, 622426629, 629218280, 636623323, 643589735, 650267363, 657544911, 666411102, 674406767, 681344092, 688652337, 695630312, 703179836, 711810708, 720860124, 731142104, 739754260, 747143209, 754552245, 760852635, 766291201, 771292210, 775903702, 780229270, 784005225, 787213445, 790116727, 792846382, 795440078, 798038065, 800408185, 802456379, 804438710, 806410432, 808406889, 810558617, 813034534, 815749943, 818552315, 821443439, 824400067, 827047646, 829380989, 831588268, 833622515, 835394442, 836923361, 838409483, 839876235, 841104925, 841963291, 842860162, 843926668, 844918191, 845777512, 846641302, 847485304, 848265707, 849119544, 849952757, 850590646, 851144373, 851824582, 852546692, 853118837, 853565574, 854113162, 854757845, 855277300, 855666935]
1811.1H55666935M73440N50509M03225L17752M48466N14090L74138L10004L51071L55780
1831.5H59765410L34979L07500L71098M23074L35872J92881K47478K91706J97768K32875
1851.9H62700641L36707K98142J74344K02536K80977K36690J31011P1048J21177J70052
1872.3H64723325J48356J74105J95503R5964O5684J79946K03550J8120l2961J55806
1892.7H65927398J52946j3709k3961R1672J25885N7339K2650M0114J5378n901M0174
1915.1H66429985M2319p808l9637k9743K2769k6167j13368o4015n662p5460j02639
1937.6H66030574O556j7404k14756k50399j17242o4790j47939j76907r1374q1241j87456
1960H64687622k30074j56820j57476k28762j72019p5221j07169j85311j54555r8229
$$ y = [855666935, 856140375, 856690884, 857094109, 857411861, 857860327, 858374417, 858748555, 859058559, 859409630, 859765410, 860100389, 860407889, 860778987, 861202061, 861537933, 861730814, 861978292, 862269998, 862467766, 862700641, 863037348, 863335490, 863509834, 863712370, 863993347, 864230037, 864361048, 864432096, 864553273, 864723325, 864871681, 865045786, 865241289, 865337253, 865402937, 865582883, 865786433, 865804553, 865771592, 865927398, 866080344, 866066635, 866042674, 866134346, 866260231, 866317570, 866340220, 866380334, 866395712, 866389811, 866429985, 866472304, 866464496, 866424859, 866395116, 866417885, 866391718, 866278350, 866214335, 866208673, 866133213, 866030574, 866037130, 866019726, 865804970, 865554571, 865437329, 865372539, 865224600, 865047693, 864956319, 864875078, 864687622, 864457548, 864300728, 864143252, 863914490, 863742471, 863667250, 863560081, 863374770, 863220215, 863121986]
1980.4H63121986j45197j73747j02758o7711j47403k43365k08915j13129j15693j75178
2000.8H61628890j82569j59919j73033j67191j34706j33336j92165k47836j83165j14382
2021.2H59940588j55091j86562j37747j09911j52647j81198j21415o6459j09375j61767
2041.6H58558416j31845p3314j09017j45316n5551q703j20580j64151m9174q285r9003
2064H57593477j02639K1636L7253n7280m5657M5120K5154o9261m2498P5877N8293n6684
2088.5H57482791k1756R0480O6459l1948n841Q0883M8817j1802N5969J18613L7253
2110.9H57909918q94R0182J14619K1279J4126J22726J29819L5167P3791J84714J33396
2133.4H58828843K2709N8711J72197J51635O7174J12474J79529J33991J03534J68442
$$ y = [863121986, 862976789, 862803042, 862700284, 862632573, 862485170, 862241805, 862032890, 861919761, 861804068, 861628890, 861446321, 861286402, 861113369, 860946178, 860811472, 860678136, 860485971, 860238135, 860054970, 859940588, 859785497, 859598935, 859461188, 859351277, 859198630, 859017432, 858896017, 858829558, 858720183, 858558416, 858426571, 858353257, 858244240, 858098924, 858043373, 858034670, 857914090, 857749939, 857700765, 857692480, 857593477, 857490838, 857512474, 857549727, 857492447, 857446790, 857491910, 857517064, 857447803, 857405305, 857481182, 857539475, 857482791, 857461035, 857551515, 857617974, 857586026, 857580185, 857661068, 857709885, 857698083, 857754052, 857872665, 857909918, 857909024, 857999206, 858113825, 858135104, 858149230, 858271956, 858401775, 858436942, 858510733, 858695447, 858828843, 858851552, 858910263, 859082460, 859234095, 859301269, 859413743, 859593272, 859727263, 859830797, 859999239]
2153.8H59999239J97471J28686Q5712J56819K06411J39594Q0109J42336K01821J43826
2174.2H61482024J26243J86026J58727N7340O0498J56701J63078Q6546Q4460J50740
2194.6H62712383J47999P4148M6611P5101Q9884Q8692J03414J02460N6625J1802K2113
2217H63531232Q2373R9183N1140M1247O1393M2200K1338M0472M7028J9610J847L636
2241.5H64042699M4108Q1539K9087k6107O497J8537m0412k3603P7367Q1360k682q822
2265.9H64279568N6327O1571J1563L5048Q1658K7538j8537M2081J09672O9678j1444
2288.4H64744723J4603Q7619L6001l2067L8266O8366K206J8954P8559K4974o4373r596
2312.9H65008235J18732J09673l8147j19448l4988K9445l3975l7491M1127K5094o2466
$$ y = [859999239, 860196710, 860325396, 860411108, 860567927, 860774338, 860913932, 860994041, 861136377, 861338198, 861482024, 861608267, 861794293, 861953020, 862010360, 862070858, 862227559, 862390637, 862477183, 862561643, 862712383, 862860382, 862934530, 862981141, 863056242, 863146126, 863234818, 863338232, 863440692, 863497317, 863509119, 863531232, 863613605, 863712788, 863763928, 863805175, 863866568, 863908768, 863930106, 863970578, 864017606, 864037216, 864039063, 864042699, 864086807, 864168346, 864197433, 864171326, 864177823, 864196360, 864155948, 864132345, 864209712, 864291072, 864288390, 864279568, 864335895, 864397466, 864409029, 864444077, 864525735, 864553273, 864534736, 864576817, 864686489, 864756167, 864744723, 864759326, 864846945, 864882946, 864850879, 864889145, 864957511, 864959717, 864978671, 865057230, 865082204, 865017831, 865008235, 865126967, 865236640, 865198493, 865079045, 865044057, 865073502, 865039527, 865002036, 865043163, 865068257, 865005791]
2335.3H65005791o2465k9982r8884o3359K57849N21660L40939n3823k46585k09749
2355.7H65361392k42054j63853J13189J88291J05679K00927M10438L94404J81496J90258
2376.1H66740167L52562K96771J42932J52588K17557J44064L100J3709J06037N0663
2396.5H68220150n2928r776P1586J4960o1750j2934L9100l576m3690r000J0669p9394
2421H68083417j32322o0916m1425j09136j16289l5524j3530q4997r3579l4094m4405
2443.4H67317200r1672o7294j6808n7340j59085j36733l7432n8412j20282j04785q0765
2465.8H66386592j09195j19925o5684p8023j68085j48594o4314q1896j61052j70350
2486.2H65219474q2970m1067j38879j86205p5400m5002j37388j26124m6312o1214j29819
$$ y = [865005791, 864943326, 864913344, 864814460, 864751101, 865008950, 865530610, 865871549, 865817726, 865571141, 865361392, 865119338, 864955485, 865068674, 865256965, 865362644, 865563571, 865974009, 866368413, 866549909, 866740167, 867092729, 867389500, 867532432, 867685020, 867902577, 868046641, 868049741, 868063450, 868169487, 868220150, 868167222, 868157446, 868229032, 868243992, 868182242, 868169308, 868208408, 868204832, 868161142, 868152142, 868162811, 868083417, 867951095, 867890179, 867848754, 867739618, 867623329, 867587805, 867574275, 867489278, 867395699, 867361605, 867317200, 867225528, 867158234, 867141426, 867084086, 866925001, 866788268, 866750836, 866692424, 866572142, 866467357, 866386592, 866277397, 866157472, 866091788, 866013765, 865845680, 865697086, 865632772, 865550876, 865389824, 865219474, 865136504, 865095437, 864956558, 864770353, 864694953, 864649951, 864512563, 864386439, 864340127, 864278913, 864149094]
2508.7H64149094j16289m9114p6711j64807j58906j06216j16229j13070m5657m2736
2529H63159359j43230j71125j03951r1433j31131j25467m1426Q107o6102j37150j25826
2551.5H62030625j19626j37448j26124r3162j10030j85371j89960j00314p7605j66178
2571.9H60724807k16365j66655j55270k12848k07782j52826j60515k21491k42532k36630
2592.3H58751893k71738k97248k67208k47478l01242l52442l15428k67029k83956l15130
2612.7H55832994l04103k80738l07023l22461k89917l10302l54111l44813l13461k98143
2633.1H52707922l05593k94506k80857l31462l69668l22103k83599k95222l21507l18349
2653.5H49585056k82108k88904l09110k77996k46823k84433l37720l04937k48671k55287
$$ y = [864149094, 864032805, 863983691, 863906980, 863742173, 863583267, 863477051, 863360822, 863247752, 863202095, 863159359, 863016129, 862845004, 862741053, 862649620, 862518489, 862393022, 862351596, 862359703, 862293601, 862156451, 862030625, 861910999, 861773551, 861647427, 861554265, 861444235, 861258864, 861068904, 860968590, 860890985, 860724807, 860508442, 860341787, 860186517, 859973669, 859765887, 859613061, 859452546, 859231055, 858988523, 858751893, 858480155, 858182907, 857915699, 857668221, 857366979, 857014537, 856699109, 856432080, 856148124, 855832994, 855528891, 855248153, 854941130, 854618669, 854328752, 854018450, 853664339, 853319526, 853006065, 852707922, 852402329, 852107823, 851826966, 851495504, 851125836, 850803733, 850520134, 850224912, 849903405, 849585056, 849302948, 849014044, 848704934, 848426938, 848180115, 847895682, 847557962, 847253025, 847004354, 846749067]
2673.9H46749067k66909k74241l32594l63827l16560l06249l58820l60787l27170l30329
2694.3H43511581l33666l42191l91900m11451l59118l31759l86119m16756l72946l62337
2714.6H39803338m17173m59075m32670l43442k98917l91126m92334m72069m17590l49701
2735H35729241k76982l23356m11868l82364l01063l04818l85701m35770m16219m28200
2755.4H32062900m90308m83393m37618m58181m85956m59552m40419m62174m84348m94182
2775.8H27366769n37812n98014n90920n57721n71489n81682n82218o09279o50167o84798
2796.2H21402669p06434p62046q37266q37743p49350p15137q54551r80795r16719q42512
2816.6H13200116r10461r86278r83536j002967j112760j221954j214803j228511j405656
$$ y = [846749067, 846482158, 846207917, 845875323, 845511496, 845194936, 844888687, 844529867, 844169080, 843841910, 843511581, 843177915, 842835724, 842443824, 842032373, 841673255, 841341496, 840955377, 840538621, 840165675, 839803338, 839386165, 838927090, 838494420, 838150978, 837852061, 837460935, 836968601, 836496532, 836078942, 835729241, 835452259, 835128903, 834717035, 834334671, 834033608, 833728790, 833343089, 832907319, 832491100, 832062900, 831572592, 831089199, 830651581, 830193400, 829707444, 829247892, 828807473, 828345299, 827860951, 827366769, 826828957, 826230943, 825640023, 825082302, 824510813, 823929131, 823346913, 822737634, 822087467, 821402669, 820696235, 819934189, 819096923, 818259180, 817509830, 816794693, 815940142, 814959347, 814042628, 813200116, 812289655, 811303377, 810319841, 809316874, 808204114, 806982160, 805767357, 804538846, 803133190]
2835H03133190j608372j846433k275943k770901l094554l204704l078460k574504j827478
2853.3G80851841j199186q23796p50243r85146j343191j667141j893104j904666j711071
2871.7G68574297j538991j409233j145184q71360q11577q82268j007080j205147j322686
2890.1G58380771j320958j369715j533866j688480j653851j567959j680613j899064
2906.4G45666265k088487k260744k452374k692401k838433k702951k295733j739442
2922.7G26595700j200855o86288j87099J45912M40061Q71063J331687J713097J962244
2941G30985522K005518J758277J226962O76751L44872M3512k69473l04401j2874L61323
2961.4G36815989N56111O33240P72476R23813J039147J103699J100540J157523J241326
$$ y = [803133190, 801524818, 799678385, 797402442, 794631541, 791536987, 788332283, 785253823, 782679319, 780851841, 779652655, 778828859, 778078616, 777093470, 775750279, 774083138, 772190034, 770285368, 768574297, 767035306, 765626073, 764480889, 763609529, 762797952, 761915684, 760908604, 759703457, 758380771, 757059813, 755690098, 754156232, 752467752, 750813901, 749245942, 747565329, 745666265, 743577778, 741317034, 738864660, 736172259, 733333826, 730630875, 728335142, 726595700, 725394845, 724708557, 724521458, 724667370, 725107431, 725978494, 727310181, 729023278, 730985522, 732991040, 734749317, 735976279, 736653030, 736997902, 737041414, 736771941, 736467540, 736454666, 736815989, 737372100, 738005340, 738777816, 739701629, 740740776, 741844475, 742945015, 744102538, 745343864]
2979.8G45343864J173973J072407J033604R93192J002550R13739N61536K21908k4021
2998.1G52292752k93016m66228n82337o74009o02305m54367m73737o45638p79390q61466
3018.5G46460259r29773r53615j035392j183092j170815j055002j051903j222312j396358
3036.9G36461997j325071j231968j351476j517594j577675j509190j467764j543522
3053.2G24937737j596510j587689j531601j397074j264154j213551j275301j382589
3069.5G13689268j373947j256228j117706j053452j195669j391471j418054j388907
3085.8G03493834j389444j409233j487613j542687j496852j398861j424968j597524
3102.2F91746652j633048j515806j511275j676441j742243j622677j619220j802325
$$ y = [745343864, 746517837, 747590244, 748623848, 749617040, 750619590, 751533329, 752094865, 752316773, 752292752, 751999736, 751533508, 750951171, 750277162, 749674857, 749220490, 748746753, 748101115, 747321725, 746460259, 745530486, 744576871, 743541479, 742358387, 741187572, 740132570, 739080667, 737858355, 736461997, 735136926, 733904958, 732553482, 731035888, 729458213, 727949023, 726481259, 724937737, 723341227, 721753538, 720221937, 718824863, 717560709, 716347158, 715071857, 713689268, 712315321, 711059093, 709941387, 708887935, 707692266, 706300795, 704882741, 703493834, 702104390, 700695157, 699207544, 697664857, 696168005, 694769144, 693344176, 691746652, 690113604, 688597798, 687086523, 685410082, 683667839, 682045162, 680425942, 678623617]
3118.5F78623617k048254k217710k174557k038061j988113k082944k223015k184987
3134.8F61665976k015114k050102k328097k492249k436996k352238k243280k180398
3151.1F43567502k381980k646327k669036k590418k582908k594054k557873k545715
3167.4F22999191k611458k655566k637803k619922k654076k683342k676606k673745
3183.7F01786673k641857k586960k601028k666771k672851k643168k645433k641142
3200.1E80687463k608716k576590k550602k579272k599179k523780k479077k488493
3216.4E60281754k501727k525925k522826k478064k438306k420724k357602k289534
3232.7E40747046k346694k397299k301395k177238k063155j936615j902342k006590
$$ y = [678623617, 676575363, 674357653, 672183096, 670145035, 668156922, 666073978, 663850963, 661665976, 659650862, 657600760, 655272663, 652780414, 650343418, 647991180, 645747900, 643567502, 641185522, 638539195, 635870159, 633279741, 630696833, 628102779, 625544906, 622999191, 620387733, 617732167, 615094364, 612474442, 609820366, 607137024, 604460418, 601786673, 599144816, 596557856, 593956828, 591290057, 588617206, 585974038, 583328605, 580687463, 578078747, 575502157, 572951555, 570372283, 567773104, 565249324, 562770247, 560281754, 557780027, 555254102, 552731276, 550253212, 547814906, 545394182, 543036580, 540747046, 538400352, 536003053, 533701658, 531524420, 529461265, 527524650, 525622308, 523615718]
3249E23615718k063751j951993j817286j829088j896262j872897j853764j859724j777232
3267.4E06693721j667023j706064j858890j935601j891583j808077j799077j842350
3283.7D92185056j821041j757383j716554j731068j790226j883805k014279k026409
3300D77444291j894981j806616j860559k052486k237141k303243k276927k220154k184183
3318.4D58608001k186328k203047k225310k353012k494574k449542k355188k324462
3334.7D40016538k280772k319634k480924k607793k665936k589882k402842k456546
3351D20212209k737373k811432k610415k429694k451569k504706k358526k233774k371162
3369.3C97703558k607256k607554k324134k110392k058894k053797j996338j765371
$$ y = [523615718, 521551967, 519599974, 517782688, 515953600, 514057338, 512184441, 510330677, 508470953, 506693721, 505026698, 503320634, 501461744, 499526143, 497634560, 495826483, 494027406, 492185056, 490364015, 488606632, 486890078, 485159010, 483368784, 481484979, 479470700, 477444291, 475549310, 473742694, 471882135, 469829649, 467592508, 465289265, 463012338, 460792184, 458608001, 456421673, 454218626, 451993316, 449640304, 447145730, 444696188, 442341000, 440016538, 437735766, 435416132, 432935208, 430327415, 427661479, 425071597, 422668755, 420212209, 417474836, 414663404, 412052989, 409623295, 407171726, 404667020, 402308494, 400074720, 397703558, 395096302, 392488748, 390164614, 388054222, 385995328, 383941531, 381945193, 380179822]
3385.7C80179822j379936j050979j132071j509160j543373j100093p88659j062781
3402C70612770j425117j201630p35312n57483n91009o51539o25431m25726k60115k00510
3422.4C63938898M4823L67164M84437M23670N60373Q76874Q06510M39584M35531Q56847
3442.8C69234711J205504J279980J297891J435041J598806J736998J880348K009243
3459.1C81678522J916289J860917K232402K487034K135277J627922J657515K074629
3475.4C97670507K468437K483756K107799K078175K415091K434969K316445K484292
3491.7D16459471K677053K709836K612561K590984K617836K434552K293825K434283
3508D36830401K729208L015577K987713K720326K717108K999335L276319L150701K782226
$$ y = [380179822, 378799886, 377748907, 376616836, 375107676, 373564303, 372464210, 371675551, 370612770, 369187653, 367986023, 367250711, 366693228, 366102219, 365450680, 364825249, 364399523, 364139408, 363938898, 363983721, 364350885, 364835322, 365258992, 365819365, 366696239, 367502749, 367942333, 368377864, 369234711, 370440215, 371720195, 373018086, 374453127, 376051933, 377788931, 379669279, 381678522, 383594811, 385455728, 387688130, 390175164, 392310441, 393938363, 395595878, 397670507, 400138944, 402622700, 404730499, 406808674, 409223765, 411658734, 413975179, 416459471, 419136524, 421846360, 424458921, 427049905, 429667741, 432102293, 434396118, 436830401, 439559609, 442575186, 445562899, 448283225, 451000333, 453999668, 457275987, 460426688, 463208914]
3526.4D63208914K785593L125340L400892L566563L577918L463268L637075L884644
3542.7D90650207L762215L412485L398300L658771L804684L865778M006386M223525
3559E20782351M345358M190504L920556M274785M879236M819751M592478M671097M928649
3577.4E61404765N213976N450129N457163N194068N055964N435586N529642N452335
3593.7F04193628N678892N862176N815030N846142N816460N507231N562663N918622
3610F50200844N976379N973816N798101N692720O096304N983949N398810M943668N150319
3628.4G01214910N879521N548417N190313N082310M881382M801631M721999M410684
3644.7G41731167M052400M204572M484534L957510L430784L661513L777266L222405
$$ y = [463208914, 465994507, 469119847, 472520739, 476087302, 479665220, 483128488, 486765563, 490650207, 494412422, 497824907, 501223207, 504881978, 508686662, 512552440, 516558826, 520782351, 525127709, 529318213, 533238769, 537513554, 542392790, 547212541, 551805019, 556476116, 561404765, 566618741, 572068870, 577526033, 582720101, 587776065, 593211651, 598741293, 604193628, 609872520, 615734696, 621549726, 627395868, 633212328, 638719559, 644282222, 650200844, 656177223, 662151039, 667949140, 673641860, 679738164, 685722113, 691120923, 696064591, 701214910, 707094431, 712642848, 717833161, 722915471, 727796853, 732598484, 737320483, 741731167, 745783567, 749988139, 754472673, 758430183, 761860967, 765522480, 769299746, 772522151]
3661G72522151K816380K760708K507508K219557K465308K261341J726389J959860K163887
3679.4G93403089K054095K029598J954913J756311J394987J235604J453161J529515
3695.7H06811273J317680R84907Q56400J096069J237154R65596M63962M04775R37522
3714H15075338J066744Q58903O93798N41210L75867M41134P32422O97315L44992J85549
3734.4H21013272N87106R57608O59108j12355l83019M59432N23508k2233L27588P91847
3754.8H24801862N47767K10702L41475M51625K73347J67071J35243K34962L79145L66092
3775.2H27909291L08931J92463J12355R1851J12474K04145K72990K84195J38938j8537
3795.6H29609096R4950Q583j44899K23697J68383L0637L61323M21882O3836j16348
$$ y = [772522151, 775338531, 778099239, 780606747, 782826304, 785291612, 787552953, 789279342, 791239202, 793403089, 795457184, 797486782, 799441695, 801198006, 802592993, 803828597, 805281758, 806811273, 808128953, 809113860, 809970260, 811066329, 812303483, 813269079, 813733041, 814137816, 815075338, 816142082, 817000985, 817694783, 818235993, 818611860, 819052994, 819785416, 820482731, 820827723, 821013272, 821600378, 822557986, 823217094, 823104739, 822721720, 823181152, 823704660, 823682427, 824010015, 824801862, 825349629, 825560331, 825901806, 826353431, 826626778, 826793849, 826929092, 827164054, 827543199, 827909291, 828218222, 828410685, 828523040, 828614891, 828727365, 828931510, 829204500, 829488695, 829627633, 829609096, 829704046, 829712629, 829567730, 829791427, 829959810, 829990447, 830351770, 830773652, 830837488, 830721140]
3816H30721140J30892j33932k34425K54452K93911J76131J52350K24352K85148q6307
3836.4H31783712m91440j72735K38836L75152L95000K83658j80304j053810n99384
3854.8H30578685O29306O10351J70291j54674o8069O3419k00271j25885J61409K06769
3875.2H31871331K13742j9610p3612N3883o2823K8073k2351k07186J18673L25739l278
3897.6H32222581l22223k78592j16646N8472J81258J50382Q5473j4722j50383j34646
3918H31680954N5432R4175j5497M7803R8765o6400q0168J17481J11520l3796q2075
3940.4H31928194j5378J08838R2864l7194o8366K8908J36316Q9943n7101j02162k7240
3962.9H32077622P0572J30594J39117P9871J9908N7756R6977N1856O4254J58012R3102
$$ y = [830721140, 830852032, 830718100, 830483675, 830738127, 831032038, 831208169, 831360519, 831584871, 831870019, 831783712, 831292272, 831119537, 831358373, 831733525, 832128525, 832412183, 832231879, 831178069, 830578685, 831207991, 831818342, 831988633, 831833959, 831765890, 831829309, 831629038, 831503153, 831664562, 831871331, 832085073, 832065463, 831991851, 832045734, 831982911, 832010984, 831988633, 831781447, 831900120, 832225859, 832222581, 831900358, 831621766, 831505120, 831563592, 831744850, 831895232, 831980705, 831965983, 831815600, 831680954, 831736386, 831830561, 831815064, 831862867, 831961632, 831895232, 831815064, 831932545, 832044065, 832010269, 831928194, 831912816, 832021654, 832114518, 832077324, 832008958, 832037866, 832174182, 832264125, 832207024, 832104862, 832077622, 832148194, 832278788, 832417905, 832497776, 832517684, 832575440, 832672417, 832724273, 832788527, 832946539, 833039641]
3985.3H33039641q2016q2194L2484R4056J11461J16110
3997.5H33229542
$$ y = [833039641, 832957625, 832875431, 832907915, 833001971, 833113432, 833229542]
##END=$$ End of the data block
