##TITLE=$$ Begin of the data block
##JCAMP-DX=5.00 $$ ACD/SpecManager v 10.08
##SPECTROMETER/DATA SYSTEM=Alpha
##DATE=09 Apr 2014 11:14:46
##DATA TYPE=INFRARED SPECTRUM
##DATA CLASS=XYDATA
##ORIGIN=
##OWNER=
##NPOINTS=1765
##FIRSTX=399.75695801
##LASTX=3997.56933594
##MAXX=3997.56933594
##MINX=399.75695801
##MAXY=0.85129315
##MINY=0.35507256
##XFACTOR=1.0000000000
##YFACTOR=1.000000000000000e-9
##FIRSTY=0.64846039
##DELTAX=2.03957629
##XUNITS=1/CM
##YUNITS=ARBITRARY UNITS
##XYDATA=(X++(Y..Y))
399.8F48460388j343787j194775o29186r70602k009213j386404K50995N08249o46532
418.1F41039133j141846L1650r2745j155019o79254L99411k13624j351773p67112M41432
438.5F36510253K18689o37531n42760o7472k30134l62515J62482M24266n22554j737595
458.9F33215129j292050r4413j06871j013458r67205j25885k48134j124859j050174
477.3F27192080j80244p5221q74401j005590r0539J23858j019775j469374m67479m1485
497.7F22091830p44343j193702o76871k25007q24750j338005o09636j46925j090050
516F15242541j646459o99401l06964j278341j809716r72688l43919j000703j583278
534.4F05601072q77261j99020q12351j355052n34475K53260m03404j344860j043499
$$ plain form
399.8 648460388 647116601 645921826 645292640 644322038 642312825 640926421 641177416 641685665 641039133
418.1 641039133 639897287 639928937 639836192 638681173 638001919 638401330 638187706 636835933 636068821 636510253
438.5 636510253 636728942 636091411 635548651 635481179 635251045 634888530 635051012 635475278 634952724 633215129
458.9 633215129 631923079 631828666 631721795 630708337 629741132 629615247 629367113 628242254 627192080
477.3 627192080 627011836 626936615 626062214 625056624 624966085 625089943 624070168 622600794 622133315 622091830
497.7 622091830 621347487 620153785 619476914 619251907 618427157 617089152 616479516 616332591 615242541
516 615242541 613596082 612896681 612589717 611311376 609501660 608528972 608185053 607184350 605601072
534.4 605601072 604723811 604524791 603712440 602357388 601822913 602076173 601672769 600327909 599284410
552.7E99284410m31120j064598j839281j246988n42462j165331k036035j701891j067400
571.1E88189304j609206k411843j792311p53284j255870k111017j505435o44982j202106
589.4E74903250k143145j576722m08589p17700j808822j771271j066208j129210j374781
607.8E62906802o14107K52247M3511j49965J223326L014326L298223K711356K795100
626.1E75480819L464102L382504K648473K504945K814174K305090J077950M79758R89676
644.5E95147491J820921K023459J488209P17580J12712O06895K793312M782140M683674
662.9F14176393L089547K288937L311754L143191K197683J999080K356648K563179
679.2F35126412K027750J454234J577854J834035J530409J010835R07481J175105J076818
$$ plain form
552.7 599284410 598853290 597788692 595949411 594702423 594159961 592994630 590958595 589256704 588189304
571.1 588189304 586580098 584168255 582375944 581622660 580366790 578255773 576750338 576105356 574903250
589.4 574903250 572760105 571183383 570774794 570057094 568248272 566477001 565410793 564281583 562906802
607.8 562906802 562292695 562544942 562588453 562438488 563661814 566676140 569974363 572685719 575480819
626.1 575480819 578944921 582327425 584975898 587480843 590295017 592600107 593678057 594157815 595147491
644.5 595147491 596968412 598991871 600480080 601197660 601310372 601917267 604710579 609492719 614176393
662.9 614176393 617265940 619554877 622866631 626009822 628207505 630206585 632563233 635126412
679.2 635126412 637154162 638608396 640186250 642020285 643550694 644561529 645469010 646644115 647720933
697.5F47720933O45339P19130J308263J622975J424908J336933J762330K175152K016425
715.9F60732388J681388J772165K028823J856268J572251J695156J988113J829624
732.2F75156176J254499J111269J447439J421273J098156J278698J844109J895010
748.5F86506629J312137J161933J806497K064765J426398J136959J690328J820028
764.8F98925674J127481O11604P55310Q56638J78694o35206n73814l98994j073539
783.2F99773848j524210o63519N49197R70364J390576K874375M534483M783332M181504
801.6G16869950M407585M952311M274071K949178K593934K808154J906753J43349n94437
819.9G40310848m88043j398623l119052l742039l240227l331662m065871l990173l018201
$$ plain form
697.5 647720933 648366272 649085402 650393665 652016640 653441548 654778481 656540811 658715963 660732388
715.9 660732388 662413776 664185941 666214764 668071032 669643283 671338439 673326552 675156176
732.2 675156176 676410675 677521944 678969383 680390656 681488812 682767510 684611619 686506629
748.5 686506629 687818766 688980699 690787196 692851961 694278359 695415318 697105646 698925674
764.8 698925674 700053155 700664759 701420069 702276707 702455401 701820195 701246381 700847387 699773848
783.2 699773848 698249638 697586119 698135316 699105680 700496256 703370631 707905114 712688446 716869950
801.6 716869950 721277535 726229846 730503917 733453095 736047029 738855183 740761936 740905285 740310848
819.9 740310848 739822805 738424182 735305130 731563091 728322864 724991202 720925331 716935158 713916957
838.3G13916957k638816l121853k890289j508773k46644N68271K103448M644394O549418
856.6G17376113O933451P149398Q006930Q246243O949187N367815M806817M441917
872.9G69277871L152668J718402J298428J045107k81274j724720j954734j728893k178430
891.3G68624425k487719j455367J12474P97272R17792J473964K080321J647174M09305
909.6G72119641l93748p70986j814187l274202l804624l257930k570153j944780q84891
928G53404140L99292J026332P71940M21405M79281L86357k23279p35938p97451j006245
948.4G54125834j867652k935231l639400m292429n377531o662011p741153q740902
964.7G12869525r943187j1074961j1472702j0953187r925724q652925p214367n856038
$$ plain form
838.3 713916957 711278141 708156288 705265999 703757226 703510582 704078853 706182301 710826695 717376113
856.6 717376113 724309564 731458962 739465892 747712135 754661322 760029137 764835954 769277871
872.9 769277871 772430539 774148941 775447369 776492476 776211202 774486482 772531748 770802855 768624425
891.3 768624425 766136706 764681339 764793813 765591085 766508877 767982841 770063162 771710336 772119641
909.6 772119641 771725893 770954907 769140720 765866518 762061894 758803964 756233811 754289031 753404140
928 753404140 753803432 754829764 755601704 756023109 756502390 756888747 756665468 755929530 755132079 754125834
948.4 754125834 752258182 749322951 745683551 741391122 736013591 729351580 721610427 712869525
964.7 712869525 702926338 691851377 680378675 669425488 659499764 650846839 643632472 637776434
981F37776434m869461m385590m102767l559172k886832k486586k222598j775086j271188
999.4F10217154j057804j189351j517296k032637k814829l731311m327178m412412
1015.7E89134336m320562m281402m124045l771067l503442l472686l355145k882302
1032E59423685k382278k174497k016425j689196j453757j545549j774609j814723j658022
1050.4E42914629j475811j092017k19047Q48890J383543J200079O87302m948j051187
1068.7E43191433k188683k786100k786874k710283k848625k919495k802015k915978
1085E21233380l395736l640294l207982k349019j422346m82917M89593J123965J133203
1103.4E09481847Q60691P20203N43177j2099p68304j473367k436161l784657m463196
$$ plain form
981 637776434 632906973 628521383 624418616 620859444 617972612 615486026 613263428 611488342 610217154
999.4 610217154 609159350 607969999 606452703 604420066 601605237 597873926 593546748 589134336
1015.7 589134336 584813774 580532372 576408327 572637260 569133818 565661132 562305987 559423685
1032 559423685 557041407 554866910 552850485 551161289 549707532 548161983 546387374 544572651 542914629
1050.4 542914629 541438818 540346801 540127754 540976644 542360187 543560266 544247568 544242620 543191433
1068.7 543191433 541002750 538216650 535429776 532719493 529870868 526951373 524149358 521233380
1085 521233380 517837644 514197350 510989368 508640349 507218003 506735086 507224679 508348644 509481847
1103.4 509481847 510342538 511062741 511605918 511593819 510825515 509352148 506915987 503131330 498668134
1121.8D98668134l281593j034707N02169J149357J235753Q97378R55849J688183K518952
1140.1E03299475K972841K839923K296209J850188J701951J624107J548171J727462
1156.4E19860327K264679K915084L571391M448712N543411O405234O760419O818533
1172.7E58587790O808936O654561O214797N602122N000114M279971L206551J913548
1189.1E98268390P53283j18494o99520q58068m55738L46005J179040J765788J998662
1207.4F02179348J868845J446962Q97467M61161K54929J86742J94668K92778M40359
1225.8F08223259O13690Q19623J041711J254558J433790J579702J654208J580476J393915
1244.1F19594932J186132R23276N65052K79605K26558L20673M65989P38740J222312
$$ plain form
1121.8 498668134 495386541 494351834 494854003 496003360 497239113 498136491 499092340 500780523 503299475
1140.1 503299475 506272316 509112239 511408448 513258636 514960587 516584694 518132865 519860327
1156.4 519860327 522125006 525040090 528611481 533060193 538603604 545008838 551769257 558587790
1172.7 558587790 565396726 572051287 578266084 583868206 588868320 593148291 596354842 598268390
1189.1 598268390 599021673 598903179 598203659 597345591 596889853 597235858 598414898 600180686 602179348
1207.4 602179348 604048193 605495155 606392622 606853783 607108712 607295454 607490122 607782900 608223259
1225.8 608223259 608836949 609656572 610698283 611952841 613386631 614966333 616620541 618201017 619594932
1244.1 619594932 620781064 621704340 622269392 622548997 622775555 623096228 623562217 624300957 625523269
1262.5F25523269J798034K273857K685369L196775L643871L795326L852367M049420
1278.8F50818288M263282M271150M222870M411041M611016M442632M065752L839493
1295.1F84945524L702700L329575K780199K441287K310276K014220J535892J242876
1311.4G04302549J191974J043141P97510Q34465J172602J385927J307428J238406J288533
1329.8G14562535J081288N39422K14040K86162K85328P8380J26779N21779P58529N19931
1350.2G18974173K29120K73347K74003q3685m65691o40929p95424j099050j341462
1368.5G15324402j123369r05752j357138j910925k347767l357053m000604k513528
1384.9F97808266P8082R89437K08080o05047j138449j451373k045154k541781k569616
$$ plain form
1262.5 625523269 627321303 629595160 632280529 635477304 639121175 642916501 646768868 650818288
1278.8 650818288 655081570 659352720 663575590 667986631 672597647 677040279 681106031 684945524
1295.1 684945524 688648224 691977799 694757998 697199285 699509561 701523781 703059673 704302549
1311.4 704302549 705494523 706537664 707335174 708169639 709342241 710728168 712035596 713274002 714562535
1329.8 714562535 715643823 716183245 716397285 716683447 716968775 717047155 717173934 717695713 718454242 718974173
1350.2 718974173 719203293 719476640 719750643 719666958 719201267 718560338 717764914 716665864 715324402
1368.5 715324402 714201033 713295281 711938143 710027218 707679451 704322398 700321794 697808266
1384.9 697808266 697886348 698875785 699083865 698478818 697340369 695888996 693843842 691302061 688732445
1403.2F88732445k618849k573669k423525k110302j480580r75489j064956j341820
1419.5F74143255q81493m73976n09680l67999p8022J29819K96056N42819Q93891J013875
1439.9F74708545J106203J325190J758098K201200K340138K538264L193199M840553
1456.2F94011390O036997M581749M197658N219817N467951M804015N341053P011950
1472.6G36672580O595671M751683L877282L369033K705991J890779J304686M93527
1488.9G61661232o58930j103878j309395k079069k789498k696991k212405k732158
1505.2G46078908n515873n683124m197598l733277l466070l214240k660453k721667
1521.5G14886606k847135k616883k623021k100885j819968k216101j783490r77755
$$ plain form
1403.2 688732445 686113596 683539927 681116402 679006100 677525520 676550031 675485075 674143255
1419.5 674143255 673261762 672787786 672278106 671910107 671832085 671961904 672257960 672800779 673694670 674708545
1439.9 674708545 675814748 677139938 678898036 681099236 683439374 685977638 689170837 694011390
1456.2 694011390 700048387 704630136 708827794 714047611 719515562 724319577 729660630 736672580
1472.6 736672580 743268251 748019934 751897216 755266249 757972240 759863019 761167705 761661232
1488.9 761661232 761002302 759898424 758589029 756509960 753720462 751023471 748811066 746078908
1505.2 746078908 740563035 734879911 730682313 726949036 723482966 720268726 717608273 714886606
1521.5 714886606 712039471 709422588 706799567 704698682 702878714 700662613 698879123 697901368
1537.8F97901368j242041j750648j161993m63963J29700N34952Q55863J234114J462102
1556.2F97499454J151443O0737l99530n81801r58860j762331k830088k795517l161311
1574.5F86222196n103231n313694m646778n120457n587756n809844n990922o166280
1590.9F42483234o252765o327331o224156o023228n992591n980432n774796n676091
1607.2E94231844n884290n764842n194068n513429o578267n186677m089057m699171
1623.5E51322043m589796m017532l504276k385319j612126j615584j000703O7771Q91328
1641.8E33555806J570344K505898L144086K582073L246546N058527L888368L449559
1658.2E59001207M354596N498231N843699N181432N822718P026672O270468O388963
$$ plain form
1537.8 697901368 696659327 694908679 693746686 693282723 693412423 693947375 694803238 696037352 697499454
1556.2 697499454 698650897 698711634 698312104 697730303 696771443 695009112 692179024 689383507 686222196
1574.5 686222196 681118965 675805271 671158493 666038036 660450280 654640436 648649514 642483234
1590.9 642483234 636230469 629903138 623678982 617655754 611663163 605682731 599907935 594231844
1607.2 594231844 588347554 582582712 577388644 571875215 565296948 560110271 556021214 551322043
1623.5 551322043 546732247 542714715 539210439 536825120 535212994 533597410 532596707 532664478 533555806
1641.8 533555806 535126150 537632048 540776134 543358207 546604753 551663280 555551648 559001207
1658.2 559001207 563355803 568854034 574697733 579879165 585701883 592728555 598999023 605387986
1674.5F05387986P162749O566048O251037P250011R448052Q105755O637334P129848
1690.8F63938820O769359P652224Q927881Q791924R824931Q025229O722570O836057
1707.1G27488995N793809N128563M935503M800320M832327M005134L005922K871931
1723.4G62862504L058433L064752L137052K972185L102422L075898K481639K619267
1739.7G86374152K875268K884329K928435K885104K771973K611697K228141K028048
1756.1H07587147J985430J862228J815737J551866J393199J569569J618266J329303
1772.4H20712745R89199R50694J139104J180649J017749J000762J119972J093089R95994
1790.7H30199957J006424R16839P99239P55250P77423P63834O67036O11603O41286
$$ plain form
1674.5 605387986 612550735 619116783 625367820 632617831 642065883 650171638 656808972 663938820
1690.8 663938820 670708179 678360403 687288284 696080208 705905139 713930368 720652938 727488995
1707.1 727488995 733282804 738411367 743346870 748147190 752979517 756984651 759990573 762862504
1723.4 762862504 765920937 768985689 772122741 775094926 778197348 781273246 783754885 786374152
1739.7 786374152 789249420 792133749 795062184 797947288 800719261 803330958 805559099 807587147
1756.1 807587147 809572577 811434805 813250542 814802408 816195607 817765176 819383442 820712745
1772.4 820712745 821701944 822652638 823791742 824972391 825990140 826990902 828110874 829203963 830199957
1790.7 830199957 831206381 832123220 832922459 833677709 834455132 835218966 835886002 836497605 837138891
1809.1H37138891O74904N58674M40717M70638N59330N49853N18620N68330O03438M85479
1829.5H42568874K76447K55167L61085L84450L47674M12583N09441M08113J86503J58131
1849.9H45868468K64883L13282K80977K28047K77042L58284L57628L10838K39968J17839
1870.3H48617256L1590N8234J74403K59638K01344J39475J91450K55227J78576K0206
1890.7H50127399J9133J25468J18136L5346O4194J57773J58668O0976K1994R8586J34289
1913.1H51121962N8711j2935M4525Q0884l5048j01685j3054L6955m0352r7514l8981
1935.5H51003468M7147J5080p8797r4950q7559j66893k14696j19150n1677j42634k36333
1958H49873006j61111m7922q8275j92463j88947j11639j34588k16901j61469m6074
$$ plain form
1809.1 837138891 837813795 838372469 838813186 839283824 839843154 840393007 840911627 841479957 842083395 842568874
1829.5 842568874 842845321 843100488 843461573 843846023 844193697 844606280 845115721 845523834 845710337 845868468
1849.9 845868468 846133351 846446633 846727610 846955657 847232699 847590983 847948611 848259449 848499417 848617256
1870.3 848617256 848648846 848707080 848881483 849141121 849342465 849481940 849673390 849928617 850107193 850127399
1890.7 850127399 850146532 850272000 850390136 850425482 850489676 850647449 850806117 850867093 850889087 850987673 851121962
1913.1 851121962 851180673 851167738 851212263 851293147 851258099 851156414 851143360 851180315 851139963 851042449 851003468
1935.5 851003468 851050615 851065695 850986898 850891948 850804389 850637496 850422800 850303650 850251973 850109339 849873006
1958 849873006 849711895 849663973 849575698 849383235 849194288 849082649 848948061 848731160 848569691 848523617
1978.4H48523617j07646k30134j70350j5855k8193j98841k51233j29342j02818k40863
1998.8H47048342k62975j12892q1658k31802k78235j54197r8884j83881k38061j86860
2019.2H45218897j69397k32398k27034j18494j27435k64287k95818j71602p5340j44362
2039.6H43392730k25187j59919j03950k03610k54929j18017j79r7275k15351j35660
2060H41878653m6492j03414j62125j05440n0962j05679j71125r3758M3273K4199j11699
2082.4H40995431j37210l5226k0445j01566q4877J2040O676o8844m6312N9366P1883
2104.8H40650916l8981q2791O795N7697j5736l4570O8009R7453K1458K3723R6857R6142
2129.3H40946972M4465N1201J06215J21177R1731P5996J07825J20699P3791M5895J01745
$$ plain form
1978.4 848523617 848415971 848185837 848015487 847999632 847971439 847772598 847521365 847392023 847289205 847048342
1998.8 847048342 846785367 846672475 846590817 846359015 846080780 845926583 845827699 845643818 845405757 845218897
2019.2 845218897 845049500 844817102 844590068 844471574 844344139 844079852 843784034 843612432 843537092 843392730
2039.6 843392730 843167543 843007624 842903674 842700064 842445135 842327118 842326939 842229664 842014313 841878653
2060 841878653 841832161 841728747 841566622 841461182 841410220 841304541 841133416 841039658 841082931 841107130 840995431
2082.4 840995431 840858221 840822995 840802550 840700984 840616107 840628147 840634823 840565979 840519667 840579033 840650916
2104.8 840650916 840611935 840529144 840535939 840593636 840577900 840543330 840611339 840708792 840730250 840753973 840850830 840946972
2129.3 840946972 840991437 841042638 841148853 841270030 841361761 841437757 841545582 841666281 841740072 841785967 841887712
2151.7H41887712J70172J41799P4446R3818J71423J53184M9949L7729J47462K21908
2172.1H43149602J77622J09494J06990J34290J10805O3121Q0705J43766J23143K6703
2192.5H44226241K7359J10387J09137M7504L7551O9797O6400M649M769J11997J26302
2215H44942093o855m8577O9558J25885J371j07348j4663Q2016J312n6267L6240R8645
2239.4H45123410L457r9063k7656R3698J5438j41144r1016M8816K9922q2791p4148
2261.9H44798923N2392O3121p4446p3910R0719Q9824n2035l159J76609J60932J6868
2284.3H45245838J2100J05441R8764j7643n4717K5034P2480N781m5895O0320J32799
2306.7H45640302J2159n2512O8844J10745n4359j74046m8160J64210J82212j9670j10388
$$ plain form
2151.7 841887712 842057884 842199683 842274129 842367947 842539370 842692554 842742503 842780232 842927694 843149602
2172.1 843149602 843327224 843436718 843543708 843677998 843788803 843851924 843932629 844076395 844199538 844226241
2192.5 844226241 844253600 844363987 844473124 844520628 844558179 844627976 844694376 844699025 844703794 844815791 844942093
2215 844942093 844935238 844886661 844956219 845082104 845083475 844976127 844961464 845043480 845044792 844988525 845024765 845123410
2239.4 845123410 845126867 845027804 845000148 845093846 845109284 844968140 844877124 844925940 844955862 844873071 844798923
2261.9 844798923 844851315 844914436 844839990 844766080 844856799 844946623 844894588 844891429 845068038 845228970 845245838
2284.3 845245838 845257938 845363379 845462143 845444500 845389783 845414817 845487297 845493078 845447183 845507503 845640302
2306.7 845640302 845652461 845599949 845668793 845779538 845725179 845551133 845502973 845667183 845849395 845829725 845719337
2329.2H45719337O5566J65641Q7798Q1837J17182J3709r2089J46151M46021L08335
2349.6H47059488l6239k09868j26362K9683L1948p8857L3260K62618K86638K71798
2370H47524107L75747M12345L31164K95102L58522L82006K63691J23382J11818J67370
2390.4H50345254J47402M3035k623O7830J04428L0100k1160J3590O0022O3181J192
2412.8H50852251l0637M888j8656q3208n5612J2339j5438p2360m2439K4319N722r3877
2437.3H50487292j21415k1756K6107q6546j70886r3162j729n3584j35482p1048J8417
2459.7H49776208n3763j63376j10448r477n2452j62005j38760m2140r6262j89722j18196
2482.1H48639607k0086o1870j73271j59382p689j848j64032j78933n9724o4731j90079
$$ plain form
2329.2 845719337 845784903 845950544 846038342 846120179 846237361 846251070 846158981 846305132 846751153 847059488
2349.6 847059488 847023249 846813381 846687019 846716702 846748650 846669793 846703053 846965671 847252309 847524107
2370 847524107 847899854 848312199 848643363 848938465 849296987 849678993 849942684 850066066 850177884 850345254
2390.4 850345254 850492656 850535691 850533068 850600898 850705326 850735426 850714266 850727856 850787878 850851059 850852251
2412.8 850852251 850821614 850826502 850807846 850724638 850669026 850681365 850665927 850593567 850551128 850575447 850581169 850487292
2437.3 850487292 850365877 850344121 850370228 850283682 850112796 850019634 850017905 849964321 849828839 849757791 849776208
2459.7 849776208 849722445 849559069 849448621 849439144 849386692 849224687 849085927 849043787 848947525 848757803 848639607
2482.1 848639607 848619521 848557651 848384380 848224998 848217309 848215461 848051429 847872496 847812772 847748041 847557962
2504.6H47557962k01225o5208k0087j14858j45673m8221j8060j46389k10345r3519
2525H46494377j1921q3208j46628r3162o6340j62661k17557j25289l3438r5963k02179
2547.4H45256031j55926m6432r4831k30730k08378m8935k2948j71482k26021j24335
2567.8H43926013r6977k16604k80559j88112j42336k72751l41415k07961j44183k69473
2588.2H41765642l37779k47956k11060l41952m10854k92004k31206l46541m61817m28260
2608.6H38456213l29971l70502m69864l97920k72870l23117m40002m27723l44932l64065
2629H34715247m40955m04060l15070l21746m21822m68373l67165k98560l94940m49836
2649.4H30832720l61502l20316l68416l93570l54647l01898l28838l96312l81171l40045
$$ plain form
2504.6 847557962 847356737 847291529 847271442 847156584 847010911 846962690 846944630 846798241 846587896 846494377
2525 846494377 846482456 846399248 846252620 846159458 846093118 845930457 845712900 845587611 845554173 845458210 845256031
2547.4 845256031 845100105 845053673 844958842 844728112 844519734 844470799 844447851 844276369 844050348 843926013
2567.8 843926013 843829036 843612432 843331873 843143761 843001425 842728674 842387259 842179298 842035115 841765642
2588.2 841765642 841427863 841179907 840968847 840626895 840216041 839924037 839692831 839346290 838884473 838456213
2608.6 838456213 838126242 837755740 837285876 836887956 836615086 836291969 835851967 835424244 835079312 834715247
2629 834715247 834274292 833870232 833555162 833233416 832811594 832343221 831976056 831677496 831282556 830832720
2649.4 830832720 830471218 830150902 829782486 829388916 829034269 828732371 828403533 828007221 827626050 827286005
2669.8H27286005l73125l65019k69234k52187l61920m65274m61757m11272l92318l88860
2690.2H23545039l95596l93331l94166m54903m91797m41552m29749m78208m75943m36008
2710.6H19153786m52042n23388n31674m53651m09841m32492m43279m50194m98295n36263
2731H14422667n32031m89891m49001m58301m79817m59909m10915l97980m49538n29468
2751.4H09765816n69225n17487m44591m73976n62489o01411n93186n57899n19395n02944
2771.8H04423213n65946p15554p74503p07864o49810o36161o64353o81698o94275p84993
2792.2G97548056q50261q15451q14676q70526q94308q93056q98064r31501j008034
2810.5G89572179j056552j017630j009106j098514j109183j040876j094103j212835
$$ plain form
2669.8 827286005 826912880 826547861 826278627 826026440 825664520 825199246 824737489 824326217 823933899 823545039
2690.2 823545039 823149443 822756112 822361946 821907043 821415246 820973694 820543945 820065737 819589794 819153786
2710.6 819153786 818701744 818178356 817646682 817193031 816783190 816350698 815907419 815457225 814958930 814422667
2731 814422667 813890636 813400745 812951744 812493443 812013626 811553717 811142802 810744822 810295284 809765816
2751.4 809765816 809196591 808679104 808234513 807760537 807198048 806596637 806003451 805445552 804926157 804423213
2771.8 804423213 803857267 803141713 802367210 801659346 801009536 800373375 799709022 799027324 798333049 797548056
2792.2 797548056 796697795 795882344 795067668 794197142 793302834 792409778 791511714 790580213 789572179
2810.5 789572179 788515627 787497997 786488891 785390377 784281194 783240318 782146215 780933380
2826.8G80933380j264214j284719j353264j503050j702368j978219k417505k952456
2843.1G66477585l420770l579855l155768k276838j434565r08553o69360p18415j042307
2861.5G49271154j419067j728773k022326k153933j973808j678646j501977j377106
2877.8G35415518j176655j020312j072049j233161j319587j321197j347005j433730
2894.1G25491822j528919j579821j601458j693368j841485j974344k167643k492725
2910.4G10612059k893031l128409k979935k553641k047599j486599r47237n06520j48535
2928.8F93920553M7624J92821N20706R68158J373768J707316J866400J701176J326382
2947.2G03624904R90808P03812K98261n7816o2287J30117K57373L33726M27783M91619
$$ plain form
2826.8 780933380 779669166 778384447 777031183 775528133 773825765 771847546 769430041 766477585
2843.1 766477585 763056815 759476960 756321192 754044354 752609789 751701236 751031876 750313461 749271154
2861.5 749271154 747852087 746123314 744100988 741947055 739973247 738294601 736792624 735415518
2877.8 735415518 734238863 733218551 732146502 730913341 729593754 728272557 726925552 725491822
2894.1 725491822 723962903 722383082 720781624 719088256 717246771 715272427 713104784 710612059
2910.4 710612059 707719028 704590619 701610684 699057043 697009444 695522845 694575608 694069088 693920553
2928.8 693920553 693968177 694160998 694681704 695649862 697023630 698730946 700597346 702298522 703624904
2947.2 703624904 704615712 705319524 705617785 705559969 705497682 705627799 705885172 706218898 706646681 707138300
2967.6G07138300M79102M61698M90069N18560N49853N66721M87805L92437M04298M53412
2987.9G11942255M84288M05491P2538k59161m19974n58138o40928p11382p63595o13749
3008.3G08937645m59611o20485r30846j069068j084149j170636j231730j196861j198053
3026.7F99976206j204372j160681j157403j287460j411617j349807j268923j379669
3043F89756274j604497j712740j632869j576006j639665j666128j634002j594424j541376
3061.4F75154567j476169j396477j420975j570821j626610j502753j345217j319945
3077.7F63495600j428306j520991j554668j606703j649201j628637j606703j630068
3094F50870323j650750j618743j646817j770079j791716j665771j594305j750350j882493
$$ plain form
2967.6 707138300 707617402 708079100 708569169 709087729 709637582 710204303 710692108 711084545 711488843 711942255
2987.9 711942255 712426543 712832034 712904572 712645411 712225437 711667299 711026371 710314989 709551394 708937645
3008.3 708937645 708478034 707857549 706926703 705857635 704773486 703602850 702371120 701174259 699976206
3026.7 699976206 698771834 697611153 696453750 695166290 693754673 692404866 691135943 689756274
3043 689756274 688151777 686439037 684806168 683230162 681590497 679924369 678290367 676695943 675154567
3061.4 675154567 673678398 672281921 670860946 669290125 667663515 666160762 664815545 663495600
3077.7 663495600 662067294 660546303 658991635 657384932 655735731 654107094 652500391 650870323
3094 650870323 649219573 647600830 645954013 644183934 642392218 640726447 639132142 637381792 635499299
3112.4F35499299j779199j724184j851618k067625k211273k147734k014339j989603
3128.7F19713724k151490k328276k212763j999974k079189k328038k403140k339602
3145F01871252k330124k268255k151609k267420k520084k531469k399922k411782k508223
3163.4E80482364k531350k517998k524972k486706k431273k488256k585530k529979
3179.7E60386300k442717k477110k511203k490759k483726k506375k545536k530097
3196E40398777k449513k448976k499461k462387k353072k291322k290666k285481k287507
3214.3E19030392k268255k246379k278865k296090k256870k246738k204597k040744
3230.7E01191854j950174k057493k144933k091258k014131j910895j798421j799643
$$ plain form
3112.4 635499299 633720100 631995916 630144298 628076673 625865400 623717666 621703327 619713724
3128.7 619713724 617562234 615233958 613021195 611021221 608942032 606613994 604210854 601871252
3145 601871252 599541128 597272873 595121264 592853844 590333760 587802291 585402369 582990587 580482364
3163.4 580482364 577951014 575433016 572908044 570421338 567990065 565501809 562916279 560386300
3179.7 560386300 557943583 555466473 552955270 550464511 547980785 545474410 542928874 540398777
3196 540398777 537949264 535500288 533000827 530538440 528185368 525894046 523603380 521317899 519030392
3214.3 519030392 516762137 514515758 512236893 509940803 507683933 505437195 503232598 501191854
3230.7 501191854 499241680 497184187 495039254 492947996 490933865 489022970 487224549 485424906
3247D85424906j903385j925081j785189j673639j737296j837075j797348j711041j679242
3265.3D69375610j607895j528143j606644j731574j766861j780450j741558j666427
3281.6D55946058j630038j635730j658082j620472j575738j660913j805276j863211
3298D42496598j804441j675159j590252j667708j857013k010017k054066j972675j892626
3316.3D25972641j938463j970470j867592j814038j969933k119213k081275j993746
3332.6D10217911j916885j825244j857459k012551k077997k049833j976520j891285
3348.9C94610137j981527k178669k189696j999616j842052j853704j872004j697450
3365.3C78995419j557857j742542k057970k053856j714588j452505j375526j373798
$$ plain form
3247 485424906 483521521 481596440 479811251 478137612 476400316 474563241 472765893 471054852 469375610
3265.3 469375610 467767715 466239572 464632928 462901354 461134493 459354043 457612485 455946058
3281.6 455946058 454316020 452680290 451022208 449401736 447825998 446165085 444359809 442496598
3298 442496598 440692157 439016998 437426746 435759038 433902025 431892008 429837942 427865267 425972641
3316.3 425972641 424034178 422063708 420196116 418382078 416412145 414292932 412211657 410217911
3332.6 410217911 408301026 406475782 404618323 402605772 400527775 398477942 396501422 394610137
3348.9 394610137 392628610 390449941 388260245 386260629 384418577 382564873 380692869 378995419
3365.3 378995419 377437562 375695020 373637050 371583194 369868606 368416101 367040575 365666777
3381.6C65666777j328528j137167q29578n73098o41793r31561q98898m93288k97099
3399.9C58535767n74053q70108o98775l48032k04265j84476k25634k48939j08927O3747
3420.3C55136305J37538K73645N16861O92428P01487P88360R61930Q56489N79387N97030
3440.7C61241460Q89927J154035J292706J307517J373112J483232J585782J795619
3457C72123390J978636J858294J761824K101600K398461K094150J563758J549691J947850
3475.4C89377654K341181K412080K110333K002984K259940K333820K204358K299995
3491.7D07342345K498507K572209K488643K456903K522171K384364K206832K375037
3508D26847011K723694K938211K822756K556980K599239K887279L168106L081829K758294
$$ plain form
3381.6 365666777 364338249 363201082 362371504 361798406 361156613 360225052 359326154 358832866 358535767
3399.9 358535767 357961714 357091606 356392831 356044799 355840534 355656058 355430424 355181485 355072558 355136305
3420.3 355136305 355273843 355547488 356064349 356756777 357458264 358246624 359208554 360065043 360644430 361241460
3440.7 361241460 362131387 363285422 364578128 365885645 367258757 368741989 370327771 372123390
3457 372123390 374102026 375960320 377722144 379823744 382222205 384316355 385880113 387429804 389377654
3475.4 389377654 391718835 394130915 396241248 398244232 400504172 402837992 405042350 407342345
3491.7 407342345 409840852 412413061 414901704 417358607 419880778 422265142 424471974 426847011
3508 426847011 429570705 432508916 435331672 437888652 440487891 443375170 446543276 449625105 452383399
3526.4D52383399K763987K982467L147364L336548L397078L256678L383369L679275
3542.7D78330165L694564L385157L190994L348619L580212L670991L759741L974379
3559E06934822M075765L815353L728151M452229M713535M178644M099667M425287M632771
3577.4E45056224M795134N000412M965961M833818M981756N036116M776716M920185
3593.7E84366322N305826N416811N435586N468130N226433M991353N361259N648255
3610F27219975N576193N591512N252898N316257N926788N488038M677594M363418N234837
3628.4F74647510O069660N121589M745662M771829M624367M673242M640818M242658
3644.7G13537335L997207M682183N019248L694951L028036L765404L859103L113329
$$ plain form
3526.4 452383399 455147386 458129853 461277217 464613765 468010843 471267521 474650890 478330165
3542.7 478330165 482024729 485409886 488600880 491949499 495529711 499200702 502960443 506934822
3559 506934822 511010587 514825940 518554091 523006320 527719855 531898499 535998166 540423453 545056224
3577.4 545056224 549851358 554851770 559817731 564651549 569633305 574669421 579446137 584366322
3593.7 584366322 589672148 595088959 600524545 605992675 611219108 616210461 621571720 627219975
3610 627219975 632796168 638387680 643640578 648956835 654883623 660371661 665049255 669412673 674647510
3628.4 674647510 680717170 685838759 690584421 695356250 699980617 704653859 709294677 713537335
3644.7 713537335 717534542 722216725 727235973 730930924 733958960 737724364 741583467 744696796
3661G44696796K823830K815187K608120K759278L007471K173067J941084K320648K019226
3679.4G67164707J942039K060711J996040J990438J911521J506507J344323J375139
3695.7G81291425J279772J137316J215040J318694J159608R46641Q49068R64880J028359
3714G91190803R07779P93040O81877O42836O45399O78718O82831N99265O62923P87198
3734.4G98272669Q90971Q84354M44173n4895K33709O45280J80006J11699N67913N74828
3754.8H02750707L60727L92258N06640L36527K26975K16603J96338L40104M30048L52442
3775.2H06109369L07858L44276K71261J33932J51932J89721K14100L05832L31044L92318
3795.6H08751643L66866M4823J09017K34127p4923K9564L32296K85566J53601L66687
$$ plain form
3661 744696796 747520626 750335813 752943933 755703211 758710682 760883749 762824833 765145481 767164707
3679.4 767164707 769106746 771167457 773163497 775153935 777065456 778571963 779916286 781291425
3695.7 781291425 782571197 783708513 784923553 786242247 787401855 788348496 789197564 790162444 791190803
3714 791190803 792098582 792891622 793573499 794216335 794861734 795540452 796223283 796822548 797485471 798272669
3734.4 798272669 799163640 800047994 800492167 800437272 800670981 801316261 801496267 801607966 802175879 802750707
3754.8 802750707 803111434 803503692 804010332 804346859 804573834 804790437 804986775 805326879 805756927 806109369
3775.2 806109369 806417227 806761503 807032764 807166696 807318628 807508349 807722449 808028281 808359325 808751643
3795.6 808751643 809118509 809163332 809272349 809506476 809431553 809461117 809793413 810078979 810232580 810599267
3816H10599267L57688j52648r0539J51157J47462J27197O9737K02119L48032J47104
3836.4H11906576j16348j25349n7459J24574L18051K66730j20163m44412K0504L29554
3856.8H12102258J88768M5538n8412M3034L4630j17182K563J47164K03788Q6784m8160
3879.2H12630773Q0466R8467J55627J31011j91688j76370P9632N7935o7174j07467
3899.6H12691212j39118j07228M0769L7611j7703M2498M3214k3008J3292N5909k0027
3922.1H12617421k7895Q9050R6499o437j4782L5167J1861l6955p6890o258J22189J03295
3946.5H12906265N1856K3008k3127K0266R6202P4863J6928k4021m9114M649J00553
3969H13198328J14322N0127O7950J46448Q2553J7523J03653J16527j3650p1108L8326
$$ plain form
3816 810599267 810956955 810804307 810713768 810864925 811012387 811139584 811209321 811411440 811759472 811906576
3836.4 811906576 811790228 811664879 811607420 811731994 812050045 812316775 812196612 811752200 811772704 812102258
3856.8 812102258 812291026 812336564 812278152 812321186 812355816 812238634 812241197 812388361 812592149 812678933 812630773
3879.2 812630773 812711239 812809706 812965333 813096344 812904656 812728286 812807918 812865853 812798679 812691212
3899.6 812691212 812552094 812444866 812485635 812523246 812505543 812548041 812591255 812568247 812581539 812637448 812617421
3922.1 812617421 812589526 812678576 812775075 812768638 812753856 812789023 812800884 812763929 812687039 812680781 812802970 812906265
3946.5 812906265 812958121 812981129 812958002 812978268 813074470 813149333 813166261 813142240 813093126 813097775 813198328
3969 813198328 813312650 813362777 813430727 813577175 813659728 813677251 813780904 813897431 813883781 813812673 813850999
3991.4H13850999J41978J20282O9917
3997.5H14183176
$$ plain form
3991.4 813850999 813992977 814113259 814183176
3997.5 814183176
##END=$$ End of the data block
