##TITLE=$$ Begin of the data block
##JCAMP-DX=5.00 $$ ACD/SpecManager v 10.08
##SPECTROMETER/DATA SYSTEM=Alpha
##DATE=09 Apr 2014 11:14:46
##DATA TYPE=INFRARED SPECTRUM
##DATA CLASS=XYDATA
##ORIGIN=
##OWNER=
##NPOINTS=1765
##FIRSTX=399.75695801
##LASTX=3997.56933594
##MAXX=3997.56933594
##MINX=399.75695801
##MAXY=0.85135812
##MINY=0.35516626
##XFACTOR=1.0000000000
##YFACTOR=1.000000000000000e-9
##FIRSTY=0.64660740
##DELTAX=2.03957629
##XUNITS=1/CM
##YUNITS=ARBITRARY UNITS
##XYDATA=(X++(Y..Y))
399.8F46607399j456976j730621p12752o34968j756549j488626R2566Q7499j668155
418.1F37338817j592278M61816O56188l22700l41653M01616n0903j328885j171947
436.5F34050071J8180K8789o88732n41031J37329L2067n53310k12192N29348p0810
456.9F32729709j283347r51410N5194j22666j225353j203954j89781k33531j095355
475.2F26479506j152575k70843R2089p44343r34541J35660K24352j057505j455307
493.6F21316493n35012k15292r08613j069903k92301k01643j071393j299978m55916
511.9F15266442j26481j038730j591623p94351l17275j086772j676500j035511n42164
530.3F07057035j164138j574695p91550j44005p35462j239001m85659J25289p38025
$$ plain form
399.8 646607399 645150423 643419802 642707050 642072082 640315533 638826907 638919473 639006972 637338817
418.1 637338817 635746539 636208355 636864543 636541843 636200190 636601806 636550903 635222018 634050071
436.5 634050071 634068251 634097040 633408308 632867277 633004606 633036673 632483363 632271171 632800519 632729709
456.9 632729709 631446362 630494952 630550146 630427480 629202127 627998173 627808392 627574861 626479506
475.2 626479506 625326931 625056088 625148177 624403834 623469293 623604953 623829305 622771800 621316493
493.6 621316493 620781481 620566189 619657576 618587673 618295372 618093729 617022336 615722358 615266442
511.9 615266442 615139961 614101231 612509608 611715257 611397982 610311210 608634710 607599199 607057035
530.3 607057035 605892897 604318202 603526652 603382647 602647185 601408184 600922525 601047814 600309789
548.6F00309789j505375p29441l6538r74119j877904j162707m80175j196802k036572
567E90310156j729011j180649j651466k273440j681149q31008j373530k198696j753390
585.4E75637817q78691r95457j700461j319170l39389p19547j816154j827955j185119
603.7E64855874j115501j317978p44105P7010J8298j03831J180112L025413L490805
622.1E69366097K885521K823055L462314L428817K658367K427876K699316K217531
638.4E91968894J062930N17964J062155J940608K065182J447021P42317J35481O29723
656.7F01572275K878308M781127M591287L084123K361715L252446K997101K173662
673.1F27692044K069413K363146K508282K082229J629055J708448J854956J541435
$$ plain form
548.6 600309789 598804414 598074973 598038435 597064316 595186412 594023705 593543530 592346728 590310156
567 590310156 588581145 587400496 585749030 583475590 581794441 580963433 579589903 577391207 575637817
585.4 575637817 574759126 573763669 572063208 570744038 570404649 569685102 567868948 566040993 564855874
603.7 564855874 563740373 562422395 561678290 561755300 561773598 561669767 562849879 565875292 569366097
622.1 569366097 572251618 575074673 578536987 581965804 584624171 587052047 589751363 591968894
638.4 591968894 593031824 593549788 594611943 596552551 598617733 600064754 600807071 600942552 601572275
656.7 601572275 604450583 609231710 613822997 616907120 619268835 622521281 625518382 627692044
673.1 627692044 629761457 632124603 634632885 636715114 638344169 640052617 641907573 643449008
689.4F43449008J088620R77516J126885R54986N88834P62165J348972J607835J398683
707.7F53303504J301289J701235K091587J901209J616478J849354K191186K000570
724F67956412J591921J585841J902819J831233J326621J194715J496852J492142J080871
742.4F81459427J119673J715601J840055J386225J366317J879990J966000J359641
758.7F94092929J099170J632213J782298J037658N34236R14156J021803O1512p44462
777.1G01431513n23091l62098j059592j536846o93559N76973J019537J440466K898812
795.4G03192115M476547M762888M283369M525005M991055M208982K795577K441823
811.7G35677361K714754J893520K81274l97205m14252j489759l254175l804445l257692
$$ plain form
689.4 643449008 644537628 645515144 646642029 647597015 648185849 648948014 650296986 651904821 653303504
707.7 653303504 654604793 656306028 658397615 660298824 661915302 663764656 665955842 667956412
724 667956412 669548333 671134174 673036993 674868226 676194847 677389562 678886414 680378556 681459427
742.4 681459427 682579100 684294701 686134756 687520981 688887298 690767288 692733288 694092929
758.7 694092929 695192099 696824312 698606610 699644268 700178504 701092660 702114463 702175975 701431513
777.1 701431513 700908422 700546324 699486732 697949886 697256327 697833300 698852837 700293303 703192115
795.4 703192115 707668662 712431550 716714919 721239924 726230979 730439961 733235538 735677361
811.7 735677361 738392115 740285635 740566909 740169704 739755452 738265693 735011518 731207073 727949381
830.1G27949381l303170m010082l930807k932489k581119l141940k990603j591862
846.4G03467309k34127O26266K125264M605293O565809P075191P293462P984460Q071542
864.8G47580469O819427N363941M820645M388511L098488J764774J409173J087427
881.1G76332855l36826j797020j975358j682043k115070k450645j450479Q3088P86066
899.4G65394568R50873J479328K026737J607537M57764l29554p91371j828552l215491
917.8G65751839l773570l317297k671301k012611q78334M56274J061439P52390L86238
936.2G55755067M60207L84033k00570p23481q30590j050055j881481k903223l602981
954.5G45406926m299939n409300o686569p736384q690060r905755j1088848j1486113
$$ plain form
830.1 727949381 724646211 720636129 716705322 713772833 711191714 708049774 705059171 703467309
846.4 703467309 703233182 703859448 705984712 710590005 717155814 724231005 731524467 739508927 747580469
864.8 747580469 754399896 759763837 764584482 768972993 772071481 773836255 775245428 776332855
881.1 776332855 775996029 774199009 772223651 770541608 768426538 765975893 764525414 764608502 765394568
899.4 765394568 766345441 767824769 769851506 771459043 771916807 771587253 770795882 768967330 765751839
917.8 765751839 761978269 758660972 755989671 753977060 753098726 753555000 754616439 755368829 755755067
936.2 755755067 756215274 756599307 756398737 755675256 754844666 753794611 751913130 749009907 745406926
954.5 745406926 741106987 735697687 729011118 721274734 712584674 702678919 691590071 680103958
970.8F80103958j0960758r916484q618057p221401n904555m899800m365921m025459
987.1F24191523l518105k923250k497733k216339j811445j318931j094163j217544
1003.5F07594013j502096j980722k815962l755689m299045m394471m336953m276157
1019.8E80232918m103183l735364l444016l442287l383100k952338k439379k160788
1036.1E54572463j981735j676738j414896j494884j758039j815975j656592j480043
1052.4E41293561j115024k41577Q61764J418113J216114O77347n1439j096964k191066
1070.8E40770829k765358k752959k692342k855897k937377k838611k942503l382861
1087.1E17602921l622413l190220k303719j379788m49061N08248J101733J095593Q48174
$$ plain form
970.8 680103958 669143200 659226716 650608659 643387258 637482703 632582903 628216982 624191523
987.1 624191523 620673418 617750168 615252435 613036096 611224651 609905720 608811557 607594013
1003.5 607594013 606091917 604111195 601295233 597539544 593240499 588846028 584509075 580232918
1019.8 580232918 576129735 572394371 568950355 565508068 562124968 559172630 556733251 554572463
1036.1 554572463 552590728 550913990 549499094 548004210 546246171 544430196 542773604 541293561
1052.4 541293561 540178537 539936960 540798724 542216837 543432951 544110298 544058859 542961895 540770829
1070.8 540770829 538005471 535252512 532560170 529704273 526766896 523928285 520985782 517602921
1087.1 517602921 513980508 510790288 508486569 507106781 506657720 507165968 508267701 509363294 510211468
1105.4E10211468P34448N51224J5438p17640j484335k504051l813207m432291l250271
1123.8D95310783j046568M57376J128912J277537R43660R45688J666933K529323K955675
1142.2E06169319K764046K238274J838326J706183J641691J567304J747072K279043
1158.5E21951258K912879L579259M455328N503237O344796O731987O826162O827176
1174.8E65132082O654739O218612N628944N015492M261672L179491J919866P66515
1191.1E98777413j42932p36057q70943m31717M06861J232982J757562J960576J858830
1209.5F03812575J443684R09985N08427K76625J88530K00510K63870M08947O29544
1227.8F08642697Q49486J044273J248598J450300J611233J669884J578748J398921
$$ plain form
1105.4 510211468 510945916 511497140 511512578 510794938 509310603 506806552 502993345 498561054 495310783
1123.8 495310783 494264215 494721591 495850503 497128040 498071700 499017388 500684321 503213644 506169319
1142.2 506169319 508933365 511171639 513009965 514716148 516357839 517925143 519672215 521951258
1158.5 521951258 524864137 528443396 532898724 538401961 544746757 551478744 558304906 565132082
1174.8 565132082 571786821 578005433 583634377 588649869 592911541 596091032 598010898 598777413
1191.1 598777413 598634481 597898424 597027481 596595764 597002625 598235607 599993169 601953745 603812575
1209.5 603812575 605256259 606166244 606674671 606951296 607139826 607340336 607604206 608013153 608642697
1227.8 608642697 609492183 610536456 611785054 613235354 614846587 616516471 618095219 619494140
1244.1F19494140J187682R10521N47349K73884K46286L44455M67480P23838J211763
1262.5F25407398J801312K279877K670646L161132L621877L787577L845930M058599
1278.8F50634348M274071M294455M257977M407286M595995M460156M079879L825485
1295.1F84829652L705383L351926K770663K414524K316535K031028J515269J230657
1311.4G04165637J228810J083851Q14736Q51690J192809J361608J250803J222492J317739
1329.8G14490175J113057N64993K21371K61128K59340Q3864J54614N41747P41899M88579
1350.2G18920767K32041K97427K81096r0718m76242o71923q34942j119792j338363
1368.5G15199351j090288q63671j332939j913845k366543l371656m016161k538264
$$ plain form
1244.1 619494140 620681822 621592343 622139692 622413576 622659862 623004317 623471797 624195635 625407398
1262.5 625407398 627208710 629488587 632159233 635320365 638942242 642729819 646575749 650634348
1278.8 650634348 654908419 659202874 663460851 667868137 672464132 676924288 681004167 684829652
1295.1 684829652 688535035 691886961 694657624 697072148 699388683 701419711 702934980 704165637
1311.4 704165637 705394447 706478298 707293034 708144724 709337533 710699141 711949944 713172436 714490175
1329.8 714490175 715603232 716168225 716389596 716650724 716910064 716993928 717148542 717690289 718432188 718920767
1350.2 718920767 719152808 719450235 719731331 719640613 719164371 718492448 717657506 716537714 715199351
1368.5 715199351 714109063 713245392 711912453 709998608 707632065 704260409 700244248 697705984
1384.9F97705984Q0943J024902K15650o25909j161098j486004k076923k531648k536118
1403.2F88609779k589882k545833k401352k108157j508057j037121j135528j352370
1419.5F73931479q36849m25398m79460l78907j00374J16289K67625N15163R12904J046718
1439.9F74569190J104176J293778J717389K186417K378524K548039L091692M686535
1456.2F93575740O066441M742265M289687N253136N493999M799664N284488O974995
1472.6G36480415O644130M805028L905475L391445K716124J869976J261712M65273
1488.9G61539578o38663j060546j284897k085507k813518k716005k223670k742291
1505.2G45974481n494714n643725m212380l800213l534317l237784k675831k724230
$$ plain form
1384.9 697705984 697786927 698811829 699027479 698401570 697240472 695754468 693677545 691145897 688609779
1403.2 688609779 686019897 683474064 681072712 678964555 677456498 676419377 675283849 673931479
1419.5 673931479 673094630 672669232 672189772 671810865 671710491 671826780 672094405 672609568 673522472 674569190
1439.9 674569190 675673366 676967144 678684533 680870950 683249474 685797513 688889205 693575740
1456.2 693575740 699642181 704384446 708674133 713927269 719421268 724220932 729505420 736480415
1472.6 736480415 743124545 747929573 751835048 755226493 757942617 759812593 761074305 761539578
1488.9 761539578 760900915 759840369 758555472 756469965 753656447 750940442 748716772 745974481
1505.2 745974481 740479767 734836042 730623662 726823449 723289132 720051348 717375517 714651287
1521.5G14651287k785504k585352k618849k071798j811623k216757j766681j002670
1537.8F97792053j303673j755297j133322m19796J82092N68927Q60095J218736J417756
1556.2F97427571J060366P4387l13044n37633r58145j780629k812445k793551l222704
1574.5F86144173n106687n231798m602134n110741n598068n817414n960881o128371
1590.9F42588079o251633o366432o269157o048202o012380o001890n791247n701065
1607.2E94146073n910516n752921n164564n535543o637632n202473m086375m695237
1623.5E51160812m591584m023552l495753k404153j661479j634360r63866J16169R14514
1641.8E33416748J549900K465665L135443K563476L172159N065859L988445L493011
$$ plain form
1521.5 714651287 711865783 709280431 706661582 704589784 702778161 700561404 698794723 697792053
1537.8 697792053 696488380 694733083 693599761 693179965 693362057 693930984 694791079 696009815 697427571
1556.2 697427571 698487937 698562324 698249280 697711647 696753502 694972873 692160428 689366877 686144173
1574.5 686144173 681037486 675805688 671203554 666092813 660494745 654677331 648716450 642588079
1590.9 642588079 636336446 629970014 623700857 617652655 611640275 605638385 599847138 594146073
1607.2 594146073 588235557 582482636 577318072 571782529 565144897 559942424 555856049 551160812
1623.5 551160812 546569228 542545676 539049923 536645770 534984291 533349931 532386065 532502234 533416748
1641.8 533416748 534966648 537432313 540567756 543131232 546303391 551369250 555357695 558850706
1658.2E58850706M350006N495727N871237N209505N850315P064939O270587O372214
1674.5F05335236P183671O583631O213486P182777R466290Q182407O682574P159651
1690.8F63989723O755173P577538Q831919Q695900R811998Q123934O803632O880819
1707.1G27470636N826295N128920M898310M761993M841269M049181L024757K865851
1723.4G62867212L037155L026605L102004K940238L069639L087044K521455K662957
1739.7G86314309K891838K870739K905667K835512K746939K649784K251864K032697
1756.1H07499349J995504J872599J858950J608908J389146J516998J554370J283228
1772.4H20579052J020372J019895J167655J148343R76145R97842J147091J106203R69886
$$ plain form
1658.2 558850706 563200712 568696439 574567676 579777181 585627496 592692435 598963022 605335236
1674.5 605335236 612518907 619102538 625316024 632498801 641965091 650147498 656830072 663989723
1690.8 663989723 670744896 678322434 687154353 695850253 705662251 713786185 720589817 727470636
1707.1 727470636 733296931 738425851 743324161 748086154 752927423 756976604 760001361 762867212
1723.4 762867212 765904367 768930972 772032976 774973214 778042853 781129897 783651352 786314309
1739.7 786314309 789206147 792076886 794982553 797818065 800565004 803214788 805466652 807499349
1756.1 807499349 809494853 811367452 813226402 814835310 816224456 817741454 819295824 820579052
1772.4 820579052 821599424 822619319 823786974 824935317 825911462 826909304 828056395 829162598 830132484
1790.7H30132484R91524R51230Q38518P60675P49111P58886O92547O20901O43015O86228
1811.1H37825119N62907M38690M62949N59867N70953N19692N42462N96941M88102K58804
1831.5H42826486K39610L83795M34696L67344L68476M27961L80933K25365J92345K87294
1851.9H46134305L34740K80201K17557K71499L36707L40938L14832K53201J62959R9301
1872.3H48746240J05620J68502K18451J77085J22786J78814K51710J55926J4544N5730
1892.7H50195408J56462J21892J8537L8325J49906J83702R0479K9505R4890J17123
1913.1H51196229K8551q821P1406P0751m9174q7857r358L1590l8266q9228k1517L5107
1937.6H51129413k3723r9242j04069r4474j45197j78575j20223p6055j47164k22624
$$ plain form
1790.7 830132484 831124008 832075238 832913756 833674431 834423542 835182428 835874975 836495876 837138891 837825119
1811.1 837825119 838388026 838826716 839289665 839849532 840420485 840940177 841482639 842079580 842567682 842826486
1831.5 842826486 843066096 843449891 843884587 844251931 844620407 845048368 845429301 845654666 845847011 846134305
1851.9 846134305 846469045 846749246 846966803 847238302 847575009 847915947 848230779 848483980 848646939 848746240
1872.3 848746240 848851860 849020362 849238813 849415898 849538684 849717498 849969208 850125134 850139678 850195408
1892.7 850195408 850351870 850473762 850492299 850530624 850680530 850864232 850954711 850984216 851079106 851196229
1913.1 851196229 851224780 851215959 851287365 851358116 851308942 851221085 851211727 851243317 851205051 851115823 851094306 851129413
1937.6 851129413 851105690 851006448 850902379 850807905 850662708 850484133 850363910 850287855 850140691 849918067
1958H49918067j45912l2901p6890k17617k25425r7513r7096k11239j77622n2094r5606
1980.4H48488152k10047j64330k9266m2915k02537k63273j58906j11938k24232k56002
2000.8H46824706j24753q8870k16544k58625j48058j02758k03311k63036j81496j60754
2021.2H45076501k56300k34425r5963j16289k53141k67088j53363q5175j58489k41160
2041.6H43215108j88530j02996j52409k02120j09970n1082j46210j94192r4592l9697
2062H41933310j31845k10286j24216m1663r6977j43886n8114M7922O735j09374j03534
2084.4H40968072j5020m0293j37567j01269K6525K0265o8128m1306O0201N9306m7445
2106.9H40683341p5579K5392O9201l2067p4149L3737J08897N4896K3067R0420J17064
$$ plain form
1958 849918067 849772155 849739254 849662364 849444747 849219322 849121809 849024713 848813474 848635852 848583758 848488152
1980.4 848488152 848278105 848113775 848084509 848041594 847839057 847575784 847416878 847304940 847080708 846824706
2000.8 846824706 846699953 846611083 846394539 846135914 845987856 845885098 845681787 845418751 845237255 845076501
2021.2 845076501 844820201 844585776 844489813 844373524 844120383 843853295 843699932 843614757 843456268 843215108
2041.6 843215108 843026578 842923582 842771173 842569053 842459083 842408001 842261791 842067599 841973007 841933310
2062 841933310 841801465 841591179 841466963 841425300 841328323 841184437 841126323 841174245 841180980 841071606 840968072
2084.4 840968072 840953052 840912759 840775192 840673923 840700448 840720713 840652585 840611279 840671480 840730786 840683341
2106.9 840683341 840607762 840633154 840702355 840670288 840596139 840629876 840738773 840793669 840816736 840907156 841024220
2129.3H41024220O0797L9637R1493J28865R2328M1067Q8454J57118J04606K9444Q3208
2151.7H41941237J69814J42813P5459Q3268J57952J70768R0241O5565J47164K01285
2172.1H43245566J47819Q0645R0004J41859J33514Q0585J07766J56104Q4877N782M3392
2194.6H44317913J15752J21534O5148L6538Q7917R7394P74k2709P1049R9182J8239
2217H45008731q822O5744Q5235l219n8293J6689O9142j2637n6386L1710Q3447j9610
2241.5H45201731j12117k8431Q7976J6928j16944o2585N3287M112r9957n8233M7028
2263.9H44932795K4199o3658o616J24335P1764o2167J669J67787J55866L576m1723
2286.3H45307827P7665J22785j2278o1512N0127J09435L3378j7881N2392N0128o5387
$$ plain form
2129.3 841024220 841085017 841124654 841216147 841345012 841437340 841478407 841566861 841723979 841828585 841858029 841941237
2151.7 841941237 842111051 842253864 842329323 842412591 842570543 842741311 842831552 842897117 843044281 843245566
2172.1 843245566 843393385 843474030 843564034 843705893 843839407 843919992 844027758 844183862 844268739 844274521 844317913
2194.6 844317913 844433665 844555199 844620347 844656885 844744802 844842196 844842970 844820261 844891310 844990492 845008731
2217 845008731 844999909 845065653 845150888 845147669 845089376 845106065 845175207 845162570 845106184 845137894 845221341 845201731
2241.5 845201731 845089614 845061183 845149159 845166087 845049143 844986558 845039845 845043957 844944000 844885767 844932795
2263.9 844932795 844956994 844893336 844886720 845011055 845082819 845020652 845022321 845190108 845345974 845349550 845307827
2286.3 845307827 845385492 845508277 845495999 845434487 845484614 845594049 845627427 845609546 845661938 845712066 845646679
2308.8H45646679n6862P9155J10387l5166j34945J8119J89245J00017r1791j20044
2329.2H45704794N8711K00390J17541J0609N5850N1558o318K31623M68612K73109n3585
2351.6H47112894j90914j35243l5762k325M7028J69397K08854K03729K62916L54111
2372H47994685L87728L45588L44694L95238L64423K33531J35303J35183J60813J36316
2392.4H50633502L3319j8477N9664R6977L0875Q940N8115P6890L7849k8491k5392L5227
2416.9H50998998O377p7784o8962l636j8656p6831o4552J5736J3709q4460r5546k0623
2441.3H50523770k0743j09791j21653k6405r418j04189j22487o438M8161q5890j97351
2463.8H49767566j09256l0398r4116j46329p9811j0311r6202k17736j60992j9491j9371
$$ plain form
2308.8 845646679 845589817 845668972 845779359 845744193 845609248 845627367 845816612 845916629 845824838 845704794
2329.2 845704794 845763505 845963895 846081436 846092045 846147895 846199453 846193135 846424758 846893370 847166479 847112894
2351.6 847112894 846921980 846786737 846750975 846748650 846795678 846965075 847173929 847377658 847640574 847994685
2372 847994685 848382413 848728001 849072695 849467933 849832356 850065887 850201190 850336373 850497186 850633502
2392.4 850633502 850666821 850648344 850708008 850804985 850835860 850844800 850902915 850979805 851017654 850989163 850963771 850998998
2416.9 850998998 851005375 850927591 850858629 850854993 850836337 850759506 850694954 850710690 850724399 850639939 850544393 850523770
2441.3 850523770 850503027 850393236 850271583 850245178 850235760 850131571 850009084 850002646 850050807 849964917 849767566
2463.8 849767566 849658310 849627912 849533796 849387467 849307656 849297345 849201143 848983407 848822415 848802924 848783553
2486.2H48783553j43469j67787n8591n4300j72198j66774l5762l4810j92403k04027
2506.6H47553432k3961K3246j31965k05457r2209l4272j40429j99198j01686j9908
2527H46627593q4937j67489j06692n0485j39058j87993p5578K622j18434k35141j54852
2549.4H45309556l6955q7202k22802k01464p7128r6858k11239k00569r1374r6262k34484
2571.9H43753219k77579j80423j79291k98262k93732j75416j83463l03924l43144k56479
2592.3H41261506j91510k77817l74496l25620k61724l31700m48346m30346l29673l58045
2612.7H37932229m54843m02331k83003l19898m22359l89695l12448l65614m74096m54962
2633.1H34052980l50237l42727m34696m53174l47615k86340l71337m35830l64720l15547
$$ plain form
2486.2 848783553 848640084 848472297 848413706 848359406 848187208 848020434 847984672 847949862 847757459 847553432
2506.6 847553432 847529471 847552717 847420752 847215295 847123086 847088814 846948385 846749187 846647501 846627593
2527 846627593 846542656 846375167 846268475 846217990 846078932 845890939 845815361 845817983 845699549 845464408 845309556
2549.4 845309556 845272601 845185399 844962597 844761133 844684005 844587147 844375908 844175339 844083965 843987703 843753219
2571.9 843753219 843475640 843295217 843115926 842817664 842523932 842348516 842165053 841861129 841517985 841261506
2592.3 841261506 841069996 840792179 840417683 840092063 839830339 839498639 839050293 838619947 838290274 837932229
2612.7 837932229 837477386 837075055 836792052 836472154 836049795 835660100 835347652 834982038 834507942 834052980
2633.1 834052980 833702743 833360016 832925320 832472146 832124531 831838191 831466854 831031024 830666304 830350757
2653.5H30350757l69132l99291l46065k99096l53098m25696l77119l00050l24964l63231
2673.9H26793015l41713l31402l69549m19259m16100l82245m01079m24982l95417l78430
2694.3H22932839m14311m53711m39346m15921m50730m95196m81248m31895m43697n12659
2714.6H18394125n20945m55082m13477m33743m54009m73916n18024n44548n27680m66526
2735H13586175m34577m77254n09561m42147l48508l64423m63009n52833n68867n21063
2755.4H08903933m89414n20170n85854o12080n78106n36262n31078n19395n20944o35565
2775.8H03375065p36177o96838o46710o61135o89745p00652p20501p85351q29160q02994
2796.2G96105802q04484q93712r78470r56297q67664q59917r75072j051068j002133
$$ plain form
2653.5 830350757 829981625 829582334 829236269 828937173 828584075 828158379 827781260 827481210 827156246 826793015
2673.9 826793015 826451302 826119900 825750351 825331092 824914992 824532747 824131668 823706686 823311269 822932839
2694.3 822932839 822518528 822064817 821625471 821209550 820758820 820263624 819782376 819350481 818906784 818394125
2714.6 818394125 817873180 817418098 817004621 816570878 816116869 815642953 815124929 814580381 814052701 813586175
2735 813586175 813151598 812674344 812164783 811722636 811374128 811009705 810546696 809993863 809424996 808903933
2755.4 808903933 808414519 807894349 807308495 806696415 806118309 805582047 805050969 804531574 804010630 803375065
2775.8 803375065 802638888 801942050 801295340 800634205 799944460 799243808 798523307 797737956 796908796 796105802
2796.2 796105802 795301318 794407606 793429136 792472839 791605175 790745258 789770186 788719118 787716985
2814.6G87716985r97365j083135j094461j080930j180232j291632j289845j221597
2830.9G78477788j266599j493752j743674j995921k391100k914965l425479l594577
2847.2G59651721l140808k260744j423598q99851o82890p64072j077533j426280j724958
2865.6G46250987j967728k061188j929045j712739j552165j382113j196026j062572
2881.9G33387411j047314j185119j307964j325309j380444j487553j562476j586855
2898.2G22504377j597523j683057j820326j942575k146244k512574k942621l161133
2914.5G04698324k979815k537310k020717j448333r07242n24283k35617j6689J94967
2932.9F94223285N62131J001060J397967J728595J870274J727999J359045R63092O52909
$$ plain form
2814.6 787716985 786719620 785636485 784542024 783461094 782280862 780989230 779699385 778477788
2830.9 778477788 777211189 775717437 773973763 771977842 769586742 766671777 763246298 759651721
2847.2 759651721 756510913 754250169 752826571 751926720 751243830 750479758 749402225 747975945 746250987
2865.6 746250987 744283259 742222071 740293026 738580287 737028122 735646009 734449983 733387411
2881.9 733387411 732340097 731154978 729847014 728521705 727141261 725653708 724091232 722504377
2898.2 722504377 720906854 719223797 717403471 715460896 713314652 710802078 707859457 704698324
2914.5 704698324 701718509 699181199 697160482 695712149 694804907 694280624 694045007 694028318 694223285
2932.9 694223285 694785416 695786476 697184443 698913038 700783312 702511311 703870356 704833448 705486357
2951.2G05486357K88606m8220n6803J69336L26991L44694L62933M48107M91500M91083
2971.6G08304584N03778N11110N31376N40673M67241L94225M26710M67837M71175L82125
2992G13000834O8009k32518l97980n64039o47843o95467p51495o58214n11110o09159
3012.4G08001018q99673j077354j109004j157701j191318j160502j174093j197159
3028.7F99034214j161098j137496j256465j434207j422525j316428j363158j559317
3045.1F88383520j690567j619756j534879j596272j665831j666725j622796j541555
3061.4F75445139j471519j430631j455426j555502j601637j508653j347244j280486
3077.7F63794041j408518j581609j623213j597226j574039j574874j636267j691520
$$ plain form
2951.2 705486357 705774963 705726743 705669940 705839276 706166267 706510961 706873894 707322001 707813501 708304584
2971.6 708304584 708808362 709319472 709850848 710391521 710858762 711252987 711679697 712147534 712618709 713000834
2992 713000834 713068843 712836325 712438345 711874306 711226463 710530996 709779501 709121287 708610177 708001018
3012.4 708001018 707101345 706023991 704914987 703757286 702565968 701405466 700231373 699034214
3028.7 699034214 697873116 696735620 695479155 694044948 692622423 691305995 689942837 688383520
3045.1 688383520 686692953 685073197 683538318 681942046 680276215 678609490 676986694 675445139
3061.4 675445139 673973620 672542989 671087563 669532061 667930424 666421771 665074527 663794041
3077.7 663794041 662385523 660803914 659180701 657583475 656009436 654434562 652798295 651106775
3094F51106775j661837j574397j574994j705348j754940j653015j610279j759112j864791
3112.4F35948062j769662j728594j865089k076447k248943k265692k135873k020061
3128.7F19837701k073824k217233k193392k041876k061605k271593k401352k371490
3145F02205336k323508k205074k053678k219200k599716k699376k512753k374351k387464
3163.4E80830216k480387k565086k554476k487898k459586k474070k515077k533317
3179.7E60760319k526879k515912k459884k409577k454281k536237k547264k516926
3196E40793359k499401k474129k428949k388418k380848k397835k384305k323330k266168
3214.3E19249976k253533k276957k284527k264678k250612k220929k171278k102255
$$ plain form
3094 651106775 649444938 647870541 646295547 644590199 642835259 641182244 639571965 637812853 635948062
3112.4 635948062 634178400 632449806 630584717 628508270 626259327 623993635 621857762 619837701
3128.7 619837701 617763877 615546644 613353252 611311376 609249771 606978178 604576826 602205336
3145 602205336 599881828 597676754 595623076 593403876 590804160 588104784 585592031 583217680 580830216
3163.4 580830216 578349829 575784743 573230267 570742369 568282783 565808713 563293636 560760319
3179.7 560760319 558233440 555717528 553257644 550848067 548393786 545857549 543310285 540793359
3196 540793359 538293958 535819829 533390880 531002462 528621614 526223779 523839474 521516144 519249976
3214.3 519249976 516996443 514719486 512434959 510170281 507919669 505698740 503527462 501425207
3230.7E01425207k047271k135694k203405k064585j951457j948028j853526j748234
3247D85473007j849473j925826j773804j654506j718610j804501j796544j729905j677245
3265.3D69542593j608432j501143j542806j720548j813471j794905j710415j637518
3281.6D56213355j643836j668483j658440j629800j628875j688630j770556j832634
3298D42692101j815885j688302j581251j655430j872599k040833k054453j969576j903177
3316.3D26110595j919627j942664j889855j868725j976251k078921k030015j936763
3332.6D10467774j915634j884460j887322j983762k056807k099752k039046j878768
3348.9C94722223j964122k209365k203465j986175j828105j847535j869083j702427
$$ plain form
3230.7 501425207 499377936 497242242 495038837 492974252 491022795 489074767 487221241 485473007
3247 485473007 483623534 481697708 479923904 478269398 476550788 474746287 472949743 471219838 469542593
3265.3 469542593 467934161 466433018 464890212 463169664 461356193 459561288 457850873 456213355
3281.6 456213355 454569519 452901036 451242596 449612796 447983921 446295291 444524735 442692101
3298 442692101 440876216 439187914 437606663 435951233 434078634 432037801 429983348 428013772 426110595
3316.3 426110595 424190968 422248304 420358449 418489724 416513473 414434552 412404537 410467774
3332.6 410467774 408552140 406667680 404780358 402796596 400739789 398640037 396600991 394722223
3348.9 394722223 392758101 390548736 388345271 386359096 384530991 382683456 380814373 379111946
3365.3C79111946j601696j792014k022833j968503j669049j448601j407594j406819
3381.6C65794837j325219j153708q84503o07073o24270q97467r22203n55992l13163
3399.9C58511239n42819q19236o43134l21597k14607k06977k47955k58863q9795Q3536
3420.3C55249792J17272K62410N64456P25716O69718P27773Q88854Q08239O01709O54250
3440.7C61270189R22203J136214J257300J306176J413197J548886J624763J782894
3457C72261822J932115J823037J806021K157539K346725J985371J518845J611114K056390
3475.4C89498979K368450K331764K047508K043605K314210K319008K180785K278179
3491.7D07382488K470702K607435K537787K436221K498179K388627K199650K392798
$$ plain form
3365.3 379111946 377510250 375718236 373695403 371726900 370057851 368609250 367201656 365794837
3381.6 365794837 364469618 363315910 362431407 361824334 361200064 360302597 359380394 358824402 358511239
3399.9 358511239 357968420 357149184 356506050 356184453 355969846 355762869 355514914 355256051 355166256 355249792
3420.3 355249792 355367064 355629474 356193930 356919646 357589364 358317137 359205991 360014230 360615939 361270189
3440.7 361270189 362192392 363328606 364585906 365892082 367305279 368854165 370478928 372261822
3457 372261822 374193937 376016974 377822995 379980534 382327259 384312630 385831475 387442589 389498979
3475.4 389498979 391867429 394199193 396246701 398290306 400604516 402923524 405104309 407382488
3491.7 407382488 409853190 412460625 414998412 417434633 419932812 422321439 424521089 426913887
3508D26913887K747387K876937K732396K561242K671838K924561L163815L088772K767622
3526.4D52448457K767712L016174L181488L337800L401399L264874L346771L611654
3542.7D78376329L670037L428817L253608L419132L639131L652484L719031L981829
3559E07140398M055977L733516L658890M424036M743278M266083M189909M499852M685700
3577.4E45397639M800797M969418M937589M824758N010604N090476M799366M908621
3593.7E84739268N276859N412817N465805N486071N239129M993916N313039N586087
3610F27512991N559564N609095N274892N327284N961001N567551M728079M358172N195856
3628.4F75094485O007791N101859M793346M854322M677176M652858M561663M164755
$$ plain form
3508 426913887 429661274 432538211 435270607 437831849 440503687 443428248 446592063 449680835 452448457
3526.4 452448457 455216169 458232343 461413831 464751631 468153030 471417904 474764675 478376329
3542.7 478376329 482046366 485475183 488728791 492147923 495787054 499439538 503158569 507140398
3559 507140398 511196375 514929891 518588781 523012817 527756095 532022178 536212087 540711939 545397639
3577.4 545397639 550198436 555167854 560105443 564930201 569940805 575031281 579830647 584739268
3593.7 584739268 590016127 595428944 600894749 606380820 611619949 616613865 621926904 627512991
3610 627512991 633072555 638681650 643956542 649283826 655244827 660812378 665540457 669898629 675094485
3628.4 675094485 681102276 686204135 690997481 695851803 700528979 705181837 709743500 713908255
3644.7G13908255L989935M748762N058109L673494K998531L732503L835559L125309
3661G45070457K821863K797783K592623K687275K923906K192438K070367K451897K070009
3679.4G67678618J946092K024472J933694J927554J919151J583635J347840J348853
3695.7G81709909J298428J124382J173317J298845J137972R48370Q38518R20713J038015
3714G91488469R05096P54893O82473O79553O86705P36773P31468N71907N55455O77884
3734.4G98470676Q76486R17971M06087j61231K48671Q43465L08871J10448N28514N75662
3754.8H03125620M09305M11451M72128K91705K05458K58028K57373L32177L91543L78072
3775.2H06532860L56674L30269J88887O7175J69694K17021K44736L66211L45648L52382
$$ plain form
3644.7 713908255 717898190 722646952 727705061 731378555 734377086 738109589 741945148 745070457
3661 745070457 747892320 750690103 753282726 755970001 758893907 761086345 763156712 765608609 767678618
3679.4 767678618 769624710 771649182 773582876 775510430 777429581 779013216 780361056 781709909
3695.7 781709909 783008337 784132719 785306036 786604881 787742853 788691223 789529741 790450454 791488469
3714 791488469 792393565 793148458 793830931 794510484 795197189 795933962 796665430 797237337 797792792 798470676
3734.4 798470676 799347162 800265133 800671220 800509989 800758660 801602125 801910996 802021444 802549958 803125620
3754.8 803125620 803534925 803946376 804418504 804710209 804915667 805173695 805431068 805763245 806154788 806532860
3775.2 806532860 806889534 807219803 807408690 807475865 807645559 807862580 808107316 808473527 808819175 809171557
3795.6H09171557K82586m5001J13010L04878l9518M3988L51191K90453R4056K23398
3816H10790598L08633m2379k622J12176O8307J11639J16766K29358L10064J24275n1558
3838.4H12075257n2452r537J53304K72691J29223l21508n98848J17720N03778K43247
3858.8H12512875L5047K742J49429J1921j79649N6744K01404K03133M6670j34230O2705
3881.3H12968791J07169O0200J04964q6725j07824R8049P8619p0691j28746j81199
3901.7H12842607j39892P9573J03235K7358Q5116R4890k8431p5579j6033k3306J7405
3924.1H12966943J37210Q8274l9100Q34N1975k5391m8757k2769J5080P6532K7776k5451
3948.6H13203156L3677O6280N7161O9141N2929j2338k7061K1756N8115Q5592R2387
$$ plain form
3795.6 809171557 809454143 809409142 809522152 809827030 809787512 809831500 810182691 810473144 810567200 810790598
3816 810790598 811099231 811056852 811054230 811166406 811234713 811346352 811463118 811692476 812002540 812126815 812075257
3838.4 812075257 812022805 812013268 812166572 812439263 812568486 812246978 811648130 811765850 812269628 812512875
3858.8 812512875 812547922 812550664 812700093 812712014 812532365 812589109 812790513 812993646 813040316 812906086 812968791
3881.3 812968791 813075960 813136160 813241124 813154399 813046575 813144624 813223243 813152552 813023806 812842607
3901.7 812842607 812702715 812782288 812885523 812912881 812997997 813092887 813064456 812988877 812972844 812949538 812966943
3924.1 812966943 813104153 813192427 813153327 813154161 813206136 813180745 813131988 813109219 813124299 813200831 813228607 813203156
3948.6 813203156 813236833 813303113 813360274 813429415 813482344 813470006 813442945 813464701 813522816 813608408 813700795
3971H13700795Q5533Q8990O8128N7995J09017J42693Q6487j967l6895K4676J04725
3993.4H14430177J07169Q0586
3997.5H14617932
$$ plain form
3971 813700795 813786328 813875318 813943446 814001441 814110458 814253151 814339638 814337671 814300776 814325452 814430177
3993.4 814430177 814537346 814617932
3997.5 814617932
##END=$$ End of the data block
